{"text_format":"1","workbook":"xlsx","n_sheets":5,"sheets":["PREENCHER","Média 1º, 2º e 3º","Média 2º, 3º e 4º","Média 3º, 4º e 5º","Média 4º, 5º e 6º"],"not_rendered":{"charts":0,"images":0,"macros":1,"external_links":0,"defined_names":4,"comments":0,"pivot_tables":0},"unopened":[],"bounds":{"document_bytes":16777216,"sheet_cells":100000,"rows_first":2000,"rows_last":500,"rows_between":2000,"halvings":0,"cell_chars":16384,"cell_head_chars":4096},"cells_cut":0,"cells_raw":0,"read":"whole","date_system":"1900"}

{"sheet":"PREENCHER","index":0,"n_rows":12,"n_cols":61,"rows_kept":12,"cut":false,"hidden":false,"merged":[[1,0,1,25],[2,0,2,16],[2,18,3,25],[3,0,4,0],[3,1,4,1],[3,2,4,2],[3,3,4,3],[3,6,3,11],[3,12,3,13],[3,14,3,15],[3,16,4,16],[3,29,3,38],[3,40,3,49],[3,51,3,52],[3,56,3,60],[4,56,4,58],[4,59,4,60],[8,0,8,11],[8,12,8,13],[8,14,8,15],[10,0,10,16],[11,0,11,16]]}
[]
["PLANILHA DE ANÁLISE DE PREÇOS"]
["PREÇOS COMPARATIVOS",null,null,null,null,null,null,null,null,null,null,null,null,null,null,null,null,null,"ANÁLISE ESTATÍSTICA"]
["ITEM","ESPECIFICAÇÃO","UN","QTDE",null,null,null,null,null,null,null,null,"MÉDIA DOS VALORES PESQUISADOS (R$)",null,"VALOR CONTRATADO  (R$)",null,"OBSERVAÇÃO",null,null,null,null,null,null,null,null,null,null,null,null,"MENORES PREÇOS",null,null,null,null,null,null,null,null,null,null,"PREÇOS FORMATADO PARA TEXTO",null,null,null,null,null,null,null,null,null,null,"MÉDIA A SER UTILIZADA",null,null,null,null,"OBSERVAÇÕES"]
[null,null,null,null,"ESCADAS FIGUEIREDO","RM ESCADAS","MAGAZINE LUIZA",null,"BANCO DE PREÇOS (EMPRESA BRASILEIRA DE SERVIÇOS HOSPITALARES 01/10/2023)","BANCO DE PREÇOS (MINISTÉRIO DA DEFESA 11/07/2023)","BANCO DE PREÇOS (MINISTÉRIO DA DEFESA 26/04/2023)",null,"UNITÁRIO","TOTAL","UNITÁRIO","TOTAL",null,null,"NÚMERO DE COTAÇÕES AVALIADAS","NÚMERO DE COTAÇÕES UTILIZADAS","MENOR VALOR CONSIDERADO","MAIOR VALOR CONSIDERADO","MÉDIA","MEDIANA","DESVIO PADRÃO","COEFICIENTE DE VARIAÇÃO",null,null,null,"1º","2º","3º","4º","5º","6º","MÉDIA DO 1º, 2º E 3º","MÉDIA DO 2º, 3º E 4º","MÉDIA DO 3º, 4º E 5º","MÉDIA DO 4º, 5º E 6º",null,"PREÇO 1","PREÇO 2","PREÇO 3","PREÇO 4","PREÇO 5","PREÇO 6","PREÇO 7","PREÇO 8","PREÇO 9","PREÇO 10",null,"SEM ARRED","COM ARRED",null,"OBSERVAÇÃO",null,"MENOS DE TRÊS PREÇOS COMPARATIVOS VÁLIDOS",null,null,"PREÇO CONTRATADO É SUPERIOR AO PESQUISADO"]
[1,"ESCADA PLATAFORMA EM ALUMÍNIO, NR 12, CAPACIDADE MÍNIMA 150 KG, COM BASE FIXA E 2 RODAS TRASEIRAS PARA MOVIMENTAÇÃO. COM CORRIMÃO. ","UNIDADE",2,4970,4589.1,4569.72,null,4874.5,5474.98,4850,null,{"$f":"IF(ISERROR(ROUND(AVERAGE(E6:L6),2)),\"\",ROUND(AVERAGE(E6:L6),2))","v":4888.05},{"$f":"IF(ISERROR(ROUND(M6*D6,2)),\"\",ROUND(M6*D6,2))","v":9776.1},null,{"$f":"IF(A6=\"\",\"\",ROUND(O6*D6,2))","v":0},null,null,{"$f":"IF(ISERROR(COUNTA(E6:L6)),\"\",COUNTA(E6:L6))","v":6},{"$f":"IF(ISERROR(COUNT(E6:L6)),\"\",COUNT(E6:L6))","v":6},{"$f":"IF(ISERROR(MIN(E6:L6)),\"\",MIN(E6:L6))","v":4569.72},{"$f":"IF(ISERROR(MAX(E6:L6)),\"\",MAX(E6:L6))","v":5474.98},{"$f":"IF(ISERROR(ROUND(AVERAGE(E6:L6),2)),\"\",ROUND(AVERAGE(E6:L6),2))","v":4888.05},{"$f":"IF(ISERROR(MEDIAN(E6:L6)),\"\",MEDIAN(G6:L6))","v":4862.25},{"$f":"IF(ISERROR(STDEV(E6:L6)),\"\",STDEV(E6:L6))","v":329.708696821906},{"$f":"IF(ISERROR(Y6/W6),\"\",Y6/W6)","v":0.0674519894072087},null,null,null,{"$f":"IF(COUNT(G6:L6)<1,\"\",SMALL(G6:L6,1))","v":4569.72},{"$f":"IF(COUNT(G6:L6)<2,\"\",SMALL(G6:L6,2))","v":4850},{"$f":"IF(COUNT(G6:L6)<3,\"\",SMALL(G6:L6,3))","v":4874.5},{"$f":"IF(COUNT(G6:L6)<4,\"\",SMALL(G6:L6,4))","v":5474.98},{"$f":"IF(COUNT(G6:L6)<5,\"\",SMALL(G6:L6,5))","v":""},{"$f":"IF(COUNT(G6:L6)<6,\"\",SMALL(G6:L6,6))","v":""},{"$f":"IF(COUNT(G6:L6)<3,\"\",AVERAGE(AD6:AF6))","v":4764.74},{"$f":"IF(COUNT(G6:L6)<4,\"\",AVERAGE(AE6:AG6))","v":5066.49333333333},{"$f":"IF(COUNT(G6:L6)<5,\"\",AVERAGE(AF6:AH6))","v":""},{"$f":"IF(COUNT(G6:L6)<6,\"\",AVERAGE(AG6:AI6))","v":""},null,{"$f":"IF(#REF!>=1000,TEXT(#REF!,\"0.000,00\"),TEXT(#REF!,\"0,00\"))","v":{"$error":"#REF!"}},{"$f":"IF(G6>=1000,TEXT(G6,\"0.000,00\"),TEXT(G6,\"0,00\"))","v":"4.569,72"},{"$f":"IF(#REF!>=1000,TEXT(#REF!,\"0.000,00\"),TEXT(#REF!,\"0,00\"))","v":{"$error":"#REF!"}},{"$f":"IF(#REF!>=1000,TEXT(#REF!,\"0.000,00\"),TEXT(#REF!,\"0,00\"))","v":{"$error":"#REF!"}},{"$f":"IF(#REF!>=1000,TEXT(#REF!,\"0.000,00\"),TEXT(#REF!,\"0,00\"))","v":{"$error":"#REF!"}},{"$f":"IF(#REF!>=1000,TEXT(#REF!,\"0.000,00\"),TEXT(#REF!,\"0,00\"))","v":{"$error":"#REF!"}},{"$f":"IF(#REF!>=1000,TEXT(#REF!,\"0.000,00\"),TEXT(#REF!,\"0,00\"))","v":{"$error":"#REF!"}},{"$f":"IF(#REF!>=1000,TEXT(#REF!,\"0.000,00\"),TEXT(#REF!,\"0,00\"))","v":{"$error":"#REF!"}},{"$f":"IF(#REF!>=1000,TEXT(#REF!,\"0.000,00\"),TEXT(#REF!,\"0,00\"))","v":{"$error":"#REF!"}},{"$f":"IF(#REF!>=1000,TEXT(#REF!,\"0.000,00\"),TEXT(#REF!,\"0,00\"))","v":{"$error":"#REF!"}},null,{"$f":"IF(PREENCHER!AJ6=\"\",#REF!,IF(PREENCHER!AK6=\"\",#REF!,IF(PREENCHER!AL6=\"\",#REF!,IF(STDEV(PREENCHER!$AD6:$AF6)/AVERAGE(PREENCHER!$AD6:$AF6)>#REF!,IF(STDEV(PREENCHER!$AE6:$AG6)/AVERAGE(PREENCHER!$AE6:$AG6)>#REF!,IF(STDEV(PREENCHER!$AF6:$AH6)/AVERAGE(PREENCHER!$AF6:$AH6)>#REF!,IF(STDEV(PREENCHER!$AG6:$AI6)/AVERAGE(PREENCHER!$AG6:$AI6)>#REF!,#REF!,AVERAGE(PREENCHER!$AG6:$AI6)),AVERAGE(PREENCHER!$AF6:$AH6)),AVERAGE(PREENCHER!$AE6:$AG6)),AVERAGE(PREENCHER!$AD6:$AF6)))))","v":{"$error":"#REF!"}},{"$f":"IF(ISERROR(ROUND(AZ6,2)),\"\",ROUND(AZ6,2))","v":""},null," Valor desconsiderado do cálculo da média comparativa.",null,{"$f":"IF(ISERROR(IF(COUNT(G6:L6)=2,\"Apenas dois preços comparativos válidos. \",\"\")),\"\",IF(COUNT(G6:L6)=2,\"Apenas dois preços comparativos válidos. \",\"\"))","v":""},{"$f":"IF(ISERROR(IF(COUNT(G6:L6)=1,\"Apenas um preço comparativo válido. \",\"\")),\"\",IF(COUNT(G6:L6)=1,\"Apenas um preço comparativo válido. \",\"\"))","v":""},{"$f":"IF(A6=\"\",\"\",IF(ISERROR(IF(COUNT(G6:L6)=0,\"Nenhum preço comparativo válido. \",\"\")),\"\",IF(COUNT(G6:L6)=0,\"Nenhum preço comparativo válido. \",\"\")))","v":""},{"$f":"IF(ISERROR(IF(P6>N6,(P6-N6)/N6,\"\")),\"\",IF(P6>N6,(P6-N6)/N6,\"\"))","v":""},{"$f":"IF(ISERROR(IF(BH6=\"\",\"\",\"Neste item, o valor contratado pelo TJDFT é \"&TEXT(BH6,\"0,00%\")&\" superior à média comparativa.\")),\"\",IF(BH6=\"\",\"\",\"Neste item, o valor contratado pelo TJDFT é \"&TEXT(BH6,\"0,00%\")&\" superior à média comparativa.\"))","v":""}]
[2,null,"GRAMAS",0,null,null,null,null,null,null,null,null,{"$f":"IF(ISERROR(ROUND(AVERAGE(E7:L7),2)),\"\",ROUND(AVERAGE(E7:L7),2))","v":""},{"$f":"IF(ISERROR(ROUND(M7*D7,2)),\"\",ROUND(M7*D7,2))","v":""},null,{"$f":"IF(A7=\"\",\"\",ROUND(O7*D7,2))","v":0},null,null,{"$f":"IF(ISERROR(COUNTA(E7:L7)),\"\",COUNTA(E7:L7))","v":0},{"$f":"IF(ISERROR(COUNT(E7:L7)),\"\",COUNT(E7:L7))","v":0},{"$f":"IF(ISERROR(MIN(E7:L7)),\"\",MIN(E7:L7))","v":0},{"$f":"IF(ISERROR(MAX(E7:L7)),\"\",MAX(E7:L7))","v":0},{"$f":"IF(ISERROR(ROUND(AVERAGE(E7:L7),2)),\"\",ROUND(AVERAGE(E7:L7),2))","v":""},{"$f":"IF(ISERROR(MEDIAN(E7:L7)),\"\",MEDIAN(E7:L7))","v":""},{"$f":"IF(ISERROR(STDEV(E7:L7)),\"\",STDEV(E7:L7))","v":""},{"$f":"IF(ISERROR(Y7/W7),\"\",Y7/W7)","v":""},null,null,null,{"$f":"IF(COUNT(G7:L7)<1,\"\",SMALL(G7:L7,1))","v":""},{"$f":"IF(COUNT(G7:L7)<2,\"\",SMALL(G7:L7,2))","v":""},{"$f":"IF(COUNT(G7:L7)<3,\"\",SMALL(G7:L7,3))","v":""},{"$f":"IF(COUNT(G7:L7)<4,\"\",SMALL(G7:L7,4))","v":""},{"$f":"IF(COUNT(G7:L7)<5,\"\",SMALL(G7:L7,5))","v":""},{"$f":"IF(COUNT(G7:L7)<6,\"\",SMALL(G7:L7,6))","v":""},{"$f":"IF(COUNT(G7:L7)<3,\"\",AVERAGE(AD7:AF7))","v":""},{"$f":"IF(COUNT(G7:L7)<4,\"\",AVERAGE(AE7:AG7))","v":""},{"$f":"IF(COUNT(G7:L7)<5,\"\",AVERAGE(AF7:AH7))","v":""},{"$f":"IF(COUNT(G7:L7)<6,\"\",AVERAGE(AG7:AI7))","v":""},null,{"$f":"IF(#REF!>=1000,TEXT(#REF!,\"0.000,00\"),TEXT(#REF!,\"0,00\"))","v":{"$error":"#REF!"}},{"$f":"IF(G7>=1000,TEXT(G7,\"0.000,00\"),TEXT(G7,\"0,00\"))","v":"0,00"},{"$f":"IF(#REF!>=1000,TEXT(#REF!,\"0.000,00\"),TEXT(#REF!,\"0,00\"))","v":{"$error":"#REF!"}},{"$f":"IF(#REF!>=1000,TEXT(#REF!,\"0.000,00\"),TEXT(#REF!,\"0,00\"))","v":{"$error":"#REF!"}},{"$f":"IF(#REF!>=1000,TEXT(#REF!,\"0.000,00\"),TEXT(#REF!,\"0,00\"))","v":{"$error":"#REF!"}},{"$f":"IF(#REF!>=1000,TEXT(#REF!,\"0.000,00\"),TEXT(#REF!,\"0,00\"))","v":{"$error":"#REF!"}},{"$f":"IF(#REF!>=1000,TEXT(#REF!,\"0.000,00\"),TEXT(#REF!,\"0,00\"))","v":{"$error":"#REF!"}},{"$f":"IF(#REF!>=1000,TEXT(#REF!,\"0.000,00\"),TEXT(#REF!,\"0,00\"))","v":{"$error":"#REF!"}},{"$f":"IF(#REF!>=1000,TEXT(#REF!,\"0.000,00\"),TEXT(#REF!,\"0,00\"))","v":{"$error":"#REF!"}},{"$f":"IF(#REF!>=1000,TEXT(#REF!,\"0.000,00\"),TEXT(#REF!,\"0,00\"))","v":{"$error":"#REF!"}},null,{"$f":"IF(PREENCHER!AJ7=\"\",#REF!,IF(PREENCHER!AK7=\"\",#REF!,IF(PREENCHER!AL7=\"\",#REF!,IF(STDEV(PREENCHER!$AD7:$AF7)/AVERAGE(PREENCHER!$AD7:$AF7)>#REF!,IF(STDEV(PREENCHER!$AE7:$AG7)/AVERAGE(PREENCHER!$AE7:$AG7)>#REF!,IF(STDEV(PREENCHER!$AF7:$AH7)/AVERAGE(PREENCHER!$AF7:$AH7)>#REF!,IF(STDEV(PREENCHER!$AG7:$AI7)/AVERAGE(PREENCHER!$AG7:$AI7)>#REF!,#REF!,AVERAGE(PREENCHER!$AG7:$AI7)),AVERAGE(PREENCHER!$AF7:$AH7)),AVERAGE(PREENCHER!$AE7:$AG7)),AVERAGE(PREENCHER!$AD7:$AF7)))))","v":{"$error":"#REF!"}},{"$f":"IF(ISERROR(ROUND(AZ7,2)),\"\",ROUND(AZ7,2))","v":""},null,null,null,{"$f":"IF(ISERROR(IF(COUNT(G7:L7)=2,\"Apenas dois preços comparativos válidos. \",\"\")),\"\",IF(COUNT(G7:L7)=2,\"Apenas dois preços comparativos válidos. \",\"\"))","v":""},{"$f":"IF(ISERROR(IF(COUNT(G7:L7)=1,\"Apenas um preço comparativo válido. \",\"\")),\"\",IF(COUNT(G7:L7)=1,\"Apenas um preço comparativo válido. \",\"\"))","v":""},{"$f":"IF(A7=\"\",\"\",IF(ISERROR(IF(COUNT(G7:L7)=0,\"Nenhum preço comparativo válido. \",\"\")),\"\",IF(COUNT(G7:L7)=0,\"Nenhum preço comparativo válido. \",\"\")))","v":"Nenhum preço comparativo válido. "},{"$f":"IF(ISERROR(IF(P7>N7,(P7-N7)/N7,\"\")),\"\",IF(P7>N7,(P7-N7)/N7,\"\"))","v":""},{"$f":"IF(ISERROR(IF(BH7=\"\",\"\",\"Neste item, o valor contratado pelo TJDFT é \"&TEXT(BH7,\"0,00%\")&\" superior à média comparativa.\")),\"\",IF(BH7=\"\",\"\",\"Neste item, o valor contratado pelo TJDFT é \"&TEXT(BH7,\"0,00%\")&\" superior à média comparativa.\"))","v":""}]
[3,null,"GRAMAS",0,null,null,null,null,null,null,null,null,{"$f":"IF(ISERROR(ROUND(AVERAGE(E8:L8),2)),\"\",ROUND(AVERAGE(E8:L8),2))","v":""},{"$f":"IF(ISERROR(ROUND(M8*D8,2)),\"\",ROUND(M8*D8,2))","v":""},null,{"$f":"IF(A8=\"\",\"\",ROUND(O8*D8,2))","v":0},null,null,{"$f":"IF(ISERROR(COUNTA(E8:L8)),\"\",COUNTA(E8:L8))","v":0},{"$f":"IF(ISERROR(COUNT(E8:L8)),\"\",COUNT(E8:L8))","v":0},{"$f":"IF(ISERROR(MIN(E8:L8)),\"\",MIN(E8:L8))","v":0},{"$f":"IF(ISERROR(MAX(E8:L8)),\"\",MAX(E8:L8))","v":0},{"$f":"IF(ISERROR(ROUND(AVERAGE(E8:L8),2)),\"\",ROUND(AVERAGE(E8:L8),2))","v":""},{"$f":"IF(ISERROR(MEDIAN(E8:L8)),\"\",MEDIAN(E8:L8))","v":""},{"$f":"IF(ISERROR(STDEV(E8:L8)),\"\",STDEV(E8:L8))","v":""},{"$f":"IF(ISERROR(Y8/W8),\"\",Y8/W8)","v":""},null,null,null,{"$f":"IF(COUNT(G8:L8)<1,\"\",SMALL(G8:L8,1))","v":""},{"$f":"IF(COUNT(G8:L8)<2,\"\",SMALL(G8:L8,2))","v":""},{"$f":"IF(COUNT(G8:L8)<3,\"\",SMALL(G8:L8,3))","v":""},{"$f":"IF(COUNT(G8:L8)<4,\"\",SMALL(G8:L8,4))","v":""},{"$f":"IF(COUNT(G8:L8)<5,\"\",SMALL(G8:L8,5))","v":""},{"$f":"IF(COUNT(G8:L8)<6,\"\",SMALL(G8:L8,6))","v":""},{"$f":"IF(COUNT(G8:L8)<3,\"\",AVERAGE(AD8:AF8))","v":""},{"$f":"IF(COUNT(G8:L8)<4,\"\",AVERAGE(AE8:AG8))","v":""},{"$f":"IF(COUNT(G8:L8)<5,\"\",AVERAGE(AF8:AH8))","v":""},{"$f":"IF(COUNT(G8:L8)<6,\"\",AVERAGE(AG8:AI8))","v":""},null,{"$f":"IF(#REF!>=1000,TEXT(#REF!,\"0.000,00\"),TEXT(#REF!,\"0,00\"))","v":{"$error":"#REF!"}},{"$f":"IF(G8>=1000,TEXT(G8,\"0.000,00\"),TEXT(G8,\"0,00\"))","v":"0,00"},{"$f":"IF(#REF!>=1000,TEXT(#REF!,\"0.000,00\"),TEXT(#REF!,\"0,00\"))","v":{"$error":"#REF!"}},{"$f":"IF(#REF!>=1000,TEXT(#REF!,\"0.000,00\"),TEXT(#REF!,\"0,00\"))","v":{"$error":"#REF!"}},{"$f":"IF(#REF!>=1000,TEXT(#REF!,\"0.000,00\"),TEXT(#REF!,\"0,00\"))","v":{"$error":"#REF!"}},{"$f":"IF(#REF!>=1000,TEXT(#REF!,\"0.000,00\"),TEXT(#REF!,\"0,00\"))","v":{"$error":"#REF!"}},{"$f":"IF(#REF!>=1000,TEXT(#REF!,\"0.000,00\"),TEXT(#REF!,\"0,00\"))","v":{"$error":"#REF!"}},{"$f":"IF(#REF!>=1000,TEXT(#REF!,\"0.000,00\"),TEXT(#REF!,\"0,00\"))","v":{"$error":"#REF!"}},{"$f":"IF(#REF!>=1000,TEXT(#REF!,\"0.000,00\"),TEXT(#REF!,\"0,00\"))","v":{"$error":"#REF!"}},{"$f":"IF(#REF!>=1000,TEXT(#REF!,\"0.000,00\"),TEXT(#REF!,\"0,00\"))","v":{"$error":"#REF!"}},null,{"$f":"IF(PREENCHER!AJ8=\"\",#REF!,IF(PREENCHER!AK8=\"\",#REF!,IF(PREENCHER!AL8=\"\",#REF!,IF(STDEV(PREENCHER!$AD8:$AF8)/AVERAGE(PREENCHER!$AD8:$AF8)>#REF!,IF(STDEV(PREENCHER!$AE8:$AG8)/AVERAGE(PREENCHER!$AE8:$AG8)>#REF!,IF(STDEV(PREENCHER!$AF8:$AH8)/AVERAGE(PREENCHER!$AF8:$AH8)>#REF!,IF(STDEV(PREENCHER!$AG8:$AI8)/AVERAGE(PREENCHER!$AG8:$AI8)>#REF!,#REF!,AVERAGE(PREENCHER!$AG8:$AI8)),AVERAGE(PREENCHER!$AF8:$AH8)),AVERAGE(PREENCHER!$AE8:$AG8)),AVERAGE(PREENCHER!$AD8:$AF8)))))","v":{"$error":"#REF!"}},{"$f":"IF(ISERROR(ROUND(AZ8,2)),\"\",ROUND(AZ8,2))","v":""},null,null,null,{"$f":"IF(ISERROR(IF(COUNT(G8:L8)=2,\"Apenas dois preços comparativos válidos. \",\"\")),\"\",IF(COUNT(G8:L8)=2,\"Apenas dois preços comparativos válidos. \",\"\"))","v":""},{"$f":"IF(ISERROR(IF(COUNT(G8:L8)=1,\"Apenas um preço comparativo válido. \",\"\")),\"\",IF(COUNT(G8:L8)=1,\"Apenas um preço comparativo válido. \",\"\"))","v":""},{"$f":"IF(A8=\"\",\"\",IF(ISERROR(IF(COUNT(G8:L8)=0,\"Nenhum preço comparativo válido. \",\"\")),\"\",IF(COUNT(G8:L8)=0,\"Nenhum preço comparativo válido. \",\"\")))","v":"Nenhum preço comparativo válido. "},{"$f":"IF(ISERROR(IF(P8>N8,(P8-N8)/N8,\"\")),\"\",IF(P8>N8,(P8-N8)/N8,\"\"))","v":""},{"$f":"IF(ISERROR(IF(BH8=\"\",\"\",\"Neste item, o valor contratado pelo TJDFT é \"&TEXT(BH8,\"0,00%\")&\" superior à média comparativa.\")),\"\",IF(BH8=\"\",\"\",\"Neste item, o valor contratado pelo TJDFT é \"&TEXT(BH8,\"0,00%\")&\" superior à média comparativa.\"))","v":""}]
[null,null,null,null,null,null,null,null,null,null,null,null,{"$f":"IF(SUM(N6:N8)=0,\"\",SUM(N6:N8))","v":9776.1},null,{"$f":"IF(SUM(P6:P8)=0,\"\",SUM(P6:P8))","v":""},null,{"$f":"IF(ISERROR(IF(BH9=\"\",\"\",\"No total, o valor contratado pelo TJDFT é \"&TEXT(BH9,\"0,00%\")&\" superior à média comparativa.\")),\"\",IF(BH9=\"\",\"\",\"No total, o valor contratado pelo TJDFT é \"&TEXT(BH9,\"0,00%\")&\" superior à média comparativa.\"))","v":""},null,null,null,null,null,null,null,null,null,null,null,null,null,null,null,null,null,null,null,null,null,null,null,null,null,null,null,null,null,null,null,null,null,null,null,null,null,null,null,null,null,null,{"$f":"IF(ISERROR(IF(O9>M9,(O9-M9)/M9,\"\")),\"\",IF(O9>M9,(O9-M9)/M9,\"\"))","v":""},{"$f":"IF(ISERROR(IF(BH9=\"\",\"\",\"Neste item, o valor contratado pelo TJDFT é \"&TEXT(BH9,\"0,00%\")&\" superior à média comparativa.\")),\"\",IF(BH9=\"\",\"\",\"Neste item, o valor contratado pelo TJDFT é \"&TEXT(BH9,\"0,00%\")&\" superior à média comparativa.\"))","v":""}]
[]
[]
["NOTA: O objetivo desta análise é incluir no cálculo da média todos os preços cujo coeficiente de variação  não ultrapasse 25%, para mais ou para menos, em relação à mediana dos preços pesquisados. Quando essa condição não é atendida o preço será desconsiderado."]

{"sheet":"Média 1º, 2º e 3º","index":1,"n_rows":68,"n_cols":21,"rows_kept":68,"cut":false,"hidden":true,"merged":[[5,18,5,20],[67,0,67,14]]}
[]
[]
[]
[]
[]
[null,null,null,null,null,null,null,null,null,null,null,null,null,null,null,null,null,null,"ANÁLISE ESTATÍSTICA"]
[{"$f":"PREENCHER!A4","v":"ITEM"},{"$f":"PREENCHER!B4","v":"ESPECIFICAÇÃO"},{"$f":"PREENCHER!C4","v":"UN"},{"$f":"PREENCHER!D4","v":"QTDE"},{"$f":"preencher!#ref!","v":{"$error":"#NAME?"}},{"$f":"preencher!#ref!","v":{"$error":"#NAME?"}},{"$f":"PREENCHER!G5","v":"MAGAZINE LUIZA"},{"$f":"preencher!#ref!","v":{"$error":"#NAME?"}},{"$f":"preencher!#ref!","v":{"$error":"#NAME?"}},{"$f":"preencher!#ref!","v":{"$error":"#NAME?"}},{"$f":"preencher!#ref!","v":{"$error":"#NAME?"}},{"$f":"preencher!#ref!","v":{"$error":"#NAME?"}},{"$f":"preencher!#ref!","v":{"$error":"#NAME?"}},{"$f":"preencher!#ref!","v":{"$error":"#NAME?"}},{"$f":"PREENCHER!M5","v":"UNITÁRIO"},{"$f":"PREENCHER!N5","v":"TOTAL"},{"$f":"PREENCHER!Q4","v":"OBSERVAÇÃO"},null,"MEDIANA","DESVIO PADRÃO","COEFICIENTE DE VARIAÇÃO"]
[{"$f":"IF(PREENCHER!A6=\"\",\"\",PREENCHER!A6)","v":1},{"$f":"IF(PREENCHER!B6=\"\",\"\",PREENCHER!B6)","v":"ESCADA PLATAFORMA EM ALUMÍNIO, NR 12, CAPACIDADE MÍNIMA 150 KG, COM BASE FIXA E 2 RODAS TRASEIRAS PARA MOVIMENTAÇÃO. COM CORRIMÃO. "},{"$f":"IF(PREENCHER!C6=\"\",\"\",PREENCHER!C6)","v":"UNIDADE"},{"$f":"IF(PREENCHER!D6=\"\",\"\",PREENCHER!D6)","v":2},{"$f":"IF(preencher!#ref!=\"\",\"\",IF(COUNTIF(PREENCHER!$AD6:$AF6,preencher!#ref!)=0,CONCATENATE(PREENCHER!AO6,#REF!),preencher!#ref!))","v":{"$error":"#NAME?"}},{"$f":"IF(PREENCHER!G6=\"\",\"\",IF(COUNTIF(PREENCHER!$AD6:$AF6,PREENCHER!G6)=0,CONCATENATE(PREENCHER!AP6,#REF!),PREENCHER!G6))","v":4569.72},{"$f":"IF(preencher!#ref!=\"\",\"\",IF(COUNTIF(PREENCHER!$AD6:$AF6,preencher!#ref!)=0,CONCATENATE(PREENCHER!AQ6,#REF!),preencher!#ref!))","v":{"$error":"#NAME?"}},{"$f":"IF(preencher!#ref!=\"\",\"\",IF(COUNTIF(PREENCHER!$AD6:$AF6,preencher!#ref!)=0,CONCATENATE(PREENCHER!AR6,#REF!),preencher!#ref!))","v":{"$error":"#NAME?"}},{"$f":"IF(preencher!#ref!=\"\",\"\",IF(COUNTIF(PREENCHER!$AD6:$AF6,preencher!#ref!)=0,CONCATENATE(PREENCHER!AS6,#REF!),preencher!#ref!))","v":{"$error":"#NAME?"}},{"$f":"IF(preencher!#ref!=\"\",\"\",IF(COUNTIF(PREENCHER!$AD6:$AF6,preencher!#ref!)=0,CONCATENATE(PREENCHER!AT6,#REF!),preencher!#ref!))","v":{"$error":"#NAME?"}},{"$f":"IF(preencher!#ref!=\"\",\"\",IF(COUNTIF(PREENCHER!$AD6:$AF6,preencher!#ref!)=0,CONCATENATE(PREENCHER!AU6,#REF!),preencher!#ref!))","v":{"$error":"#NAME?"}},{"$f":"IF(preencher!#ref!=\"\",\"\",IF(COUNTIF(PREENCHER!$AD6:$AF6,preencher!#ref!)=0,CONCATENATE(PREENCHER!AV6,#REF!),preencher!#ref!))","v":{"$error":"#NAME?"}},{"$f":"IF(preencher!#ref!=\"\",\"\",IF(COUNTIF(PREENCHER!$AD6:$AF6,preencher!#ref!)=0,CONCATENATE(PREENCHER!AW6,#REF!),preencher!#ref!))","v":{"$error":"#NAME?"}},{"$f":"IF(preencher!#ref!=\"\",\"\",IF(COUNTIF(PREENCHER!$AD6:$AF6,preencher!#ref!)=0,CONCATENATE(PREENCHER!AX6,#REF!),preencher!#ref!))","v":{"$error":"#NAME?"}},{"$f":"IF(ISERROR(ROUND(AVERAGE(E8:N8),2)),\"\",ROUND(AVERAGE(E8:N8),2))","v":""},{"$f":"IF(ISERROR(ROUND(O8*D8,2)),\"\",ROUND(O8*D8,2))","v":""},null,null,{"$f":"IF(ISERROR(MEDIAN(E8:N8)),\"\",MEDIAN(E8:N8))","v":""},{"$f":"IF(ISERROR(STDEV(E8:N8)),\"\",STDEV(E8:N8))","v":""},{"$f":"IF(ISERROR(T8/O8),\"\",T8/O8)","v":""}]
[{"$f":"IF(PREENCHER!A7=\"\",\"\",PREENCHER!A7)","v":2},{"$f":"IF(PREENCHER!B7=\"\",\"\",PREENCHER!B7)","v":""},{"$f":"IF(PREENCHER!C7=\"\",\"\",PREENCHER!C7)","v":"GRAMAS"},{"$f":"IF(PREENCHER!D7=\"\",\"\",PREENCHER!D7)","v":0},{"$f":"IF(preencher!#ref!=\"\",\"\",IF(COUNTIF(PREENCHER!$AD7:$AF7,preencher!#ref!)=0,CONCATENATE(PREENCHER!AO7,#REF!),preencher!#ref!))","v":{"$error":"#NAME?"}},{"$f":"IF(PREENCHER!G7=\"\",\"\",IF(COUNTIF(PREENCHER!$AD7:$AF7,PREENCHER!G7)=0,CONCATENATE(PREENCHER!AP7,#REF!),PREENCHER!G7))","v":""},{"$f":"IF(preencher!#ref!=\"\",\"\",IF(COUNTIF(PREENCHER!$AD7:$AF7,preencher!#ref!)=0,CONCATENATE(PREENCHER!AQ7,#REF!),preencher!#ref!))","v":{"$error":"#NAME?"}},{"$f":"IF(preencher!#ref!=\"\",\"\",IF(COUNTIF(PREENCHER!$AD7:$AF7,preencher!#ref!)=0,CONCATENATE(PREENCHER!AR7,#REF!),preencher!#ref!))","v":{"$error":"#NAME?"}},{"$f":"IF(preencher!#ref!=\"\",\"\",IF(COUNTIF(PREENCHER!$AD7:$AF7,preencher!#ref!)=0,CONCATENATE(PREENCHER!AS7,#REF!),preencher!#ref!))","v":{"$error":"#NAME?"}},{"$f":"IF(preencher!#ref!=\"\",\"\",IF(COUNTIF(PREENCHER!$AD7:$AF7,preencher!#ref!)=0,CONCATENATE(PREENCHER!AT7,#REF!),preencher!#ref!))","v":{"$error":"#NAME?"}},{"$f":"IF(preencher!#ref!=\"\",\"\",IF(COUNTIF(PREENCHER!$AD7:$AF7,preencher!#ref!)=0,CONCATENATE(PREENCHER!AU7,#REF!),preencher!#ref!))","v":{"$error":"#NAME?"}},{"$f":"IF(preencher!#ref!=\"\",\"\",IF(COUNTIF(PREENCHER!$AD7:$AF7,preencher!#ref!)=0,CONCATENATE(PREENCHER!AV7,#REF!),preencher!#ref!))","v":{"$error":"#NAME?"}},{"$f":"IF(preencher!#ref!=\"\",\"\",IF(COUNTIF(PREENCHER!$AD7:$AF7,preencher!#ref!)=0,CONCATENATE(PREENCHER!AW7,#REF!),preencher!#ref!))","v":{"$error":"#NAME?"}},{"$f":"IF(preencher!#ref!=\"\",\"\",IF(COUNTIF(PREENCHER!$AD7:$AF7,preencher!#ref!)=0,CONCATENATE(PREENCHER!AX7,#REF!),preencher!#ref!))","v":{"$error":"#NAME?"}},{"$f":"IF(ISERROR(ROUND(AVERAGE(E9:N9),2)),\"\",ROUND(AVERAGE(E9:N9),2))","v":""},{"$f":"IF(ISERROR(ROUND(O9*D9,2)),\"\",ROUND(O9*D9,2))","v":""},null,null,{"$f":"IF(ISERROR(MEDIAN(E9:N9)),\"\",MEDIAN(E9:N9))","v":""},{"$f":"IF(ISERROR(STDEV(E9:N9)),\"\",STDEV(E9:N9))","v":""},{"$f":"IF(ISERROR(T9/O9),\"\",T9/O9)","v":""}]
[{"$f":"IF(PREENCHER!A8=\"\",\"\",PREENCHER!A8)","v":3},{"$f":"IF(PREENCHER!B8=\"\",\"\",PREENCHER!B8)","v":""},{"$f":"IF(PREENCHER!C8=\"\",\"\",PREENCHER!C8)","v":"GRAMAS"},{"$f":"IF(PREENCHER!D8=\"\",\"\",PREENCHER!D8)","v":0},{"$f":"IF(preencher!#ref!=\"\",\"\",IF(COUNTIF(PREENCHER!$AD8:$AF8,preencher!#ref!)=0,CONCATENATE(PREENCHER!AO8,#REF!),preencher!#ref!))","v":{"$error":"#NAME?"}},{"$f":"IF(PREENCHER!G8=\"\",\"\",IF(COUNTIF(PREENCHER!$AD8:$AF8,PREENCHER!G8)=0,CONCATENATE(PREENCHER!AP8,#REF!),PREENCHER!G8))","v":""},{"$f":"IF(preencher!#ref!=\"\",\"\",IF(COUNTIF(PREENCHER!$AD8:$AF8,preencher!#ref!)=0,CONCATENATE(PREENCHER!AQ8,#REF!),preencher!#ref!))","v":{"$error":"#NAME?"}},{"$f":"IF(preencher!#ref!=\"\",\"\",IF(COUNTIF(PREENCHER!$AD8:$AF8,preencher!#ref!)=0,CONCATENATE(PREENCHER!AR8,#REF!),preencher!#ref!))","v":{"$error":"#NAME?"}},{"$f":"IF(preencher!#ref!=\"\",\"\",IF(COUNTIF(PREENCHER!$AD8:$AF8,preencher!#ref!)=0,CONCATENATE(PREENCHER!AS8,#REF!),preencher!#ref!))","v":{"$error":"#NAME?"}},{"$f":"IF(preencher!#ref!=\"\",\"\",IF(COUNTIF(PREENCHER!$AD8:$AF8,preencher!#ref!)=0,CONCATENATE(PREENCHER!AT8,#REF!),preencher!#ref!))","v":{"$error":"#NAME?"}},{"$f":"IF(preencher!#ref!=\"\",\"\",IF(COUNTIF(PREENCHER!$AD8:$AF8,preencher!#ref!)=0,CONCATENATE(PREENCHER!AU8,#REF!),preencher!#ref!))","v":{"$error":"#NAME?"}},{"$f":"IF(preencher!#ref!=\"\",\"\",IF(COUNTIF(PREENCHER!$AD8:$AF8,preencher!#ref!)=0,CONCATENATE(PREENCHER!AV8,#REF!),preencher!#ref!))","v":{"$error":"#NAME?"}},{"$f":"IF(preencher!#ref!=\"\",\"\",IF(COUNTIF(PREENCHER!$AD8:$AF8,preencher!#ref!)=0,CONCATENATE(PREENCHER!AW8,#REF!),preencher!#ref!))","v":{"$error":"#NAME?"}},{"$f":"IF(preencher!#ref!=\"\",\"\",IF(COUNTIF(PREENCHER!$AD8:$AF8,preencher!#ref!)=0,CONCATENATE(PREENCHER!AX8,#REF!),preencher!#ref!))","v":{"$error":"#NAME?"}},{"$f":"IF(ISERROR(ROUND(AVERAGE(E10:N10),2)),\"\",ROUND(AVERAGE(E10:N10),2))","v":""},{"$f":"IF(ISERROR(ROUND(O10*D10,2)),\"\",ROUND(O10*D10,2))","v":""},null,null,{"$f":"IF(ISERROR(MEDIAN(E10:N10)),\"\",MEDIAN(E10:N10))","v":""},{"$f":"IF(ISERROR(STDEV(E10:N10)),\"\",STDEV(E10:N10))","v":""},{"$f":"IF(ISERROR(T10/O10),\"\",T10/O10)","v":""}]
[{"$f":"IF(preencher!#ref!=\"\",\"\",preencher!#ref!)","v":{"$error":"#NAME?"}},{"$f":"IF(preencher!#ref!=\"\",\"\",preencher!#ref!)","v":{"$error":"#NAME?"}},{"$f":"IF(preencher!#ref!=\"\",\"\",preencher!#ref!)","v":{"$error":"#NAME?"}},{"$f":"IF(preencher!#ref!=\"\",\"\",preencher!#ref!)","v":{"$error":"#NAME?"}},{"$f":"IF(preencher!#ref!=\"\",\"\",IF(COUNTIF(preencher!#ref!,preencher!#ref!)=0,CONCATENATE(preencher!#ref!,#REF!),preencher!#ref!))","v":{"$error":"#NAME?"}},{"$f":"IF(preencher!#ref!=\"\",\"\",IF(COUNTIF(preencher!#ref!,preencher!#ref!)=0,CONCATENATE(preencher!#ref!,#REF!),preencher!#ref!))","v":{"$error":"#NAME?"}},{"$f":"IF(preencher!#ref!=\"\",\"\",IF(COUNTIF(preencher!#ref!,preencher!#ref!)=0,CONCATENATE(preencher!#ref!,#REF!),preencher!#ref!))","v":{"$error":"#NAME?"}},{"$f":"IF(preencher!#ref!=\"\",\"\",IF(COUNTIF(preencher!#ref!,preencher!#ref!)=0,CONCATENATE(preencher!#ref!,#REF!),preencher!#ref!))","v":{"$error":"#NAME?"}},{"$f":"IF(preencher!#ref!=\"\",\"\",IF(COUNTIF(preencher!#ref!,preencher!#ref!)=0,CONCATENATE(preencher!#ref!,#REF!),preencher!#ref!))","v":{"$error":"#NAME?"}},{"$f":"IF(preencher!#ref!=\"\",\"\",IF(COUNTIF(preencher!#ref!,preencher!#ref!)=0,CONCATENATE(preencher!#ref!,#REF!),preencher!#ref!))","v":{"$error":"#NAME?"}},{"$f":"IF(preencher!#ref!=\"\",\"\",IF(COUNTIF(preencher!#ref!,preencher!#ref!)=0,CONCATENATE(preencher!#ref!,#REF!),preencher!#ref!))","v":{"$error":"#NAME?"}},{"$f":"IF(preencher!#ref!=\"\",\"\",IF(COUNTIF(preencher!#ref!,preencher!#ref!)=0,CONCATENATE(preencher!#ref!,#REF!),preencher!#ref!))","v":{"$error":"#NAME?"}},{"$f":"IF(preencher!#ref!=\"\",\"\",IF(COUNTIF(preencher!#ref!,preencher!#ref!)=0,CONCATENATE(preencher!#ref!,#REF!),preencher!#ref!))","v":{"$error":"#NAME?"}},{"$f":"IF(preencher!#ref!=\"\",\"\",IF(COUNTIF(preencher!#ref!,preencher!#ref!)=0,CONCATENATE(preencher!#ref!,#REF!),preencher!#ref!))","v":{"$error":"#NAME?"}},{"$f":"IF(ISERROR(ROUND(AVERAGE(E11:N11),2)),\"\",ROUND(AVERAGE(E11:N11),2))","v":""},{"$f":"IF(ISERROR(ROUND(O11*D11,2)),\"\",ROUND(O11*D11,2))","v":""},null,null,{"$f":"IF(ISERROR(MEDIAN(E11:N11)),\"\",MEDIAN(E11:N11))","v":""},{"$f":"IF(ISERROR(STDEV(E11:N11)),\"\",STDEV(E11:N11))","v":""},{"$f":"IF(ISERROR(T11/O11),\"\",T11/O11)","v":""}]
[{"$f":"IF(preencher!#ref!=\"\",\"\",preencher!#ref!)","v":{"$error":"#NAME?"}},{"$f":"IF(preencher!#ref!=\"\",\"\",preencher!#ref!)","v":{"$error":"#NAME?"}},{"$f":"IF(preencher!#ref!=\"\",\"\",preencher!#ref!)","v":{"$error":"#NAME?"}},{"$f":"IF(preencher!#ref!=\"\",\"\",preencher!#ref!)","v":{"$error":"#NAME?"}},{"$f":"IF(preencher!#ref!=\"\",\"\",IF(COUNTIF(preencher!#ref!,preencher!#ref!)=0,CONCATENATE(preencher!#ref!,#REF!),preencher!#ref!))","v":{"$error":"#NAME?"}},{"$f":"IF(preencher!#ref!=\"\",\"\",IF(COUNTIF(preencher!#ref!,preencher!#ref!)=0,CONCATENATE(preencher!#ref!,#REF!),preencher!#ref!))","v":{"$error":"#NAME?"}},{"$f":"IF(preencher!#ref!=\"\",\"\",IF(COUNTIF(preencher!#ref!,preencher!#ref!)=0,CONCATENATE(preencher!#ref!,#REF!),preencher!#ref!))","v":{"$error":"#NAME?"}},{"$f":"IF(preencher!#ref!=\"\",\"\",IF(COUNTIF(preencher!#ref!,preencher!#ref!)=0,CONCATENATE(preencher!#ref!,#REF!),preencher!#ref!))","v":{"$error":"#NAME?"}},{"$f":"IF(preencher!#ref!=\"\",\"\",IF(COUNTIF(preencher!#ref!,preencher!#ref!)=0,CONCATENATE(preencher!#ref!,#REF!),preencher!#ref!))","v":{"$error":"#NAME?"}},{"$f":"IF(preencher!#ref!=\"\",\"\",IF(COUNTIF(preencher!#ref!,preencher!#ref!)=0,CONCATENATE(preencher!#ref!,#REF!),preencher!#ref!))","v":{"$error":"#NAME?"}},{"$f":"IF(preencher!#ref!=\"\",\"\",IF(COUNTIF(preencher!#ref!,preencher!#ref!)=0,CONCATENATE(preencher!#ref!,#REF!),preencher!#ref!))","v":{"$error":"#NAME?"}},{"$f":"IF(preencher!#ref!=\"\",\"\",IF(COUNTIF(preencher!#ref!,preencher!#ref!)=0,CONCATENATE(preencher!#ref!,#REF!),preencher!#ref!))","v":{"$error":"#NAME?"}},{"$f":"IF(preencher!#ref!=\"\",\"\",IF(COUNTIF(preencher!#ref!,preencher!#ref!)=0,CONCATENATE(preencher!#ref!,#REF!),preencher!#ref!))","v":{"$error":"#NAME?"}},{"$f":"IF(preencher!#ref!=\"\",\"\",IF(COUNTIF(preencher!#ref!,preencher!#ref!)=0,CONCATENATE(preencher!#ref!,#REF!),preencher!#ref!))","v":{"$error":"#NAME?"}},{"$f":"IF(ISERROR(ROUND(AVERAGE(E12:N12),2)),\"\",ROUND(AVERAGE(E12:N12),2))","v":""},{"$f":"IF(ISERROR(ROUND(O12*D12,2)),\"\",ROUND(O12*D12,2))","v":""},null,null,{"$f":"IF(ISERROR(MEDIAN(E12:N12)),\"\",MEDIAN(E12:N12))","v":""},{"$f":"IF(ISERROR(STDEV(E12:N12)),\"\",STDEV(E12:N12))","v":""},{"$f":"IF(ISERROR(T12/O12),\"\",T12/O12)","v":""}]
[{"$f":"IF(preencher!#ref!=\"\",\"\",preencher!#ref!)","v":{"$error":"#NAME?"}},{"$f":"IF(preencher!#ref!=\"\",\"\",preencher!#ref!)","v":{"$error":"#NAME?"}},{"$f":"IF(preencher!#ref!=\"\",\"\",preencher!#ref!)","v":{"$error":"#NAME?"}},{"$f":"IF(preencher!#ref!=\"\",\"\",preencher!#ref!)","v":{"$error":"#NAME?"}},{"$f":"IF(preencher!#ref!=\"\",\"\",IF(COUNTIF(preencher!#ref!,preencher!#ref!)=0,CONCATENATE(preencher!#ref!,#REF!),preencher!#ref!))","v":{"$error":"#NAME?"}},{"$f":"IF(preencher!#ref!=\"\",\"\",IF(COUNTIF(preencher!#ref!,preencher!#ref!)=0,CONCATENATE(preencher!#ref!,#REF!),preencher!#ref!))","v":{"$error":"#NAME?"}},{"$f":"IF(preencher!#ref!=\"\",\"\",IF(COUNTIF(preencher!#ref!,preencher!#ref!)=0,CONCATENATE(preencher!#ref!,#REF!),preencher!#ref!))","v":{"$error":"#NAME?"}},{"$f":"IF(preencher!#ref!=\"\",\"\",IF(COUNTIF(preencher!#ref!,preencher!#ref!)=0,CONCATENATE(preencher!#ref!,#REF!),preencher!#ref!))","v":{"$error":"#NAME?"}},{"$f":"IF(preencher!#ref!=\"\",\"\",IF(COUNTIF(preencher!#ref!,preencher!#ref!)=0,CONCATENATE(preencher!#ref!,#REF!),preencher!#ref!))","v":{"$error":"#NAME?"}},{"$f":"IF(preencher!#ref!=\"\",\"\",IF(COUNTIF(preencher!#ref!,preencher!#ref!)=0,CONCATENATE(preencher!#ref!,#REF!),preencher!#ref!))","v":{"$error":"#NAME?"}},{"$f":"IF(preencher!#ref!=\"\",\"\",IF(COUNTIF(preencher!#ref!,preencher!#ref!)=0,CONCATENATE(preencher!#ref!,#REF!),preencher!#ref!))","v":{"$error":"#NAME?"}},{"$f":"IF(preencher!#ref!=\"\",\"\",IF(COUNTIF(preencher!#ref!,preencher!#ref!)=0,CONCATENATE(preencher!#ref!,#REF!),preencher!#ref!))","v":{"$error":"#NAME?"}},{"$f":"IF(preencher!#ref!=\"\",\"\",IF(COUNTIF(preencher!#ref!,preencher!#ref!)=0,CONCATENATE(preencher!#ref!,#REF!),preencher!#ref!))","v":{"$error":"#NAME?"}},{"$f":"IF(preencher!#ref!=\"\",\"\",IF(COUNTIF(preencher!#ref!,preencher!#ref!)=0,CONCATENATE(preencher!#ref!,#REF!),preencher!#ref!))","v":{"$error":"#NAME?"}},{"$f":"IF(ISERROR(ROUND(AVERAGE(E13:N13),2)),\"\",ROUND(AVERAGE(E13:N13),2))","v":""},{"$f":"IF(ISERROR(ROUND(O13*D13,2)),\"\",ROUND(O13*D13,2))","v":""},null,null,{"$f":"IF(ISERROR(MEDIAN(E13:N13)),\"\",MEDIAN(E13:N13))","v":""},{"$f":"IF(ISERROR(STDEV(E13:N13)),\"\",STDEV(E13:N13))","v":""},{"$f":"IF(ISERROR(T13/O13),\"\",T13/O13)","v":""}]
[{"$f":"IF(preencher!#ref!=\"\",\"\",preencher!#ref!)","v":{"$error":"#NAME?"}},{"$f":"IF(preencher!#ref!=\"\",\"\",preencher!#ref!)","v":{"$error":"#NAME?"}},{"$f":"IF(preencher!#ref!=\"\",\"\",preencher!#ref!)","v":{"$error":"#NAME?"}},{"$f":"IF(preencher!#ref!=\"\",\"\",preencher!#ref!)","v":{"$error":"#NAME?"}},{"$f":"IF(preencher!#ref!=\"\",\"\",IF(COUNTIF(preencher!#ref!,preencher!#ref!)=0,CONCATENATE(preencher!#ref!,#REF!),preencher!#ref!))","v":{"$error":"#NAME?"}},{"$f":"IF(preencher!#ref!=\"\",\"\",IF(COUNTIF(preencher!#ref!,preencher!#ref!)=0,CONCATENATE(preencher!#ref!,#REF!),preencher!#ref!))","v":{"$error":"#NAME?"}},{"$f":"IF(preencher!#ref!=\"\",\"\",IF(COUNTIF(preencher!#ref!,preencher!#ref!)=0,CONCATENATE(preencher!#ref!,#REF!),preencher!#ref!))","v":{"$error":"#NAME?"}},{"$f":"IF(preencher!#ref!=\"\",\"\",IF(COUNTIF(preencher!#ref!,preencher!#ref!)=0,CONCATENATE(preencher!#ref!,#REF!),preencher!#ref!))","v":{"$error":"#NAME?"}},{"$f":"IF(preencher!#ref!=\"\",\"\",IF(COUNTIF(preencher!#ref!,preencher!#ref!)=0,CONCATENATE(preencher!#ref!,#REF!),preencher!#ref!))","v":{"$error":"#NAME?"}},{"$f":"IF(preencher!#ref!=\"\",\"\",IF(COUNTIF(preencher!#ref!,preencher!#ref!)=0,CONCATENATE(preencher!#ref!,#REF!),preencher!#ref!))","v":{"$error":"#NAME?"}},{"$f":"IF(preencher!#ref!=\"\",\"\",IF(COUNTIF(preencher!#ref!,preencher!#ref!)=0,CONCATENATE(preencher!#ref!,#REF!),preencher!#ref!))","v":{"$error":"#NAME?"}},{"$f":"IF(preencher!#ref!=\"\",\"\",IF(COUNTIF(preencher!#ref!,preencher!#ref!)=0,CONCATENATE(preencher!#ref!,#REF!),preencher!#ref!))","v":{"$error":"#NAME?"}},{"$f":"IF(preencher!#ref!=\"\",\"\",IF(COUNTIF(preencher!#ref!,preencher!#ref!)=0,CONCATENATE(preencher!#ref!,#REF!),preencher!#ref!))","v":{"$error":"#NAME?"}},{"$f":"IF(preencher!#ref!=\"\",\"\",IF(COUNTIF(preencher!#ref!,preencher!#ref!)=0,CONCATENATE(preencher!#ref!,#REF!),preencher!#ref!))","v":{"$error":"#NAME?"}},{"$f":"IF(ISERROR(ROUND(AVERAGE(E14:N14),2)),\"\",ROUND(AVERAGE(E14:N14),2))","v":""},{"$f":"IF(ISERROR(ROUND(O14*D14,2)),\"\",ROUND(O14*D14,2))","v":""},null,null,{"$f":"IF(ISERROR(MEDIAN(E14:N14)),\"\",MEDIAN(E14:N14))","v":""},{"$f":"IF(ISERROR(STDEV(E14:N14)),\"\",STDEV(E14:N14))","v":""},{"$f":"IF(ISERROR(T14/O14),\"\",T14/O14)","v":""}]
[{"$f":"IF(preencher!#ref!=\"\",\"\",preencher!#ref!)","v":{"$error":"#NAME?"}},{"$f":"IF(preencher!#ref!=\"\",\"\",preencher!#ref!)","v":{"$error":"#NAME?"}},{"$f":"IF(preencher!#ref!=\"\",\"\",preencher!#ref!)","v":{"$error":"#NAME?"}},{"$f":"IF(preencher!#ref!=\"\",\"\",preencher!#ref!)","v":{"$error":"#NAME?"}},{"$f":"IF(preencher!#ref!=\"\",\"\",IF(COUNTIF(preencher!#ref!,preencher!#ref!)=0,CONCATENATE(preencher!#ref!,#REF!),preencher!#ref!))","v":{"$error":"#NAME?"}},{"$f":"IF(preencher!#ref!=\"\",\"\",IF(COUNTIF(preencher!#ref!,preencher!#ref!)=0,CONCATENATE(preencher!#ref!,#REF!),preencher!#ref!))","v":{"$error":"#NAME?"}},{"$f":"IF(preencher!#ref!=\"\",\"\",IF(COUNTIF(preencher!#ref!,preencher!#ref!)=0,CONCATENATE(preencher!#ref!,#REF!),preencher!#ref!))","v":{"$error":"#NAME?"}},{"$f":"IF(preencher!#ref!=\"\",\"\",IF(COUNTIF(preencher!#ref!,preencher!#ref!)=0,CONCATENATE(preencher!#ref!,#REF!),preencher!#ref!))","v":{"$error":"#NAME?"}},{"$f":"IF(preencher!#ref!=\"\",\"\",IF(COUNTIF(preencher!#ref!,preencher!#ref!)=0,CONCATENATE(preencher!#ref!,#REF!),preencher!#ref!))","v":{"$error":"#NAME?"}},{"$f":"IF(preencher!#ref!=\"\",\"\",IF(COUNTIF(preencher!#ref!,preencher!#ref!)=0,CONCATENATE(preencher!#ref!,#REF!),preencher!#ref!))","v":{"$error":"#NAME?"}},{"$f":"IF(preencher!#ref!=\"\",\"\",IF(COUNTIF(preencher!#ref!,preencher!#ref!)=0,CONCATENATE(preencher!#ref!,#REF!),preencher!#ref!))","v":{"$error":"#NAME?"}},{"$f":"IF(preencher!#ref!=\"\",\"\",IF(COUNTIF(preencher!#ref!,preencher!#ref!)=0,CONCATENATE(preencher!#ref!,#REF!),preencher!#ref!))","v":{"$error":"#NAME?"}},{"$f":"IF(preencher!#ref!=\"\",\"\",IF(COUNTIF(preencher!#ref!,preencher!#ref!)=0,CONCATENATE(preencher!#ref!,#REF!),preencher!#ref!))","v":{"$error":"#NAME?"}},{"$f":"IF(preencher!#ref!=\"\",\"\",IF(COUNTIF(preencher!#ref!,preencher!#ref!)=0,CONCATENATE(preencher!#ref!,#REF!),preencher!#ref!))","v":{"$error":"#NAME?"}},{"$f":"IF(ISERROR(ROUND(AVERAGE(E15:N15),2)),\"\",ROUND(AVERAGE(E15:N15),2))","v":""},{"$f":"IF(ISERROR(ROUND(O15*D15,2)),\"\",ROUND(O15*D15,2))","v":""},null,null,{"$f":"IF(ISERROR(MEDIAN(E15:N15)),\"\",MEDIAN(E15:N15))","v":""},{"$f":"IF(ISERROR(STDEV(E15:N15)),\"\",STDEV(E15:N15))","v":""},{"$f":"IF(ISERROR(T15/O15),\"\",T15/O15)","v":""}]
[{"$f":"IF(preencher!#ref!=\"\",\"\",preencher!#ref!)","v":{"$error":"#NAME?"}},{"$f":"IF(preencher!#ref!=\"\",\"\",preencher!#ref!)","v":{"$error":"#NAME?"}},{"$f":"IF(preencher!#ref!=\"\",\"\",preencher!#ref!)","v":{"$error":"#NAME?"}},{"$f":"IF(preencher!#ref!=\"\",\"\",preencher!#ref!)","v":{"$error":"#NAME?"}},{"$f":"IF(preencher!#ref!=\"\",\"\",IF(COUNTIF(preencher!#ref!,preencher!#ref!)=0,CONCATENATE(preencher!#ref!,#REF!),preencher!#ref!))","v":{"$error":"#NAME?"}},{"$f":"IF(preencher!#ref!=\"\",\"\",IF(COUNTIF(preencher!#ref!,preencher!#ref!)=0,CONCATENATE(preencher!#ref!,#REF!),preencher!#ref!))","v":{"$error":"#NAME?"}},{"$f":"IF(preencher!#ref!=\"\",\"\",IF(COUNTIF(preencher!#ref!,preencher!#ref!)=0,CONCATENATE(preencher!#ref!,#REF!),preencher!#ref!))","v":{"$error":"#NAME?"}},{"$f":"IF(preencher!#ref!=\"\",\"\",IF(COUNTIF(preencher!#ref!,preencher!#ref!)=0,CONCATENATE(preencher!#ref!,#REF!),preencher!#ref!))","v":{"$error":"#NAME?"}},{"$f":"IF(preencher!#ref!=\"\",\"\",IF(COUNTIF(preencher!#ref!,preencher!#ref!)=0,CONCATENATE(preencher!#ref!,#REF!),preencher!#ref!))","v":{"$error":"#NAME?"}},{"$f":"IF(preencher!#ref!=\"\",\"\",IF(COUNTIF(preencher!#ref!,preencher!#ref!)=0,CONCATENATE(preencher!#ref!,#REF!),preencher!#ref!))","v":{"$error":"#NAME?"}},{"$f":"IF(preencher!#ref!=\"\",\"\",IF(COUNTIF(preencher!#ref!,preencher!#ref!)=0,CONCATENATE(preencher!#ref!,#REF!),preencher!#ref!))","v":{"$error":"#NAME?"}},{"$f":"IF(preencher!#ref!=\"\",\"\",IF(COUNTIF(preencher!#ref!,preencher!#ref!)=0,CONCATENATE(preencher!#ref!,#REF!),preencher!#ref!))","v":{"$error":"#NAME?"}},{"$f":"IF(preencher!#ref!=\"\",\"\",IF(COUNTIF(preencher!#ref!,preencher!#ref!)=0,CONCATENATE(preencher!#ref!,#REF!),preencher!#ref!))","v":{"$error":"#NAME?"}},{"$f":"IF(preencher!#ref!=\"\",\"\",IF(COUNTIF(preencher!#ref!,preencher!#ref!)=0,CONCATENATE(preencher!#ref!,#REF!),preencher!#ref!))","v":{"$error":"#NAME?"}},{"$f":"IF(ISERROR(ROUND(AVERAGE(E16:N16),2)),\"\",ROUND(AVERAGE(E16:N16),2))","v":""},{"$f":"IF(ISERROR(ROUND(O16*D16,2)),\"\",ROUND(O16*D16,2))","v":""},null,null,{"$f":"IF(ISERROR(MEDIAN(E16:N16)),\"\",MEDIAN(E16:N16))","v":""},{"$f":"IF(ISERROR(STDEV(E16:N16)),\"\",STDEV(E16:N16))","v":""},{"$f":"IF(ISERROR(T16/O16),\"\",T16/O16)","v":""}]
[{"$f":"IF(preencher!#ref!=\"\",\"\",preencher!#ref!)","v":{"$error":"#NAME?"}},{"$f":"IF(preencher!#ref!=\"\",\"\",preencher!#ref!)","v":{"$error":"#NAME?"}},{"$f":"IF(preencher!#ref!=\"\",\"\",preencher!#ref!)","v":{"$error":"#NAME?"}},{"$f":"IF(preencher!#ref!=\"\",\"\",preencher!#ref!)","v":{"$error":"#NAME?"}},{"$f":"IF(preencher!#ref!=\"\",\"\",IF(COUNTIF(preencher!#ref!,preencher!#ref!)=0,CONCATENATE(preencher!#ref!,#REF!),preencher!#ref!))","v":{"$error":"#NAME?"}},{"$f":"IF(preencher!#ref!=\"\",\"\",IF(COUNTIF(preencher!#ref!,preencher!#ref!)=0,CONCATENATE(preencher!#ref!,#REF!),preencher!#ref!))","v":{"$error":"#NAME?"}},{"$f":"IF(preencher!#ref!=\"\",\"\",IF(COUNTIF(preencher!#ref!,preencher!#ref!)=0,CONCATENATE(preencher!#ref!,#REF!),preencher!#ref!))","v":{"$error":"#NAME?"}},{"$f":"IF(preencher!#ref!=\"\",\"\",IF(COUNTIF(preencher!#ref!,preencher!#ref!)=0,CONCATENATE(preencher!#ref!,#REF!),preencher!#ref!))","v":{"$error":"#NAME?"}},{"$f":"IF(preencher!#ref!=\"\",\"\",IF(COUNTIF(preencher!#ref!,preencher!#ref!)=0,CONCATENATE(preencher!#ref!,#REF!),preencher!#ref!))","v":{"$error":"#NAME?"}},{"$f":"IF(preencher!#ref!=\"\",\"\",IF(COUNTIF(preencher!#ref!,preencher!#ref!)=0,CONCATENATE(preencher!#ref!,#REF!),preencher!#ref!))","v":{"$error":"#NAME?"}},{"$f":"IF(preencher!#ref!=\"\",\"\",IF(COUNTIF(preencher!#ref!,preencher!#ref!)=0,CONCATENATE(preencher!#ref!,#REF!),preencher!#ref!))","v":{"$error":"#NAME?"}},{"$f":"IF(preencher!#ref!=\"\",\"\",IF(COUNTIF(preencher!#ref!,preencher!#ref!)=0,CONCATENATE(preencher!#ref!,#REF!),preencher!#ref!))","v":{"$error":"#NAME?"}},{"$f":"IF(preencher!#ref!=\"\",\"\",IF(COUNTIF(preencher!#ref!,preencher!#ref!)=0,CONCATENATE(preencher!#ref!,#REF!),preencher!#ref!))","v":{"$error":"#NAME?"}},{"$f":"IF(preencher!#ref!=\"\",\"\",IF(COUNTIF(preencher!#ref!,preencher!#ref!)=0,CONCATENATE(preencher!#ref!,#REF!),preencher!#ref!))","v":{"$error":"#NAME?"}},{"$f":"IF(ISERROR(ROUND(AVERAGE(E17:N17),2)),\"\",ROUND(AVERAGE(E17:N17),2))","v":""},{"$f":"IF(ISERROR(ROUND(O17*D17,2)),\"\",ROUND(O17*D17,2))","v":""},null,null,{"$f":"IF(ISERROR(MEDIAN(E17:N17)),\"\",MEDIAN(E17:N17))","v":""},{"$f":"IF(ISERROR(STDEV(E17:N17)),\"\",STDEV(E17:N17))","v":""},{"$f":"IF(ISERROR(T17/O17),\"\",T17/O17)","v":""}]
[{"$f":"IF(preencher!#ref!=\"\",\"\",preencher!#ref!)","v":{"$error":"#NAME?"}},{"$f":"IF(preencher!#ref!=\"\",\"\",preencher!#ref!)","v":{"$error":"#NAME?"}},{"$f":"IF(preencher!#ref!=\"\",\"\",preencher!#ref!)","v":{"$error":"#NAME?"}},{"$f":"IF(preencher!#ref!=\"\",\"\",preencher!#ref!)","v":{"$error":"#NAME?"}},{"$f":"IF(preencher!#ref!=\"\",\"\",IF(COUNTIF(preencher!#ref!,preencher!#ref!)=0,CONCATENATE(preencher!#ref!,#REF!),preencher!#ref!))","v":{"$error":"#NAME?"}},{"$f":"IF(preencher!#ref!=\"\",\"\",IF(COUNTIF(preencher!#ref!,preencher!#ref!)=0,CONCATENATE(preencher!#ref!,#REF!),preencher!#ref!))","v":{"$error":"#NAME?"}},{"$f":"IF(preencher!#ref!=\"\",\"\",IF(COUNTIF(preencher!#ref!,preencher!#ref!)=0,CONCATENATE(preencher!#ref!,#REF!),preencher!#ref!))","v":{"$error":"#NAME?"}},{"$f":"IF(preencher!#ref!=\"\",\"\",IF(COUNTIF(preencher!#ref!,preencher!#ref!)=0,CONCATENATE(preencher!#ref!,#REF!),preencher!#ref!))","v":{"$error":"#NAME?"}},{"$f":"IF(preencher!#ref!=\"\",\"\",IF(COUNTIF(preencher!#ref!,preencher!#ref!)=0,CONCATENATE(preencher!#ref!,#REF!),preencher!#ref!))","v":{"$error":"#NAME?"}},{"$f":"IF(preencher!#ref!=\"\",\"\",IF(COUNTIF(preencher!#ref!,preencher!#ref!)=0,CONCATENATE(preencher!#ref!,#REF!),preencher!#ref!))","v":{"$error":"#NAME?"}},{"$f":"IF(preencher!#ref!=\"\",\"\",IF(COUNTIF(preencher!#ref!,preencher!#ref!)=0,CONCATENATE(preencher!#ref!,#REF!),preencher!#ref!))","v":{"$error":"#NAME?"}},{"$f":"IF(preencher!#ref!=\"\",\"\",IF(COUNTIF(preencher!#ref!,preencher!#ref!)=0,CONCATENATE(preencher!#ref!,#REF!),preencher!#ref!))","v":{"$error":"#NAME?"}},{"$f":"IF(preencher!#ref!=\"\",\"\",IF(COUNTIF(preencher!#ref!,preencher!#ref!)=0,CONCATENATE(preencher!#ref!,#REF!),preencher!#ref!))","v":{"$error":"#NAME?"}},{"$f":"IF(preencher!#ref!=\"\",\"\",IF(COUNTIF(preencher!#ref!,preencher!#ref!)=0,CONCATENATE(preencher!#ref!,#REF!),preencher!#ref!))","v":{"$error":"#NAME?"}},{"$f":"IF(ISERROR(ROUND(AVERAGE(E18:N18),2)),\"\",ROUND(AVERAGE(E18:N18),2))","v":""},{"$f":"IF(ISERROR(ROUND(O18*D18,2)),\"\",ROUND(O18*D18,2))","v":""},null,null,{"$f":"IF(ISERROR(MEDIAN(E18:N18)),\"\",MEDIAN(E18:N18))","v":""},{"$f":"IF(ISERROR(STDEV(E18:N18)),\"\",STDEV(E18:N18))","v":""},{"$f":"IF(ISERROR(T18/O18),\"\",T18/O18)","v":""}]
[{"$f":"IF(preencher!#ref!=\"\",\"\",preencher!#ref!)","v":{"$error":"#NAME?"}},{"$f":"IF(preencher!#ref!=\"\",\"\",preencher!#ref!)","v":{"$error":"#NAME?"}},{"$f":"IF(preencher!#ref!=\"\",\"\",preencher!#ref!)","v":{"$error":"#NAME?"}},{"$f":"IF(preencher!#ref!=\"\",\"\",preencher!#ref!)","v":{"$error":"#NAME?"}},{"$f":"IF(preencher!#ref!=\"\",\"\",IF(COUNTIF(preencher!#ref!,preencher!#ref!)=0,CONCATENATE(preencher!#ref!,#REF!),preencher!#ref!))","v":{"$error":"#NAME?"}},{"$f":"IF(preencher!#ref!=\"\",\"\",IF(COUNTIF(preencher!#ref!,preencher!#ref!)=0,CONCATENATE(preencher!#ref!,#REF!),preencher!#ref!))","v":{"$error":"#NAME?"}},{"$f":"IF(preencher!#ref!=\"\",\"\",IF(COUNTIF(preencher!#ref!,preencher!#ref!)=0,CONCATENATE(preencher!#ref!,#REF!),preencher!#ref!))","v":{"$error":"#NAME?"}},{"$f":"IF(preencher!#ref!=\"\",\"\",IF(COUNTIF(preencher!#ref!,preencher!#ref!)=0,CONCATENATE(preencher!#ref!,#REF!),preencher!#ref!))","v":{"$error":"#NAME?"}},{"$f":"IF(preencher!#ref!=\"\",\"\",IF(COUNTIF(preencher!#ref!,preencher!#ref!)=0,CONCATENATE(preencher!#ref!,#REF!),preencher!#ref!))","v":{"$error":"#NAME?"}},{"$f":"IF(preencher!#ref!=\"\",\"\",IF(COUNTIF(preencher!#ref!,preencher!#ref!)=0,CONCATENATE(preencher!#ref!,#REF!),preencher!#ref!))","v":{"$error":"#NAME?"}},{"$f":"IF(preencher!#ref!=\"\",\"\",IF(COUNTIF(preencher!#ref!,preencher!#ref!)=0,CONCATENATE(preencher!#ref!,#REF!),preencher!#ref!))","v":{"$error":"#NAME?"}},{"$f":"IF(preencher!#ref!=\"\",\"\",IF(COUNTIF(preencher!#ref!,preencher!#ref!)=0,CONCATENATE(preencher!#ref!,#REF!),preencher!#ref!))","v":{"$error":"#NAME?"}},{"$f":"IF(preencher!#ref!=\"\",\"\",IF(COUNTIF(preencher!#ref!,preencher!#ref!)=0,CONCATENATE(preencher!#ref!,#REF!),preencher!#ref!))","v":{"$error":"#NAME?"}},{"$f":"IF(preencher!#ref!=\"\",\"\",IF(COUNTIF(preencher!#ref!,preencher!#ref!)=0,CONCATENATE(preencher!#ref!,#REF!),preencher!#ref!))","v":{"$error":"#NAME?"}},{"$f":"IF(ISERROR(ROUND(AVERAGE(E19:N19),2)),\"\",ROUND(AVERAGE(E19:N19),2))","v":""},{"$f":"IF(ISERROR(ROUND(O19*D19,2)),\"\",ROUND(O19*D19,2))","v":""},null,null,{"$f":"IF(ISERROR(MEDIAN(E19:N19)),\"\",MEDIAN(E19:N19))","v":""},{"$f":"IF(ISERROR(STDEV(E19:N19)),\"\",STDEV(E19:N19))","v":""},{"$f":"IF(ISERROR(T19/O19),\"\",T19/O19)","v":""}]
[{"$f":"IF(preencher!#ref!=\"\",\"\",preencher!#ref!)","v":{"$error":"#NAME?"}},{"$f":"IF(preencher!#ref!=\"\",\"\",preencher!#ref!)","v":{"$error":"#NAME?"}},{"$f":"IF(preencher!#ref!=\"\",\"\",preencher!#ref!)","v":{"$error":"#NAME?"}},{"$f":"IF(preencher!#ref!=\"\",\"\",preencher!#ref!)","v":{"$error":"#NAME?"}},{"$f":"IF(preencher!#ref!=\"\",\"\",IF(COUNTIF(preencher!#ref!,preencher!#ref!)=0,CONCATENATE(preencher!#ref!,#REF!),preencher!#ref!))","v":{"$error":"#NAME?"}},{"$f":"IF(preencher!#ref!=\"\",\"\",IF(COUNTIF(preencher!#ref!,preencher!#ref!)=0,CONCATENATE(preencher!#ref!,#REF!),preencher!#ref!))","v":{"$error":"#NAME?"}},{"$f":"IF(preencher!#ref!=\"\",\"\",IF(COUNTIF(preencher!#ref!,preencher!#ref!)=0,CONCATENATE(preencher!#ref!,#REF!),preencher!#ref!))","v":{"$error":"#NAME?"}},{"$f":"IF(preencher!#ref!=\"\",\"\",IF(COUNTIF(preencher!#ref!,preencher!#ref!)=0,CONCATENATE(preencher!#ref!,#REF!),preencher!#ref!))","v":{"$error":"#NAME?"}},{"$f":"IF(preencher!#ref!=\"\",\"\",IF(COUNTIF(preencher!#ref!,preencher!#ref!)=0,CONCATENATE(preencher!#ref!,#REF!),preencher!#ref!))","v":{"$error":"#NAME?"}},{"$f":"IF(preencher!#ref!=\"\",\"\",IF(COUNTIF(preencher!#ref!,preencher!#ref!)=0,CONCATENATE(preencher!#ref!,#REF!),preencher!#ref!))","v":{"$error":"#NAME?"}},{"$f":"IF(preencher!#ref!=\"\",\"\",IF(COUNTIF(preencher!#ref!,preencher!#ref!)=0,CONCATENATE(preencher!#ref!,#REF!),preencher!#ref!))","v":{"$error":"#NAME?"}},{"$f":"IF(preencher!#ref!=\"\",\"\",IF(COUNTIF(preencher!#ref!,preencher!#ref!)=0,CONCATENATE(preencher!#ref!,#REF!),preencher!#ref!))","v":{"$error":"#NAME?"}},{"$f":"IF(preencher!#ref!=\"\",\"\",IF(COUNTIF(preencher!#ref!,preencher!#ref!)=0,CONCATENATE(preencher!#ref!,#REF!),preencher!#ref!))","v":{"$error":"#NAME?"}},{"$f":"IF(preencher!#ref!=\"\",\"\",IF(COUNTIF(preencher!#ref!,preencher!#ref!)=0,CONCATENATE(preencher!#ref!,#REF!),preencher!#ref!))","v":{"$error":"#NAME?"}},{"$f":"IF(ISERROR(ROUND(AVERAGE(E20:N20),2)),\"\",ROUND(AVERAGE(E20:N20),2))","v":""},{"$f":"IF(ISERROR(ROUND(O20*D20,2)),\"\",ROUND(O20*D20,2))","v":""},null,null,{"$f":"IF(ISERROR(MEDIAN(E20:N20)),\"\",MEDIAN(E20:N20))","v":""},{"$f":"IF(ISERROR(STDEV(E20:N20)),\"\",STDEV(E20:N20))","v":""},{"$f":"IF(ISERROR(T20/O20),\"\",T20/O20)","v":""}]
[{"$f":"IF(preencher!#ref!=\"\",\"\",preencher!#ref!)","v":{"$error":"#NAME?"}},{"$f":"IF(preencher!#ref!=\"\",\"\",preencher!#ref!)","v":{"$error":"#NAME?"}},{"$f":"IF(preencher!#ref!=\"\",\"\",preencher!#ref!)","v":{"$error":"#NAME?"}},{"$f":"IF(preencher!#ref!=\"\",\"\",preencher!#ref!)","v":{"$error":"#NAME?"}},{"$f":"IF(preencher!#ref!=\"\",\"\",IF(COUNTIF(preencher!#ref!,preencher!#ref!)=0,CONCATENATE(preencher!#ref!,#REF!),preencher!#ref!))","v":{"$error":"#NAME?"}},{"$f":"IF(preencher!#ref!=\"\",\"\",IF(COUNTIF(preencher!#ref!,preencher!#ref!)=0,CONCATENATE(preencher!#ref!,#REF!),preencher!#ref!))","v":{"$error":"#NAME?"}},{"$f":"IF(preencher!#ref!=\"\",\"\",IF(COUNTIF(preencher!#ref!,preencher!#ref!)=0,CONCATENATE(preencher!#ref!,#REF!),preencher!#ref!))","v":{"$error":"#NAME?"}},{"$f":"IF(preencher!#ref!=\"\",\"\",IF(COUNTIF(preencher!#ref!,preencher!#ref!)=0,CONCATENATE(preencher!#ref!,#REF!),preencher!#ref!))","v":{"$error":"#NAME?"}},{"$f":"IF(preencher!#ref!=\"\",\"\",IF(COUNTIF(preencher!#ref!,preencher!#ref!)=0,CONCATENATE(preencher!#ref!,#REF!),preencher!#ref!))","v":{"$error":"#NAME?"}},{"$f":"IF(preencher!#ref!=\"\",\"\",IF(COUNTIF(preencher!#ref!,preencher!#ref!)=0,CONCATENATE(preencher!#ref!,#REF!),preencher!#ref!))","v":{"$error":"#NAME?"}},{"$f":"IF(preencher!#ref!=\"\",\"\",IF(COUNTIF(preencher!#ref!,preencher!#ref!)=0,CONCATENATE(preencher!#ref!,#REF!),preencher!#ref!))","v":{"$error":"#NAME?"}},{"$f":"IF(preencher!#ref!=\"\",\"\",IF(COUNTIF(preencher!#ref!,preencher!#ref!)=0,CONCATENATE(preencher!#ref!,#REF!),preencher!#ref!))","v":{"$error":"#NAME?"}},{"$f":"IF(preencher!#ref!=\"\",\"\",IF(COUNTIF(preencher!#ref!,preencher!#ref!)=0,CONCATENATE(preencher!#ref!,#REF!),preencher!#ref!))","v":{"$error":"#NAME?"}},{"$f":"IF(preencher!#ref!=\"\",\"\",IF(COUNTIF(preencher!#ref!,preencher!#ref!)=0,CONCATENATE(preencher!#ref!,#REF!),preencher!#ref!))","v":{"$error":"#NAME?"}},{"$f":"IF(ISERROR(ROUND(AVERAGE(E21:N21),2)),\"\",ROUND(AVERAGE(E21:N21),2))","v":""},{"$f":"IF(ISERROR(ROUND(O21*D21,2)),\"\",ROUND(O21*D21,2))","v":""},null,null,{"$f":"IF(ISERROR(MEDIAN(E21:N21)),\"\",MEDIAN(E21:N21))","v":""},{"$f":"IF(ISERROR(STDEV(E21:N21)),\"\",STDEV(E21:N21))","v":""},{"$f":"IF(ISERROR(T21/O21),\"\",T21/O21)","v":""}]
[{"$f":"IF(preencher!#ref!=\"\",\"\",preencher!#ref!)","v":{"$error":"#NAME?"}},{"$f":"IF(preencher!#ref!=\"\",\"\",preencher!#ref!)","v":{"$error":"#NAME?"}},{"$f":"IF(preencher!#ref!=\"\",\"\",preencher!#ref!)","v":{"$error":"#NAME?"}},{"$f":"IF(preencher!#ref!=\"\",\"\",preencher!#ref!)","v":{"$error":"#NAME?"}},{"$f":"IF(preencher!#ref!=\"\",\"\",IF(COUNTIF(preencher!#ref!,preencher!#ref!)=0,CONCATENATE(preencher!#ref!,#REF!),preencher!#ref!))","v":{"$error":"#NAME?"}},{"$f":"IF(preencher!#ref!=\"\",\"\",IF(COUNTIF(preencher!#ref!,preencher!#ref!)=0,CONCATENATE(preencher!#ref!,#REF!),preencher!#ref!))","v":{"$error":"#NAME?"}},{"$f":"IF(preencher!#ref!=\"\",\"\",IF(COUNTIF(preencher!#ref!,preencher!#ref!)=0,CONCATENATE(preencher!#ref!,#REF!),preencher!#ref!))","v":{"$error":"#NAME?"}},{"$f":"IF(preencher!#ref!=\"\",\"\",IF(COUNTIF(preencher!#ref!,preencher!#ref!)=0,CONCATENATE(preencher!#ref!,#REF!),preencher!#ref!))","v":{"$error":"#NAME?"}},{"$f":"IF(preencher!#ref!=\"\",\"\",IF(COUNTIF(preencher!#ref!,preencher!#ref!)=0,CONCATENATE(preencher!#ref!,#REF!),preencher!#ref!))","v":{"$error":"#NAME?"}},{"$f":"IF(preencher!#ref!=\"\",\"\",IF(COUNTIF(preencher!#ref!,preencher!#ref!)=0,CONCATENATE(preencher!#ref!,#REF!),preencher!#ref!))","v":{"$error":"#NAME?"}},{"$f":"IF(preencher!#ref!=\"\",\"\",IF(COUNTIF(preencher!#ref!,preencher!#ref!)=0,CONCATENATE(preencher!#ref!,#REF!),preencher!#ref!))","v":{"$error":"#NAME?"}},{"$f":"IF(preencher!#ref!=\"\",\"\",IF(COUNTIF(preencher!#ref!,preencher!#ref!)=0,CONCATENATE(preencher!#ref!,#REF!),preencher!#ref!))","v":{"$error":"#NAME?"}},{"$f":"IF(preencher!#ref!=\"\",\"\",IF(COUNTIF(preencher!#ref!,preencher!#ref!)=0,CONCATENATE(preencher!#ref!,#REF!),preencher!#ref!))","v":{"$error":"#NAME?"}},{"$f":"IF(preencher!#ref!=\"\",\"\",IF(COUNTIF(preencher!#ref!,preencher!#ref!)=0,CONCATENATE(preencher!#ref!,#REF!),preencher!#ref!))","v":{"$error":"#NAME?"}},{"$f":"IF(ISERROR(ROUND(AVERAGE(E22:N22),2)),\"\",ROUND(AVERAGE(E22:N22),2))","v":""},{"$f":"IF(ISERROR(ROUND(O22*D22,2)),\"\",ROUND(O22*D22,2))","v":""},null,null,{"$f":"IF(ISERROR(MEDIAN(E22:N22)),\"\",MEDIAN(E22:N22))","v":""},{"$f":"IF(ISERROR(STDEV(E22:N22)),\"\",STDEV(E22:N22))","v":""},{"$f":"IF(ISERROR(T22/O22),\"\",T22/O22)","v":""}]
[{"$f":"IF(preencher!#ref!=\"\",\"\",preencher!#ref!)","v":{"$error":"#NAME?"}},{"$f":"IF(preencher!#ref!=\"\",\"\",preencher!#ref!)","v":{"$error":"#NAME?"}},{"$f":"IF(preencher!#ref!=\"\",\"\",preencher!#ref!)","v":{"$error":"#NAME?"}},{"$f":"IF(preencher!#ref!=\"\",\"\",preencher!#ref!)","v":{"$error":"#NAME?"}},{"$f":"IF(preencher!#ref!=\"\",\"\",IF(COUNTIF(preencher!#ref!,preencher!#ref!)=0,CONCATENATE(preencher!#ref!,#REF!),preencher!#ref!))","v":{"$error":"#NAME?"}},{"$f":"IF(preencher!#ref!=\"\",\"\",IF(COUNTIF(preencher!#ref!,preencher!#ref!)=0,CONCATENATE(preencher!#ref!,#REF!),preencher!#ref!))","v":{"$error":"#NAME?"}},{"$f":"IF(preencher!#ref!=\"\",\"\",IF(COUNTIF(preencher!#ref!,preencher!#ref!)=0,CONCATENATE(preencher!#ref!,#REF!),preencher!#ref!))","v":{"$error":"#NAME?"}},{"$f":"IF(preencher!#ref!=\"\",\"\",IF(COUNTIF(preencher!#ref!,preencher!#ref!)=0,CONCATENATE(preencher!#ref!,#REF!),preencher!#ref!))","v":{"$error":"#NAME?"}},{"$f":"IF(preencher!#ref!=\"\",\"\",IF(COUNTIF(preencher!#ref!,preencher!#ref!)=0,CONCATENATE(preencher!#ref!,#REF!),preencher!#ref!))","v":{"$error":"#NAME?"}},{"$f":"IF(preencher!#ref!=\"\",\"\",IF(COUNTIF(preencher!#ref!,preencher!#ref!)=0,CONCATENATE(preencher!#ref!,#REF!),preencher!#ref!))","v":{"$error":"#NAME?"}},{"$f":"IF(preencher!#ref!=\"\",\"\",IF(COUNTIF(preencher!#ref!,preencher!#ref!)=0,CONCATENATE(preencher!#ref!,#REF!),preencher!#ref!))","v":{"$error":"#NAME?"}},{"$f":"IF(preencher!#ref!=\"\",\"\",IF(COUNTIF(preencher!#ref!,preencher!#ref!)=0,CONCATENATE(preencher!#ref!,#REF!),preencher!#ref!))","v":{"$error":"#NAME?"}},{"$f":"IF(preencher!#ref!=\"\",\"\",IF(COUNTIF(preencher!#ref!,preencher!#ref!)=0,CONCATENATE(preencher!#ref!,#REF!),preencher!#ref!))","v":{"$error":"#NAME?"}},{"$f":"IF(preencher!#ref!=\"\",\"\",IF(COUNTIF(preencher!#ref!,preencher!#ref!)=0,CONCATENATE(preencher!#ref!,#REF!),preencher!#ref!))","v":{"$error":"#NAME?"}},{"$f":"IF(ISERROR(ROUND(AVERAGE(E23:N23),2)),\"\",ROUND(AVERAGE(E23:N23),2))","v":""},{"$f":"IF(ISERROR(ROUND(O23*D23,2)),\"\",ROUND(O23*D23,2))","v":""},null,null,{"$f":"IF(ISERROR(MEDIAN(E23:N23)),\"\",MEDIAN(E23:N23))","v":""},{"$f":"IF(ISERROR(STDEV(E23:N23)),\"\",STDEV(E23:N23))","v":""},{"$f":"IF(ISERROR(T23/O23),\"\",T23/O23)","v":""}]
[{"$f":"IF(preencher!#ref!=\"\",\"\",preencher!#ref!)","v":{"$error":"#NAME?"}},{"$f":"IF(preencher!#ref!=\"\",\"\",preencher!#ref!)","v":{"$error":"#NAME?"}},{"$f":"IF(preencher!#ref!=\"\",\"\",preencher!#ref!)","v":{"$error":"#NAME?"}},{"$f":"IF(preencher!#ref!=\"\",\"\",preencher!#ref!)","v":{"$error":"#NAME?"}},{"$f":"IF(preencher!#ref!=\"\",\"\",IF(COUNTIF(preencher!#ref!,preencher!#ref!)=0,CONCATENATE(preencher!#ref!,#REF!),preencher!#ref!))","v":{"$error":"#NAME?"}},{"$f":"IF(preencher!#ref!=\"\",\"\",IF(COUNTIF(preencher!#ref!,preencher!#ref!)=0,CONCATENATE(preencher!#ref!,#REF!),preencher!#ref!))","v":{"$error":"#NAME?"}},{"$f":"IF(preencher!#ref!=\"\",\"\",IF(COUNTIF(preencher!#ref!,preencher!#ref!)=0,CONCATENATE(preencher!#ref!,#REF!),preencher!#ref!))","v":{"$error":"#NAME?"}},{"$f":"IF(preencher!#ref!=\"\",\"\",IF(COUNTIF(preencher!#ref!,preencher!#ref!)=0,CONCATENATE(preencher!#ref!,#REF!),preencher!#ref!))","v":{"$error":"#NAME?"}},{"$f":"IF(preencher!#ref!=\"\",\"\",IF(COUNTIF(preencher!#ref!,preencher!#ref!)=0,CONCATENATE(preencher!#ref!,#REF!),preencher!#ref!))","v":{"$error":"#NAME?"}},{"$f":"IF(preencher!#ref!=\"\",\"\",IF(COUNTIF(preencher!#ref!,preencher!#ref!)=0,CONCATENATE(preencher!#ref!,#REF!),preencher!#ref!))","v":{"$error":"#NAME?"}},{"$f":"IF(preencher!#ref!=\"\",\"\",IF(COUNTIF(preencher!#ref!,preencher!#ref!)=0,CONCATENATE(preencher!#ref!,#REF!),preencher!#ref!))","v":{"$error":"#NAME?"}},{"$f":"IF(preencher!#ref!=\"\",\"\",IF(COUNTIF(preencher!#ref!,preencher!#ref!)=0,CONCATENATE(preencher!#ref!,#REF!),preencher!#ref!))","v":{"$error":"#NAME?"}},{"$f":"IF(preencher!#ref!=\"\",\"\",IF(COUNTIF(preencher!#ref!,preencher!#ref!)=0,CONCATENATE(preencher!#ref!,#REF!),preencher!#ref!))","v":{"$error":"#NAME?"}},{"$f":"IF(preencher!#ref!=\"\",\"\",IF(COUNTIF(preencher!#ref!,preencher!#ref!)=0,CONCATENATE(preencher!#ref!,#REF!),preencher!#ref!))","v":{"$error":"#NAME?"}},{"$f":"IF(ISERROR(ROUND(AVERAGE(E24:N24),2)),\"\",ROUND(AVERAGE(E24:N24),2))","v":""},{"$f":"IF(ISERROR(ROUND(O24*D24,2)),\"\",ROUND(O24*D24,2))","v":""},null,null,{"$f":"IF(ISERROR(MEDIAN(E24:N24)),\"\",MEDIAN(E24:N24))","v":""},{"$f":"IF(ISERROR(STDEV(E24:N24)),\"\",STDEV(E24:N24))","v":""},{"$f":"IF(ISERROR(T24/O24),\"\",T24/O24)","v":""}]
[{"$f":"IF(preencher!#ref!=\"\",\"\",preencher!#ref!)","v":{"$error":"#NAME?"}},{"$f":"IF(preencher!#ref!=\"\",\"\",preencher!#ref!)","v":{"$error":"#NAME?"}},{"$f":"IF(preencher!#ref!=\"\",\"\",preencher!#ref!)","v":{"$error":"#NAME?"}},{"$f":"IF(preencher!#ref!=\"\",\"\",preencher!#ref!)","v":{"$error":"#NAME?"}},{"$f":"IF(preencher!#ref!=\"\",\"\",IF(COUNTIF(preencher!#ref!,preencher!#ref!)=0,CONCATENATE(preencher!#ref!,#REF!),preencher!#ref!))","v":{"$error":"#NAME?"}},{"$f":"IF(preencher!#ref!=\"\",\"\",IF(COUNTIF(preencher!#ref!,preencher!#ref!)=0,CONCATENATE(preencher!#ref!,#REF!),preencher!#ref!))","v":{"$error":"#NAME?"}},{"$f":"IF(preencher!#ref!=\"\",\"\",IF(COUNTIF(preencher!#ref!,preencher!#ref!)=0,CONCATENATE(preencher!#ref!,#REF!),preencher!#ref!))","v":{"$error":"#NAME?"}},{"$f":"IF(preencher!#ref!=\"\",\"\",IF(COUNTIF(preencher!#ref!,preencher!#ref!)=0,CONCATENATE(preencher!#ref!,#REF!),preencher!#ref!))","v":{"$error":"#NAME?"}},{"$f":"IF(preencher!#ref!=\"\",\"\",IF(COUNTIF(preencher!#ref!,preencher!#ref!)=0,CONCATENATE(preencher!#ref!,#REF!),preencher!#ref!))","v":{"$error":"#NAME?"}},{"$f":"IF(preencher!#ref!=\"\",\"\",IF(COUNTIF(preencher!#ref!,preencher!#ref!)=0,CONCATENATE(preencher!#ref!,#REF!),preencher!#ref!))","v":{"$error":"#NAME?"}},{"$f":"IF(preencher!#ref!=\"\",\"\",IF(COUNTIF(preencher!#ref!,preencher!#ref!)=0,CONCATENATE(preencher!#ref!,#REF!),preencher!#ref!))","v":{"$error":"#NAME?"}},{"$f":"IF(preencher!#ref!=\"\",\"\",IF(COUNTIF(preencher!#ref!,preencher!#ref!)=0,CONCATENATE(preencher!#ref!,#REF!),preencher!#ref!))","v":{"$error":"#NAME?"}},{"$f":"IF(preencher!#ref!=\"\",\"\",IF(COUNTIF(preencher!#ref!,preencher!#ref!)=0,CONCATENATE(preencher!#ref!,#REF!),preencher!#ref!))","v":{"$error":"#NAME?"}},{"$f":"IF(preencher!#ref!=\"\",\"\",IF(COUNTIF(preencher!#ref!,preencher!#ref!)=0,CONCATENATE(preencher!#ref!,#REF!),preencher!#ref!))","v":{"$error":"#NAME?"}},{"$f":"IF(ISERROR(ROUND(AVERAGE(E25:N25),2)),\"\",ROUND(AVERAGE(E25:N25),2))","v":""},{"$f":"IF(ISERROR(ROUND(O25*D25,2)),\"\",ROUND(O25*D25,2))","v":""},null,null,{"$f":"IF(ISERROR(MEDIAN(E25:N25)),\"\",MEDIAN(E25:N25))","v":""},{"$f":"IF(ISERROR(STDEV(E25:N25)),\"\",STDEV(E25:N25))","v":""},{"$f":"IF(ISERROR(T25/O25),\"\",T25/O25)","v":""}]
[{"$f":"IF(preencher!#ref!=\"\",\"\",preencher!#ref!)","v":{"$error":"#NAME?"}},{"$f":"IF(preencher!#ref!=\"\",\"\",preencher!#ref!)","v":{"$error":"#NAME?"}},{"$f":"IF(preencher!#ref!=\"\",\"\",preencher!#ref!)","v":{"$error":"#NAME?"}},{"$f":"IF(preencher!#ref!=\"\",\"\",preencher!#ref!)","v":{"$error":"#NAME?"}},{"$f":"IF(preencher!#ref!=\"\",\"\",IF(COUNTIF(preencher!#ref!,preencher!#ref!)=0,CONCATENATE(preencher!#ref!,#REF!),preencher!#ref!))","v":{"$error":"#NAME?"}},{"$f":"IF(preencher!#ref!=\"\",\"\",IF(COUNTIF(preencher!#ref!,preencher!#ref!)=0,CONCATENATE(preencher!#ref!,#REF!),preencher!#ref!))","v":{"$error":"#NAME?"}},{"$f":"IF(preencher!#ref!=\"\",\"\",IF(COUNTIF(preencher!#ref!,preencher!#ref!)=0,CONCATENATE(preencher!#ref!,#REF!),preencher!#ref!))","v":{"$error":"#NAME?"}},{"$f":"IF(preencher!#ref!=\"\",\"\",IF(COUNTIF(preencher!#ref!,preencher!#ref!)=0,CONCATENATE(preencher!#ref!,#REF!),preencher!#ref!))","v":{"$error":"#NAME?"}},{"$f":"IF(preencher!#ref!=\"\",\"\",IF(COUNTIF(preencher!#ref!,preencher!#ref!)=0,CONCATENATE(preencher!#ref!,#REF!),preencher!#ref!))","v":{"$error":"#NAME?"}},{"$f":"IF(preencher!#ref!=\"\",\"\",IF(COUNTIF(preencher!#ref!,preencher!#ref!)=0,CONCATENATE(preencher!#ref!,#REF!),preencher!#ref!))","v":{"$error":"#NAME?"}},{"$f":"IF(preencher!#ref!=\"\",\"\",IF(COUNTIF(preencher!#ref!,preencher!#ref!)=0,CONCATENATE(preencher!#ref!,#REF!),preencher!#ref!))","v":{"$error":"#NAME?"}},{"$f":"IF(preencher!#ref!=\"\",\"\",IF(COUNTIF(preencher!#ref!,preencher!#ref!)=0,CONCATENATE(preencher!#ref!,#REF!),preencher!#ref!))","v":{"$error":"#NAME?"}},{"$f":"IF(preencher!#ref!=\"\",\"\",IF(COUNTIF(preencher!#ref!,preencher!#ref!)=0,CONCATENATE(preencher!#ref!,#REF!),preencher!#ref!))","v":{"$error":"#NAME?"}},{"$f":"IF(preencher!#ref!=\"\",\"\",IF(COUNTIF(preencher!#ref!,preencher!#ref!)=0,CONCATENATE(preencher!#ref!,#REF!),preencher!#ref!))","v":{"$error":"#NAME?"}},{"$f":"IF(ISERROR(ROUND(AVERAGE(E26:N26),2)),\"\",ROUND(AVERAGE(E26:N26),2))","v":""},{"$f":"IF(ISERROR(ROUND(O26*D26,2)),\"\",ROUND(O26*D26,2))","v":""},null,null,{"$f":"IF(ISERROR(MEDIAN(E26:N26)),\"\",MEDIAN(E26:N26))","v":""},{"$f":"IF(ISERROR(STDEV(E26:N26)),\"\",STDEV(E26:N26))","v":""},{"$f":"IF(ISERROR(T26/O26),\"\",T26/O26)","v":""}]
[{"$f":"IF(preencher!#ref!=\"\",\"\",preencher!#ref!)","v":{"$error":"#NAME?"}},{"$f":"IF(preencher!#ref!=\"\",\"\",preencher!#ref!)","v":{"$error":"#NAME?"}},{"$f":"IF(preencher!#ref!=\"\",\"\",preencher!#ref!)","v":{"$error":"#NAME?"}},{"$f":"IF(preencher!#ref!=\"\",\"\",preencher!#ref!)","v":{"$error":"#NAME?"}},{"$f":"IF(preencher!#ref!=\"\",\"\",IF(COUNTIF(preencher!#ref!,preencher!#ref!)=0,CONCATENATE(preencher!#ref!,#REF!),preencher!#ref!))","v":{"$error":"#NAME?"}},{"$f":"IF(preencher!#ref!=\"\",\"\",IF(COUNTIF(preencher!#ref!,preencher!#ref!)=0,CONCATENATE(preencher!#ref!,#REF!),preencher!#ref!))","v":{"$error":"#NAME?"}},{"$f":"IF(preencher!#ref!=\"\",\"\",IF(COUNTIF(preencher!#ref!,preencher!#ref!)=0,CONCATENATE(preencher!#ref!,#REF!),preencher!#ref!))","v":{"$error":"#NAME?"}},{"$f":"IF(preencher!#ref!=\"\",\"\",IF(COUNTIF(preencher!#ref!,preencher!#ref!)=0,CONCATENATE(preencher!#ref!,#REF!),preencher!#ref!))","v":{"$error":"#NAME?"}},{"$f":"IF(preencher!#ref!=\"\",\"\",IF(COUNTIF(preencher!#ref!,preencher!#ref!)=0,CONCATENATE(preencher!#ref!,#REF!),preencher!#ref!))","v":{"$error":"#NAME?"}},{"$f":"IF(preencher!#ref!=\"\",\"\",IF(COUNTIF(preencher!#ref!,preencher!#ref!)=0,CONCATENATE(preencher!#ref!,#REF!),preencher!#ref!))","v":{"$error":"#NAME?"}},{"$f":"IF(preencher!#ref!=\"\",\"\",IF(COUNTIF(preencher!#ref!,preencher!#ref!)=0,CONCATENATE(preencher!#ref!,#REF!),preencher!#ref!))","v":{"$error":"#NAME?"}},{"$f":"IF(preencher!#ref!=\"\",\"\",IF(COUNTIF(preencher!#ref!,preencher!#ref!)=0,CONCATENATE(preencher!#ref!,#REF!),preencher!#ref!))","v":{"$error":"#NAME?"}},{"$f":"IF(preencher!#ref!=\"\",\"\",IF(COUNTIF(preencher!#ref!,preencher!#ref!)=0,CONCATENATE(preencher!#ref!,#REF!),preencher!#ref!))","v":{"$error":"#NAME?"}},{"$f":"IF(preencher!#ref!=\"\",\"\",IF(COUNTIF(preencher!#ref!,preencher!#ref!)=0,CONCATENATE(preencher!#ref!,#REF!),preencher!#ref!))","v":{"$error":"#NAME?"}},{"$f":"IF(ISERROR(ROUND(AVERAGE(E27:N27),2)),\"\",ROUND(AVERAGE(E27:N27),2))","v":""},{"$f":"IF(ISERROR(ROUND(O27*D27,2)),\"\",ROUND(O27*D27,2))","v":""},null,null,{"$f":"IF(ISERROR(MEDIAN(E27:N27)),\"\",MEDIAN(E27:N27))","v":""},{"$f":"IF(ISERROR(STDEV(E27:N27)),\"\",STDEV(E27:N27))","v":""},{"$f":"IF(ISERROR(T27/O27),\"\",T27/O27)","v":""}]
[{"$f":"IF(preencher!#ref!=\"\",\"\",preencher!#ref!)","v":{"$error":"#NAME?"}},{"$f":"IF(preencher!#ref!=\"\",\"\",preencher!#ref!)","v":{"$error":"#NAME?"}},{"$f":"IF(preencher!#ref!=\"\",\"\",preencher!#ref!)","v":{"$error":"#NAME?"}},{"$f":"IF(preencher!#ref!=\"\",\"\",preencher!#ref!)","v":{"$error":"#NAME?"}},{"$f":"IF(preencher!#ref!=\"\",\"\",IF(COUNTIF(preencher!#ref!,preencher!#ref!)=0,CONCATENATE(preencher!#ref!,#REF!),preencher!#ref!))","v":{"$error":"#NAME?"}},{"$f":"IF(preencher!#ref!=\"\",\"\",IF(COUNTIF(preencher!#ref!,preencher!#ref!)=0,CONCATENATE(preencher!#ref!,#REF!),preencher!#ref!))","v":{"$error":"#NAME?"}},{"$f":"IF(preencher!#ref!=\"\",\"\",IF(COUNTIF(preencher!#ref!,preencher!#ref!)=0,CONCATENATE(preencher!#ref!,#REF!),preencher!#ref!))","v":{"$error":"#NAME?"}},{"$f":"IF(preencher!#ref!=\"\",\"\",IF(COUNTIF(preencher!#ref!,preencher!#ref!)=0,CONCATENATE(preencher!#ref!,#REF!),preencher!#ref!))","v":{"$error":"#NAME?"}},{"$f":"IF(preencher!#ref!=\"\",\"\",IF(COUNTIF(preencher!#ref!,preencher!#ref!)=0,CONCATENATE(preencher!#ref!,#REF!),preencher!#ref!))","v":{"$error":"#NAME?"}},{"$f":"IF(preencher!#ref!=\"\",\"\",IF(COUNTIF(preencher!#ref!,preencher!#ref!)=0,CONCATENATE(preencher!#ref!,#REF!),preencher!#ref!))","v":{"$error":"#NAME?"}},{"$f":"IF(preencher!#ref!=\"\",\"\",IF(COUNTIF(preencher!#ref!,preencher!#ref!)=0,CONCATENATE(preencher!#ref!,#REF!),preencher!#ref!))","v":{"$error":"#NAME?"}},{"$f":"IF(preencher!#ref!=\"\",\"\",IF(COUNTIF(preencher!#ref!,preencher!#ref!)=0,CONCATENATE(preencher!#ref!,#REF!),preencher!#ref!))","v":{"$error":"#NAME?"}},{"$f":"IF(preencher!#ref!=\"\",\"\",IF(COUNTIF(preencher!#ref!,preencher!#ref!)=0,CONCATENATE(preencher!#ref!,#REF!),preencher!#ref!))","v":{"$error":"#NAME?"}},{"$f":"IF(preencher!#ref!=\"\",\"\",IF(COUNTIF(preencher!#ref!,preencher!#ref!)=0,CONCATENATE(preencher!#ref!,#REF!),preencher!#ref!))","v":{"$error":"#NAME?"}},{"$f":"IF(ISERROR(ROUND(AVERAGE(E28:N28),2)),\"\",ROUND(AVERAGE(E28:N28),2))","v":""},{"$f":"IF(ISERROR(ROUND(O28*D28,2)),\"\",ROUND(O28*D28,2))","v":""},null,null,{"$f":"IF(ISERROR(MEDIAN(E28:N28)),\"\",MEDIAN(E28:N28))","v":""},{"$f":"IF(ISERROR(STDEV(E28:N28)),\"\",STDEV(E28:N28))","v":""},{"$f":"IF(ISERROR(T28/O28),\"\",T28/O28)","v":""}]
[{"$f":"IF(preencher!#ref!=\"\",\"\",preencher!#ref!)","v":{"$error":"#NAME?"}},{"$f":"IF(preencher!#ref!=\"\",\"\",preencher!#ref!)","v":{"$error":"#NAME?"}},{"$f":"IF(preencher!#ref!=\"\",\"\",preencher!#ref!)","v":{"$error":"#NAME?"}},{"$f":"IF(preencher!#ref!=\"\",\"\",preencher!#ref!)","v":{"$error":"#NAME?"}},{"$f":"IF(preencher!#ref!=\"\",\"\",IF(COUNTIF(preencher!#ref!,preencher!#ref!)=0,CONCATENATE(preencher!#ref!,#REF!),preencher!#ref!))","v":{"$error":"#NAME?"}},{"$f":"IF(preencher!#ref!=\"\",\"\",IF(COUNTIF(preencher!#ref!,preencher!#ref!)=0,CONCATENATE(preencher!#ref!,#REF!),preencher!#ref!))","v":{"$error":"#NAME?"}},{"$f":"IF(preencher!#ref!=\"\",\"\",IF(COUNTIF(preencher!#ref!,preencher!#ref!)=0,CONCATENATE(preencher!#ref!,#REF!),preencher!#ref!))","v":{"$error":"#NAME?"}},{"$f":"IF(preencher!#ref!=\"\",\"\",IF(COUNTIF(preencher!#ref!,preencher!#ref!)=0,CONCATENATE(preencher!#ref!,#REF!),preencher!#ref!))","v":{"$error":"#NAME?"}},{"$f":"IF(preencher!#ref!=\"\",\"\",IF(COUNTIF(preencher!#ref!,preencher!#ref!)=0,CONCATENATE(preencher!#ref!,#REF!),preencher!#ref!))","v":{"$error":"#NAME?"}},{"$f":"IF(preencher!#ref!=\"\",\"\",IF(COUNTIF(preencher!#ref!,preencher!#ref!)=0,CONCATENATE(preencher!#ref!,#REF!),preencher!#ref!))","v":{"$error":"#NAME?"}},{"$f":"IF(preencher!#ref!=\"\",\"\",IF(COUNTIF(preencher!#ref!,preencher!#ref!)=0,CONCATENATE(preencher!#ref!,#REF!),preencher!#ref!))","v":{"$error":"#NAME?"}},{"$f":"IF(preencher!#ref!=\"\",\"\",IF(COUNTIF(preencher!#ref!,preencher!#ref!)=0,CONCATENATE(preencher!#ref!,#REF!),preencher!#ref!))","v":{"$error":"#NAME?"}},{"$f":"IF(preencher!#ref!=\"\",\"\",IF(COUNTIF(preencher!#ref!,preencher!#ref!)=0,CONCATENATE(preencher!#ref!,#REF!),preencher!#ref!))","v":{"$error":"#NAME?"}},{"$f":"IF(preencher!#ref!=\"\",\"\",IF(COUNTIF(preencher!#ref!,preencher!#ref!)=0,CONCATENATE(preencher!#ref!,#REF!),preencher!#ref!))","v":{"$error":"#NAME?"}},{"$f":"IF(ISERROR(ROUND(AVERAGE(E29:N29),2)),\"\",ROUND(AVERAGE(E29:N29),2))","v":""},{"$f":"IF(ISERROR(ROUND(O29*D29,2)),\"\",ROUND(O29*D29,2))","v":""},null,null,{"$f":"IF(ISERROR(MEDIAN(E29:N29)),\"\",MEDIAN(E29:N29))","v":""},{"$f":"IF(ISERROR(STDEV(E29:N29)),\"\",STDEV(E29:N29))","v":""},{"$f":"IF(ISERROR(T29/O29),\"\",T29/O29)","v":""}]
[{"$f":"IF(preencher!#ref!=\"\",\"\",preencher!#ref!)","v":{"$error":"#NAME?"}},{"$f":"IF(preencher!#ref!=\"\",\"\",preencher!#ref!)","v":{"$error":"#NAME?"}},{"$f":"IF(preencher!#ref!=\"\",\"\",preencher!#ref!)","v":{"$error":"#NAME?"}},{"$f":"IF(preencher!#ref!=\"\",\"\",preencher!#ref!)","v":{"$error":"#NAME?"}},{"$f":"IF(preencher!#ref!=\"\",\"\",IF(COUNTIF(preencher!#ref!,preencher!#ref!)=0,CONCATENATE(preencher!#ref!,#REF!),preencher!#ref!))","v":{"$error":"#NAME?"}},{"$f":"IF(preencher!#ref!=\"\",\"\",IF(COUNTIF(preencher!#ref!,preencher!#ref!)=0,CONCATENATE(preencher!#ref!,#REF!),preencher!#ref!))","v":{"$error":"#NAME?"}},{"$f":"IF(preencher!#ref!=\"\",\"\",IF(COUNTIF(preencher!#ref!,preencher!#ref!)=0,CONCATENATE(preencher!#ref!,#REF!),preencher!#ref!))","v":{"$error":"#NAME?"}},{"$f":"IF(preencher!#ref!=\"\",\"\",IF(COUNTIF(preencher!#ref!,preencher!#ref!)=0,CONCATENATE(preencher!#ref!,#REF!),preencher!#ref!))","v":{"$error":"#NAME?"}},{"$f":"IF(preencher!#ref!=\"\",\"\",IF(COUNTIF(preencher!#ref!,preencher!#ref!)=0,CONCATENATE(preencher!#ref!,#REF!),preencher!#ref!))","v":{"$error":"#NAME?"}},{"$f":"IF(preencher!#ref!=\"\",\"\",IF(COUNTIF(preencher!#ref!,preencher!#ref!)=0,CONCATENATE(preencher!#ref!,#REF!),preencher!#ref!))","v":{"$error":"#NAME?"}},{"$f":"IF(preencher!#ref!=\"\",\"\",IF(COUNTIF(preencher!#ref!,preencher!#ref!)=0,CONCATENATE(preencher!#ref!,#REF!),preencher!#ref!))","v":{"$error":"#NAME?"}},{"$f":"IF(preencher!#ref!=\"\",\"\",IF(COUNTIF(preencher!#ref!,preencher!#ref!)=0,CONCATENATE(preencher!#ref!,#REF!),preencher!#ref!))","v":{"$error":"#NAME?"}},{"$f":"IF(preencher!#ref!=\"\",\"\",IF(COUNTIF(preencher!#ref!,preencher!#ref!)=0,CONCATENATE(preencher!#ref!,#REF!),preencher!#ref!))","v":{"$error":"#NAME?"}},{"$f":"IF(preencher!#ref!=\"\",\"\",IF(COUNTIF(preencher!#ref!,preencher!#ref!)=0,CONCATENATE(preencher!#ref!,#REF!),preencher!#ref!))","v":{"$error":"#NAME?"}},{"$f":"IF(ISERROR(ROUND(AVERAGE(E30:N30),2)),\"\",ROUND(AVERAGE(E30:N30),2))","v":""},{"$f":"IF(ISERROR(ROUND(O30*D30,2)),\"\",ROUND(O30*D30,2))","v":""},null,null,{"$f":"IF(ISERROR(MEDIAN(E30:N30)),\"\",MEDIAN(E30:N30))","v":""},{"$f":"IF(ISERROR(STDEV(E30:N30)),\"\",STDEV(E30:N30))","v":""},{"$f":"IF(ISERROR(T30/O30),\"\",T30/O30)","v":""}]
[{"$f":"IF(preencher!#ref!=\"\",\"\",preencher!#ref!)","v":{"$error":"#NAME?"}},{"$f":"IF(preencher!#ref!=\"\",\"\",preencher!#ref!)","v":{"$error":"#NAME?"}},{"$f":"IF(preencher!#ref!=\"\",\"\",preencher!#ref!)","v":{"$error":"#NAME?"}},{"$f":"IF(preencher!#ref!=\"\",\"\",preencher!#ref!)","v":{"$error":"#NAME?"}},{"$f":"IF(preencher!#ref!=\"\",\"\",IF(COUNTIF(preencher!#ref!,preencher!#ref!)=0,CONCATENATE(preencher!#ref!,#REF!),preencher!#ref!))","v":{"$error":"#NAME?"}},{"$f":"IF(preencher!#ref!=\"\",\"\",IF(COUNTIF(preencher!#ref!,preencher!#ref!)=0,CONCATENATE(preencher!#ref!,#REF!),preencher!#ref!))","v":{"$error":"#NAME?"}},{"$f":"IF(preencher!#ref!=\"\",\"\",IF(COUNTIF(preencher!#ref!,preencher!#ref!)=0,CONCATENATE(preencher!#ref!,#REF!),preencher!#ref!))","v":{"$error":"#NAME?"}},{"$f":"IF(preencher!#ref!=\"\",\"\",IF(COUNTIF(preencher!#ref!,preencher!#ref!)=0,CONCATENATE(preencher!#ref!,#REF!),preencher!#ref!))","v":{"$error":"#NAME?"}},{"$f":"IF(preencher!#ref!=\"\",\"\",IF(COUNTIF(preencher!#ref!,preencher!#ref!)=0,CONCATENATE(preencher!#ref!,#REF!),preencher!#ref!))","v":{"$error":"#NAME?"}},{"$f":"IF(preencher!#ref!=\"\",\"\",IF(COUNTIF(preencher!#ref!,preencher!#ref!)=0,CONCATENATE(preencher!#ref!,#REF!),preencher!#ref!))","v":{"$error":"#NAME?"}},{"$f":"IF(preencher!#ref!=\"\",\"\",IF(COUNTIF(preencher!#ref!,preencher!#ref!)=0,CONCATENATE(preencher!#ref!,#REF!),preencher!#ref!))","v":{"$error":"#NAME?"}},{"$f":"IF(preencher!#ref!=\"\",\"\",IF(COUNTIF(preencher!#ref!,preencher!#ref!)=0,CONCATENATE(preencher!#ref!,#REF!),preencher!#ref!))","v":{"$error":"#NAME?"}},{"$f":"IF(preencher!#ref!=\"\",\"\",IF(COUNTIF(preencher!#ref!,preencher!#ref!)=0,CONCATENATE(preencher!#ref!,#REF!),preencher!#ref!))","v":{"$error":"#NAME?"}},{"$f":"IF(preencher!#ref!=\"\",\"\",IF(COUNTIF(preencher!#ref!,preencher!#ref!)=0,CONCATENATE(preencher!#ref!,#REF!),preencher!#ref!))","v":{"$error":"#NAME?"}},{"$f":"IF(ISERROR(ROUND(AVERAGE(E31:N31),2)),\"\",ROUND(AVERAGE(E31:N31),2))","v":""},{"$f":"IF(ISERROR(ROUND(O31*D31,2)),\"\",ROUND(O31*D31,2))","v":""},null,null,{"$f":"IF(ISERROR(MEDIAN(E31:N31)),\"\",MEDIAN(E31:N31))","v":""},{"$f":"IF(ISERROR(STDEV(E31:N31)),\"\",STDEV(E31:N31))","v":""},{"$f":"IF(ISERROR(T31/O31),\"\",T31/O31)","v":""}]
[{"$f":"IF(preencher!#ref!=\"\",\"\",preencher!#ref!)","v":{"$error":"#NAME?"}},{"$f":"IF(preencher!#ref!=\"\",\"\",preencher!#ref!)","v":{"$error":"#NAME?"}},{"$f":"IF(preencher!#ref!=\"\",\"\",preencher!#ref!)","v":{"$error":"#NAME?"}},{"$f":"IF(preencher!#ref!=\"\",\"\",preencher!#ref!)","v":{"$error":"#NAME?"}},{"$f":"IF(preencher!#ref!=\"\",\"\",IF(COUNTIF(preencher!#ref!,preencher!#ref!)=0,CONCATENATE(preencher!#ref!,#REF!),preencher!#ref!))","v":{"$error":"#NAME?"}},{"$f":"IF(preencher!#ref!=\"\",\"\",IF(COUNTIF(preencher!#ref!,preencher!#ref!)=0,CONCATENATE(preencher!#ref!,#REF!),preencher!#ref!))","v":{"$error":"#NAME?"}},{"$f":"IF(preencher!#ref!=\"\",\"\",IF(COUNTIF(preencher!#ref!,preencher!#ref!)=0,CONCATENATE(preencher!#ref!,#REF!),preencher!#ref!))","v":{"$error":"#NAME?"}},{"$f":"IF(preencher!#ref!=\"\",\"\",IF(COUNTIF(preencher!#ref!,preencher!#ref!)=0,CONCATENATE(preencher!#ref!,#REF!),preencher!#ref!))","v":{"$error":"#NAME?"}},{"$f":"IF(preencher!#ref!=\"\",\"\",IF(COUNTIF(preencher!#ref!,preencher!#ref!)=0,CONCATENATE(preencher!#ref!,#REF!),preencher!#ref!))","v":{"$error":"#NAME?"}},{"$f":"IF(preencher!#ref!=\"\",\"\",IF(COUNTIF(preencher!#ref!,preencher!#ref!)=0,CONCATENATE(preencher!#ref!,#REF!),preencher!#ref!))","v":{"$error":"#NAME?"}},{"$f":"IF(preencher!#ref!=\"\",\"\",IF(COUNTIF(preencher!#ref!,preencher!#ref!)=0,CONCATENATE(preencher!#ref!,#REF!),preencher!#ref!))","v":{"$error":"#NAME?"}},{"$f":"IF(preencher!#ref!=\"\",\"\",IF(COUNTIF(preencher!#ref!,preencher!#ref!)=0,CONCATENATE(preencher!#ref!,#REF!),preencher!#ref!))","v":{"$error":"#NAME?"}},{"$f":"IF(preencher!#ref!=\"\",\"\",IF(COUNTIF(preencher!#ref!,preencher!#ref!)=0,CONCATENATE(preencher!#ref!,#REF!),preencher!#ref!))","v":{"$error":"#NAME?"}},{"$f":"IF(preencher!#ref!=\"\",\"\",IF(COUNTIF(preencher!#ref!,preencher!#ref!)=0,CONCATENATE(preencher!#ref!,#REF!),preencher!#ref!))","v":{"$error":"#NAME?"}},{"$f":"IF(ISERROR(ROUND(AVERAGE(E32:N32),2)),\"\",ROUND(AVERAGE(E32:N32),2))","v":""},{"$f":"IF(ISERROR(ROUND(O32*D32,2)),\"\",ROUND(O32*D32,2))","v":""},null,null,{"$f":"IF(ISERROR(MEDIAN(E32:N32)),\"\",MEDIAN(E32:N32))","v":""},{"$f":"IF(ISERROR(STDEV(E32:N32)),\"\",STDEV(E32:N32))","v":""},{"$f":"IF(ISERROR(T32/O32),\"\",T32/O32)","v":""}]
[{"$f":"IF(preencher!#ref!=\"\",\"\",preencher!#ref!)","v":{"$error":"#NAME?"}},{"$f":"IF(preencher!#ref!=\"\",\"\",preencher!#ref!)","v":{"$error":"#NAME?"}},{"$f":"IF(preencher!#ref!=\"\",\"\",preencher!#ref!)","v":{"$error":"#NAME?"}},{"$f":"IF(preencher!#ref!=\"\",\"\",preencher!#ref!)","v":{"$error":"#NAME?"}},{"$f":"IF(preencher!#ref!=\"\",\"\",IF(COUNTIF(preencher!#ref!,preencher!#ref!)=0,CONCATENATE(preencher!#ref!,#REF!),preencher!#ref!))","v":{"$error":"#NAME?"}},{"$f":"IF(preencher!#ref!=\"\",\"\",IF(COUNTIF(preencher!#ref!,preencher!#ref!)=0,CONCATENATE(preencher!#ref!,#REF!),preencher!#ref!))","v":{"$error":"#NAME?"}},{"$f":"IF(preencher!#ref!=\"\",\"\",IF(COUNTIF(preencher!#ref!,preencher!#ref!)=0,CONCATENATE(preencher!#ref!,#REF!),preencher!#ref!))","v":{"$error":"#NAME?"}},{"$f":"IF(preencher!#ref!=\"\",\"\",IF(COUNTIF(preencher!#ref!,preencher!#ref!)=0,CONCATENATE(preencher!#ref!,#REF!),preencher!#ref!))","v":{"$error":"#NAME?"}},{"$f":"IF(preencher!#ref!=\"\",\"\",IF(COUNTIF(preencher!#ref!,preencher!#ref!)=0,CONCATENATE(preencher!#ref!,#REF!),preencher!#ref!))","v":{"$error":"#NAME?"}},{"$f":"IF(preencher!#ref!=\"\",\"\",IF(COUNTIF(preencher!#ref!,preencher!#ref!)=0,CONCATENATE(preencher!#ref!,#REF!),preencher!#ref!))","v":{"$error":"#NAME?"}},{"$f":"IF(preencher!#ref!=\"\",\"\",IF(COUNTIF(preencher!#ref!,preencher!#ref!)=0,CONCATENATE(preencher!#ref!,#REF!),preencher!#ref!))","v":{"$error":"#NAME?"}},{"$f":"IF(preencher!#ref!=\"\",\"\",IF(COUNTIF(preencher!#ref!,preencher!#ref!)=0,CONCATENATE(preencher!#ref!,#REF!),preencher!#ref!))","v":{"$error":"#NAME?"}},{"$f":"IF(preencher!#ref!=\"\",\"\",IF(COUNTIF(preencher!#ref!,preencher!#ref!)=0,CONCATENATE(preencher!#ref!,#REF!),preencher!#ref!))","v":{"$error":"#NAME?"}},{"$f":"IF(preencher!#ref!=\"\",\"\",IF(COUNTIF(preencher!#ref!,preencher!#ref!)=0,CONCATENATE(preencher!#ref!,#REF!),preencher!#ref!))","v":{"$error":"#NAME?"}},{"$f":"IF(ISERROR(ROUND(AVERAGE(E33:N33),2)),\"\",ROUND(AVERAGE(E33:N33),2))","v":""},{"$f":"IF(ISERROR(ROUND(O33*D33,2)),\"\",ROUND(O33*D33,2))","v":""},null,null,{"$f":"IF(ISERROR(MEDIAN(E33:N33)),\"\",MEDIAN(E33:N33))","v":""},{"$f":"IF(ISERROR(STDEV(E33:N33)),\"\",STDEV(E33:N33))","v":""},{"$f":"IF(ISERROR(T33/O33),\"\",T33/O33)","v":""}]
[{"$f":"IF(preencher!#ref!=\"\",\"\",preencher!#ref!)","v":{"$error":"#NAME?"}},{"$f":"IF(preencher!#ref!=\"\",\"\",preencher!#ref!)","v":{"$error":"#NAME?"}},{"$f":"IF(preencher!#ref!=\"\",\"\",preencher!#ref!)","v":{"$error":"#NAME?"}},{"$f":"IF(preencher!#ref!=\"\",\"\",preencher!#ref!)","v":{"$error":"#NAME?"}},{"$f":"IF(preencher!#ref!=\"\",\"\",IF(COUNTIF(preencher!#ref!,preencher!#ref!)=0,CONCATENATE(preencher!#ref!,#REF!),preencher!#ref!))","v":{"$error":"#NAME?"}},{"$f":"IF(preencher!#ref!=\"\",\"\",IF(COUNTIF(preencher!#ref!,preencher!#ref!)=0,CONCATENATE(preencher!#ref!,#REF!),preencher!#ref!))","v":{"$error":"#NAME?"}},{"$f":"IF(preencher!#ref!=\"\",\"\",IF(COUNTIF(preencher!#ref!,preencher!#ref!)=0,CONCATENATE(preencher!#ref!,#REF!),preencher!#ref!))","v":{"$error":"#NAME?"}},{"$f":"IF(preencher!#ref!=\"\",\"\",IF(COUNTIF(preencher!#ref!,preencher!#ref!)=0,CONCATENATE(preencher!#ref!,#REF!),preencher!#ref!))","v":{"$error":"#NAME?"}},{"$f":"IF(preencher!#ref!=\"\",\"\",IF(COUNTIF(preencher!#ref!,preencher!#ref!)=0,CONCATENATE(preencher!#ref!,#REF!),preencher!#ref!))","v":{"$error":"#NAME?"}},{"$f":"IF(preencher!#ref!=\"\",\"\",IF(COUNTIF(preencher!#ref!,preencher!#ref!)=0,CONCATENATE(preencher!#ref!,#REF!),preencher!#ref!))","v":{"$error":"#NAME?"}},{"$f":"IF(preencher!#ref!=\"\",\"\",IF(COUNTIF(preencher!#ref!,preencher!#ref!)=0,CONCATENATE(preencher!#ref!,#REF!),preencher!#ref!))","v":{"$error":"#NAME?"}},{"$f":"IF(preencher!#ref!=\"\",\"\",IF(COUNTIF(preencher!#ref!,preencher!#ref!)=0,CONCATENATE(preencher!#ref!,#REF!),preencher!#ref!))","v":{"$error":"#NAME?"}},{"$f":"IF(preencher!#ref!=\"\",\"\",IF(COUNTIF(preencher!#ref!,preencher!#ref!)=0,CONCATENATE(preencher!#ref!,#REF!),preencher!#ref!))","v":{"$error":"#NAME?"}},{"$f":"IF(preencher!#ref!=\"\",\"\",IF(COUNTIF(preencher!#ref!,preencher!#ref!)=0,CONCATENATE(preencher!#ref!,#REF!),preencher!#ref!))","v":{"$error":"#NAME?"}},{"$f":"IF(ISERROR(ROUND(AVERAGE(E34:N34),2)),\"\",ROUND(AVERAGE(E34:N34),2))","v":""},{"$f":"IF(ISERROR(ROUND(O34*D34,2)),\"\",ROUND(O34*D34,2))","v":""},null,null,{"$f":"IF(ISERROR(MEDIAN(E34:N34)),\"\",MEDIAN(E34:N34))","v":""},{"$f":"IF(ISERROR(STDEV(E34:N34)),\"\",STDEV(E34:N34))","v":""},{"$f":"IF(ISERROR(T34/O34),\"\",T34/O34)","v":""}]
[{"$f":"IF(preencher!#ref!=\"\",\"\",preencher!#ref!)","v":{"$error":"#NAME?"}},{"$f":"IF(preencher!#ref!=\"\",\"\",preencher!#ref!)","v":{"$error":"#NAME?"}},{"$f":"IF(preencher!#ref!=\"\",\"\",preencher!#ref!)","v":{"$error":"#NAME?"}},{"$f":"IF(preencher!#ref!=\"\",\"\",preencher!#ref!)","v":{"$error":"#NAME?"}},{"$f":"IF(preencher!#ref!=\"\",\"\",IF(COUNTIF(preencher!#ref!,preencher!#ref!)=0,CONCATENATE(preencher!#ref!,#REF!),preencher!#ref!))","v":{"$error":"#NAME?"}},{"$f":"IF(preencher!#ref!=\"\",\"\",IF(COUNTIF(preencher!#ref!,preencher!#ref!)=0,CONCATENATE(preencher!#ref!,#REF!),preencher!#ref!))","v":{"$error":"#NAME?"}},{"$f":"IF(preencher!#ref!=\"\",\"\",IF(COUNTIF(preencher!#ref!,preencher!#ref!)=0,CONCATENATE(preencher!#ref!,#REF!),preencher!#ref!))","v":{"$error":"#NAME?"}},{"$f":"IF(preencher!#ref!=\"\",\"\",IF(COUNTIF(preencher!#ref!,preencher!#ref!)=0,CONCATENATE(preencher!#ref!,#REF!),preencher!#ref!))","v":{"$error":"#NAME?"}},{"$f":"IF(preencher!#ref!=\"\",\"\",IF(COUNTIF(preencher!#ref!,preencher!#ref!)=0,CONCATENATE(preencher!#ref!,#REF!),preencher!#ref!))","v":{"$error":"#NAME?"}},{"$f":"IF(preencher!#ref!=\"\",\"\",IF(COUNTIF(preencher!#ref!,preencher!#ref!)=0,CONCATENATE(preencher!#ref!,#REF!),preencher!#ref!))","v":{"$error":"#NAME?"}},{"$f":"IF(preencher!#ref!=\"\",\"\",IF(COUNTIF(preencher!#ref!,preencher!#ref!)=0,CONCATENATE(preencher!#ref!,#REF!),preencher!#ref!))","v":{"$error":"#NAME?"}},{"$f":"IF(preencher!#ref!=\"\",\"\",IF(COUNTIF(preencher!#ref!,preencher!#ref!)=0,CONCATENATE(preencher!#ref!,#REF!),preencher!#ref!))","v":{"$error":"#NAME?"}},{"$f":"IF(preencher!#ref!=\"\",\"\",IF(COUNTIF(preencher!#ref!,preencher!#ref!)=0,CONCATENATE(preencher!#ref!,#REF!),preencher!#ref!))","v":{"$error":"#NAME?"}},{"$f":"IF(preencher!#ref!=\"\",\"\",IF(COUNTIF(preencher!#ref!,preencher!#ref!)=0,CONCATENATE(preencher!#ref!,#REF!),preencher!#ref!))","v":{"$error":"#NAME?"}},{"$f":"IF(ISERROR(ROUND(AVERAGE(E35:N35),2)),\"\",ROUND(AVERAGE(E35:N35),2))","v":""},{"$f":"IF(ISERROR(ROUND(O35*D35,2)),\"\",ROUND(O35*D35,2))","v":""},null,null,{"$f":"IF(ISERROR(MEDIAN(E35:N35)),\"\",MEDIAN(E35:N35))","v":""},{"$f":"IF(ISERROR(STDEV(E35:N35)),\"\",STDEV(E35:N35))","v":""},{"$f":"IF(ISERROR(T35/O35),\"\",T35/O35)","v":""}]
[{"$f":"IF(preencher!#ref!=\"\",\"\",preencher!#ref!)","v":{"$error":"#NAME?"}},{"$f":"IF(preencher!#ref!=\"\",\"\",preencher!#ref!)","v":{"$error":"#NAME?"}},{"$f":"IF(preencher!#ref!=\"\",\"\",preencher!#ref!)","v":{"$error":"#NAME?"}},{"$f":"IF(preencher!#ref!=\"\",\"\",preencher!#ref!)","v":{"$error":"#NAME?"}},{"$f":"IF(preencher!#ref!=\"\",\"\",IF(COUNTIF(preencher!#ref!,preencher!#ref!)=0,CONCATENATE(preencher!#ref!,#REF!),preencher!#ref!))","v":{"$error":"#NAME?"}},{"$f":"IF(preencher!#ref!=\"\",\"\",IF(COUNTIF(preencher!#ref!,preencher!#ref!)=0,CONCATENATE(preencher!#ref!,#REF!),preencher!#ref!))","v":{"$error":"#NAME?"}},{"$f":"IF(preencher!#ref!=\"\",\"\",IF(COUNTIF(preencher!#ref!,preencher!#ref!)=0,CONCATENATE(preencher!#ref!,#REF!),preencher!#ref!))","v":{"$error":"#NAME?"}},{"$f":"IF(preencher!#ref!=\"\",\"\",IF(COUNTIF(preencher!#ref!,preencher!#ref!)=0,CONCATENATE(preencher!#ref!,#REF!),preencher!#ref!))","v":{"$error":"#NAME?"}},{"$f":"IF(preencher!#ref!=\"\",\"\",IF(COUNTIF(preencher!#ref!,preencher!#ref!)=0,CONCATENATE(preencher!#ref!,#REF!),preencher!#ref!))","v":{"$error":"#NAME?"}},{"$f":"IF(preencher!#ref!=\"\",\"\",IF(COUNTIF(preencher!#ref!,preencher!#ref!)=0,CONCATENATE(preencher!#ref!,#REF!),preencher!#ref!))","v":{"$error":"#NAME?"}},{"$f":"IF(preencher!#ref!=\"\",\"\",IF(COUNTIF(preencher!#ref!,preencher!#ref!)=0,CONCATENATE(preencher!#ref!,#REF!),preencher!#ref!))","v":{"$error":"#NAME?"}},{"$f":"IF(preencher!#ref!=\"\",\"\",IF(COUNTIF(preencher!#ref!,preencher!#ref!)=0,CONCATENATE(preencher!#ref!,#REF!),preencher!#ref!))","v":{"$error":"#NAME?"}},{"$f":"IF(preencher!#ref!=\"\",\"\",IF(COUNTIF(preencher!#ref!,preencher!#ref!)=0,CONCATENATE(preencher!#ref!,#REF!),preencher!#ref!))","v":{"$error":"#NAME?"}},{"$f":"IF(preencher!#ref!=\"\",\"\",IF(COUNTIF(preencher!#ref!,preencher!#ref!)=0,CONCATENATE(preencher!#ref!,#REF!),preencher!#ref!))","v":{"$error":"#NAME?"}},{"$f":"IF(ISERROR(ROUND(AVERAGE(E36:N36),2)),\"\",ROUND(AVERAGE(E36:N36),2))","v":""},{"$f":"IF(ISERROR(ROUND(O36*D36,2)),\"\",ROUND(O36*D36,2))","v":""},null,null,{"$f":"IF(ISERROR(MEDIAN(E36:N36)),\"\",MEDIAN(E36:N36))","v":""},{"$f":"IF(ISERROR(STDEV(E36:N36)),\"\",STDEV(E36:N36))","v":""},{"$f":"IF(ISERROR(T36/O36),\"\",T36/O36)","v":""}]
[{"$f":"IF(preencher!#ref!=\"\",\"\",preencher!#ref!)","v":{"$error":"#NAME?"}},{"$f":"IF(preencher!#ref!=\"\",\"\",preencher!#ref!)","v":{"$error":"#NAME?"}},{"$f":"IF(preencher!#ref!=\"\",\"\",preencher!#ref!)","v":{"$error":"#NAME?"}},{"$f":"IF(preencher!#ref!=\"\",\"\",preencher!#ref!)","v":{"$error":"#NAME?"}},{"$f":"IF(preencher!#ref!=\"\",\"\",IF(COUNTIF(preencher!#ref!,preencher!#ref!)=0,CONCATENATE(preencher!#ref!,#REF!),preencher!#ref!))","v":{"$error":"#NAME?"}},{"$f":"IF(preencher!#ref!=\"\",\"\",IF(COUNTIF(preencher!#ref!,preencher!#ref!)=0,CONCATENATE(preencher!#ref!,#REF!),preencher!#ref!))","v":{"$error":"#NAME?"}},{"$f":"IF(preencher!#ref!=\"\",\"\",IF(COUNTIF(preencher!#ref!,preencher!#ref!)=0,CONCATENATE(preencher!#ref!,#REF!),preencher!#ref!))","v":{"$error":"#NAME?"}},{"$f":"IF(preencher!#ref!=\"\",\"\",IF(COUNTIF(preencher!#ref!,preencher!#ref!)=0,CONCATENATE(preencher!#ref!,#REF!),preencher!#ref!))","v":{"$error":"#NAME?"}},{"$f":"IF(preencher!#ref!=\"\",\"\",IF(COUNTIF(preencher!#ref!,preencher!#ref!)=0,CONCATENATE(preencher!#ref!,#REF!),preencher!#ref!))","v":{"$error":"#NAME?"}},{"$f":"IF(preencher!#ref!=\"\",\"\",IF(COUNTIF(preencher!#ref!,preencher!#ref!)=0,CONCATENATE(preencher!#ref!,#REF!),preencher!#ref!))","v":{"$error":"#NAME?"}},{"$f":"IF(preencher!#ref!=\"\",\"\",IF(COUNTIF(preencher!#ref!,preencher!#ref!)=0,CONCATENATE(preencher!#ref!,#REF!),preencher!#ref!))","v":{"$error":"#NAME?"}},{"$f":"IF(preencher!#ref!=\"\",\"\",IF(COUNTIF(preencher!#ref!,preencher!#ref!)=0,CONCATENATE(preencher!#ref!,#REF!),preencher!#ref!))","v":{"$error":"#NAME?"}},{"$f":"IF(preencher!#ref!=\"\",\"\",IF(COUNTIF(preencher!#ref!,preencher!#ref!)=0,CONCATENATE(preencher!#ref!,#REF!),preencher!#ref!))","v":{"$error":"#NAME?"}},{"$f":"IF(preencher!#ref!=\"\",\"\",IF(COUNTIF(preencher!#ref!,preencher!#ref!)=0,CONCATENATE(preencher!#ref!,#REF!),preencher!#ref!))","v":{"$error":"#NAME?"}},{"$f":"IF(ISERROR(ROUND(AVERAGE(E37:N37),2)),\"\",ROUND(AVERAGE(E37:N37),2))","v":""},{"$f":"IF(ISERROR(ROUND(O37*D37,2)),\"\",ROUND(O37*D37,2))","v":""},null,null,{"$f":"IF(ISERROR(MEDIAN(E37:N37)),\"\",MEDIAN(E37:N37))","v":""},{"$f":"IF(ISERROR(STDEV(E37:N37)),\"\",STDEV(E37:N37))","v":""},{"$f":"IF(ISERROR(T37/O37),\"\",T37/O37)","v":""}]
[{"$f":"IF(preencher!#ref!=\"\",\"\",preencher!#ref!)","v":{"$error":"#NAME?"}},{"$f":"IF(preencher!#ref!=\"\",\"\",preencher!#ref!)","v":{"$error":"#NAME?"}},{"$f":"IF(preencher!#ref!=\"\",\"\",preencher!#ref!)","v":{"$error":"#NAME?"}},{"$f":"IF(preencher!#ref!=\"\",\"\",preencher!#ref!)","v":{"$error":"#NAME?"}},{"$f":"IF(preencher!#ref!=\"\",\"\",IF(COUNTIF(preencher!#ref!,preencher!#ref!)=0,CONCATENATE(preencher!#ref!,#REF!),preencher!#ref!))","v":{"$error":"#NAME?"}},{"$f":"IF(preencher!#ref!=\"\",\"\",IF(COUNTIF(preencher!#ref!,preencher!#ref!)=0,CONCATENATE(preencher!#ref!,#REF!),preencher!#ref!))","v":{"$error":"#NAME?"}},{"$f":"IF(preencher!#ref!=\"\",\"\",IF(COUNTIF(preencher!#ref!,preencher!#ref!)=0,CONCATENATE(preencher!#ref!,#REF!),preencher!#ref!))","v":{"$error":"#NAME?"}},{"$f":"IF(preencher!#ref!=\"\",\"\",IF(COUNTIF(preencher!#ref!,preencher!#ref!)=0,CONCATENATE(preencher!#ref!,#REF!),preencher!#ref!))","v":{"$error":"#NAME?"}},{"$f":"IF(preencher!#ref!=\"\",\"\",IF(COUNTIF(preencher!#ref!,preencher!#ref!)=0,CONCATENATE(preencher!#ref!,#REF!),preencher!#ref!))","v":{"$error":"#NAME?"}},{"$f":"IF(preencher!#ref!=\"\",\"\",IF(COUNTIF(preencher!#ref!,preencher!#ref!)=0,CONCATENATE(preencher!#ref!,#REF!),preencher!#ref!))","v":{"$error":"#NAME?"}},{"$f":"IF(preencher!#ref!=\"\",\"\",IF(COUNTIF(preencher!#ref!,preencher!#ref!)=0,CONCATENATE(preencher!#ref!,#REF!),preencher!#ref!))","v":{"$error":"#NAME?"}},{"$f":"IF(preencher!#ref!=\"\",\"\",IF(COUNTIF(preencher!#ref!,preencher!#ref!)=0,CONCATENATE(preencher!#ref!,#REF!),preencher!#ref!))","v":{"$error":"#NAME?"}},{"$f":"IF(preencher!#ref!=\"\",\"\",IF(COUNTIF(preencher!#ref!,preencher!#ref!)=0,CONCATENATE(preencher!#ref!,#REF!),preencher!#ref!))","v":{"$error":"#NAME?"}},{"$f":"IF(preencher!#ref!=\"\",\"\",IF(COUNTIF(preencher!#ref!,preencher!#ref!)=0,CONCATENATE(preencher!#ref!,#REF!),preencher!#ref!))","v":{"$error":"#NAME?"}},{"$f":"IF(ISERROR(ROUND(AVERAGE(E38:N38),2)),\"\",ROUND(AVERAGE(E38:N38),2))","v":""},{"$f":"IF(ISERROR(ROUND(O38*D38,2)),\"\",ROUND(O38*D38,2))","v":""},null,null,{"$f":"IF(ISERROR(MEDIAN(E38:N38)),\"\",MEDIAN(E38:N38))","v":""},{"$f":"IF(ISERROR(STDEV(E38:N38)),\"\",STDEV(E38:N38))","v":""},{"$f":"IF(ISERROR(T38/O38),\"\",T38/O38)","v":""}]
[{"$f":"IF(preencher!#ref!=\"\",\"\",preencher!#ref!)","v":{"$error":"#NAME?"}},{"$f":"IF(preencher!#ref!=\"\",\"\",preencher!#ref!)","v":{"$error":"#NAME?"}},{"$f":"IF(preencher!#ref!=\"\",\"\",preencher!#ref!)","v":{"$error":"#NAME?"}},{"$f":"IF(preencher!#ref!=\"\",\"\",preencher!#ref!)","v":{"$error":"#NAME?"}},{"$f":"IF(preencher!#ref!=\"\",\"\",IF(COUNTIF(preencher!#ref!,preencher!#ref!)=0,CONCATENATE(preencher!#ref!,#REF!),preencher!#ref!))","v":{"$error":"#NAME?"}},{"$f":"IF(preencher!#ref!=\"\",\"\",IF(COUNTIF(preencher!#ref!,preencher!#ref!)=0,CONCATENATE(preencher!#ref!,#REF!),preencher!#ref!))","v":{"$error":"#NAME?"}},{"$f":"IF(preencher!#ref!=\"\",\"\",IF(COUNTIF(preencher!#ref!,preencher!#ref!)=0,CONCATENATE(preencher!#ref!,#REF!),preencher!#ref!))","v":{"$error":"#NAME?"}},{"$f":"IF(preencher!#ref!=\"\",\"\",IF(COUNTIF(preencher!#ref!,preencher!#ref!)=0,CONCATENATE(preencher!#ref!,#REF!),preencher!#ref!))","v":{"$error":"#NAME?"}},{"$f":"IF(preencher!#ref!=\"\",\"\",IF(COUNTIF(preencher!#ref!,preencher!#ref!)=0,CONCATENATE(preencher!#ref!,#REF!),preencher!#ref!))","v":{"$error":"#NAME?"}},{"$f":"IF(preencher!#ref!=\"\",\"\",IF(COUNTIF(preencher!#ref!,preencher!#ref!)=0,CONCATENATE(preencher!#ref!,#REF!),preencher!#ref!))","v":{"$error":"#NAME?"}},{"$f":"IF(preencher!#ref!=\"\",\"\",IF(COUNTIF(preencher!#ref!,preencher!#ref!)=0,CONCATENATE(preencher!#ref!,#REF!),preencher!#ref!))","v":{"$error":"#NAME?"}},{"$f":"IF(preencher!#ref!=\"\",\"\",IF(COUNTIF(preencher!#ref!,preencher!#ref!)=0,CONCATENATE(preencher!#ref!,#REF!),preencher!#ref!))","v":{"$error":"#NAME?"}},{"$f":"IF(preencher!#ref!=\"\",\"\",IF(COUNTIF(preencher!#ref!,preencher!#ref!)=0,CONCATENATE(preencher!#ref!,#REF!),preencher!#ref!))","v":{"$error":"#NAME?"}},{"$f":"IF(preencher!#ref!=\"\",\"\",IF(COUNTIF(preencher!#ref!,preencher!#ref!)=0,CONCATENATE(preencher!#ref!,#REF!),preencher!#ref!))","v":{"$error":"#NAME?"}},{"$f":"IF(ISERROR(ROUND(AVERAGE(E39:N39),2)),\"\",ROUND(AVERAGE(E39:N39),2))","v":""},{"$f":"IF(ISERROR(ROUND(O39*D39,2)),\"\",ROUND(O39*D39,2))","v":""},null,null,{"$f":"IF(ISERROR(MEDIAN(E39:N39)),\"\",MEDIAN(E39:N39))","v":""},{"$f":"IF(ISERROR(STDEV(E39:N39)),\"\",STDEV(E39:N39))","v":""},{"$f":"IF(ISERROR(T39/O39),\"\",T39/O39)","v":""}]
[{"$f":"IF(preencher!#ref!=\"\",\"\",preencher!#ref!)","v":{"$error":"#NAME?"}},{"$f":"IF(preencher!#ref!=\"\",\"\",preencher!#ref!)","v":{"$error":"#NAME?"}},{"$f":"IF(preencher!#ref!=\"\",\"\",preencher!#ref!)","v":{"$error":"#NAME?"}},{"$f":"IF(preencher!#ref!=\"\",\"\",preencher!#ref!)","v":{"$error":"#NAME?"}},{"$f":"IF(preencher!#ref!=\"\",\"\",IF(COUNTIF(preencher!#ref!,preencher!#ref!)=0,CONCATENATE(preencher!#ref!,#REF!),preencher!#ref!))","v":{"$error":"#NAME?"}},{"$f":"IF(preencher!#ref!=\"\",\"\",IF(COUNTIF(preencher!#ref!,preencher!#ref!)=0,CONCATENATE(preencher!#ref!,#REF!),preencher!#ref!))","v":{"$error":"#NAME?"}},{"$f":"IF(preencher!#ref!=\"\",\"\",IF(COUNTIF(preencher!#ref!,preencher!#ref!)=0,CONCATENATE(preencher!#ref!,#REF!),preencher!#ref!))","v":{"$error":"#NAME?"}},{"$f":"IF(preencher!#ref!=\"\",\"\",IF(COUNTIF(preencher!#ref!,preencher!#ref!)=0,CONCATENATE(preencher!#ref!,#REF!),preencher!#ref!))","v":{"$error":"#NAME?"}},{"$f":"IF(preencher!#ref!=\"\",\"\",IF(COUNTIF(preencher!#ref!,preencher!#ref!)=0,CONCATENATE(preencher!#ref!,#REF!),preencher!#ref!))","v":{"$error":"#NAME?"}},{"$f":"IF(preencher!#ref!=\"\",\"\",IF(COUNTIF(preencher!#ref!,preencher!#ref!)=0,CONCATENATE(preencher!#ref!,#REF!),preencher!#ref!))","v":{"$error":"#NAME?"}},{"$f":"IF(preencher!#ref!=\"\",\"\",IF(COUNTIF(preencher!#ref!,preencher!#ref!)=0,CONCATENATE(preencher!#ref!,#REF!),preencher!#ref!))","v":{"$error":"#NAME?"}},{"$f":"IF(preencher!#ref!=\"\",\"\",IF(COUNTIF(preencher!#ref!,preencher!#ref!)=0,CONCATENATE(preencher!#ref!,#REF!),preencher!#ref!))","v":{"$error":"#NAME?"}},{"$f":"IF(preencher!#ref!=\"\",\"\",IF(COUNTIF(preencher!#ref!,preencher!#ref!)=0,CONCATENATE(preencher!#ref!,#REF!),preencher!#ref!))","v":{"$error":"#NAME?"}},{"$f":"IF(preencher!#ref!=\"\",\"\",IF(COUNTIF(preencher!#ref!,preencher!#ref!)=0,CONCATENATE(preencher!#ref!,#REF!),preencher!#ref!))","v":{"$error":"#NAME?"}},{"$f":"IF(ISERROR(ROUND(AVERAGE(E40:N40),2)),\"\",ROUND(AVERAGE(E40:N40),2))","v":""},{"$f":"IF(ISERROR(ROUND(O40*D40,2)),\"\",ROUND(O40*D40,2))","v":""},null,null,{"$f":"IF(ISERROR(MEDIAN(E40:N40)),\"\",MEDIAN(E40:N40))","v":""},{"$f":"IF(ISERROR(STDEV(E40:N40)),\"\",STDEV(E40:N40))","v":""},{"$f":"IF(ISERROR(T40/O40),\"\",T40/O40)","v":""}]
[{"$f":"IF(preencher!#ref!=\"\",\"\",preencher!#ref!)","v":{"$error":"#NAME?"}},{"$f":"IF(preencher!#ref!=\"\",\"\",preencher!#ref!)","v":{"$error":"#NAME?"}},{"$f":"IF(preencher!#ref!=\"\",\"\",preencher!#ref!)","v":{"$error":"#NAME?"}},{"$f":"IF(preencher!#ref!=\"\",\"\",preencher!#ref!)","v":{"$error":"#NAME?"}},{"$f":"IF(preencher!#ref!=\"\",\"\",IF(COUNTIF(preencher!#ref!,preencher!#ref!)=0,CONCATENATE(preencher!#ref!,#REF!),preencher!#ref!))","v":{"$error":"#NAME?"}},{"$f":"IF(preencher!#ref!=\"\",\"\",IF(COUNTIF(preencher!#ref!,preencher!#ref!)=0,CONCATENATE(preencher!#ref!,#REF!),preencher!#ref!))","v":{"$error":"#NAME?"}},{"$f":"IF(preencher!#ref!=\"\",\"\",IF(COUNTIF(preencher!#ref!,preencher!#ref!)=0,CONCATENATE(preencher!#ref!,#REF!),preencher!#ref!))","v":{"$error":"#NAME?"}},{"$f":"IF(preencher!#ref!=\"\",\"\",IF(COUNTIF(preencher!#ref!,preencher!#ref!)=0,CONCATENATE(preencher!#ref!,#REF!),preencher!#ref!))","v":{"$error":"#NAME?"}},{"$f":"IF(preencher!#ref!=\"\",\"\",IF(COUNTIF(preencher!#ref!,preencher!#ref!)=0,CONCATENATE(preencher!#ref!,#REF!),preencher!#ref!))","v":{"$error":"#NAME?"}},{"$f":"IF(preencher!#ref!=\"\",\"\",IF(COUNTIF(preencher!#ref!,preencher!#ref!)=0,CONCATENATE(preencher!#ref!,#REF!),preencher!#ref!))","v":{"$error":"#NAME?"}},{"$f":"IF(preencher!#ref!=\"\",\"\",IF(COUNTIF(preencher!#ref!,preencher!#ref!)=0,CONCATENATE(preencher!#ref!,#REF!),preencher!#ref!))","v":{"$error":"#NAME?"}},{"$f":"IF(preencher!#ref!=\"\",\"\",IF(COUNTIF(preencher!#ref!,preencher!#ref!)=0,CONCATENATE(preencher!#ref!,#REF!),preencher!#ref!))","v":{"$error":"#NAME?"}},{"$f":"IF(preencher!#ref!=\"\",\"\",IF(COUNTIF(preencher!#ref!,preencher!#ref!)=0,CONCATENATE(preencher!#ref!,#REF!),preencher!#ref!))","v":{"$error":"#NAME?"}},{"$f":"IF(preencher!#ref!=\"\",\"\",IF(COUNTIF(preencher!#ref!,preencher!#ref!)=0,CONCATENATE(preencher!#ref!,#REF!),preencher!#ref!))","v":{"$error":"#NAME?"}},{"$f":"IF(ISERROR(ROUND(AVERAGE(E41:N41),2)),\"\",ROUND(AVERAGE(E41:N41),2))","v":""},{"$f":"IF(ISERROR(ROUND(O41*D41,2)),\"\",ROUND(O41*D41,2))","v":""},null,null,{"$f":"IF(ISERROR(MEDIAN(E41:N41)),\"\",MEDIAN(E41:N41))","v":""},{"$f":"IF(ISERROR(STDEV(E41:N41)),\"\",STDEV(E41:N41))","v":""},{"$f":"IF(ISERROR(T41/O41),\"\",T41/O41)","v":""}]
[{"$f":"IF(preencher!#ref!=\"\",\"\",preencher!#ref!)","v":{"$error":"#NAME?"}},{"$f":"IF(preencher!#ref!=\"\",\"\",preencher!#ref!)","v":{"$error":"#NAME?"}},{"$f":"IF(preencher!#ref!=\"\",\"\",preencher!#ref!)","v":{"$error":"#NAME?"}},{"$f":"IF(preencher!#ref!=\"\",\"\",preencher!#ref!)","v":{"$error":"#NAME?"}},{"$f":"IF(preencher!#ref!=\"\",\"\",IF(COUNTIF(preencher!#ref!,preencher!#ref!)=0,CONCATENATE(preencher!#ref!,#REF!),preencher!#ref!))","v":{"$error":"#NAME?"}},{"$f":"IF(preencher!#ref!=\"\",\"\",IF(COUNTIF(preencher!#ref!,preencher!#ref!)=0,CONCATENATE(preencher!#ref!,#REF!),preencher!#ref!))","v":{"$error":"#NAME?"}},{"$f":"IF(preencher!#ref!=\"\",\"\",IF(COUNTIF(preencher!#ref!,preencher!#ref!)=0,CONCATENATE(preencher!#ref!,#REF!),preencher!#ref!))","v":{"$error":"#NAME?"}},{"$f":"IF(preencher!#ref!=\"\",\"\",IF(COUNTIF(preencher!#ref!,preencher!#ref!)=0,CONCATENATE(preencher!#ref!,#REF!),preencher!#ref!))","v":{"$error":"#NAME?"}},{"$f":"IF(preencher!#ref!=\"\",\"\",IF(COUNTIF(preencher!#ref!,preencher!#ref!)=0,CONCATENATE(preencher!#ref!,#REF!),preencher!#ref!))","v":{"$error":"#NAME?"}},{"$f":"IF(preencher!#ref!=\"\",\"\",IF(COUNTIF(preencher!#ref!,preencher!#ref!)=0,CONCATENATE(preencher!#ref!,#REF!),preencher!#ref!))","v":{"$error":"#NAME?"}},{"$f":"IF(preencher!#ref!=\"\",\"\",IF(COUNTIF(preencher!#ref!,preencher!#ref!)=0,CONCATENATE(preencher!#ref!,#REF!),preencher!#ref!))","v":{"$error":"#NAME?"}},{"$f":"IF(preencher!#ref!=\"\",\"\",IF(COUNTIF(preencher!#ref!,preencher!#ref!)=0,CONCATENATE(preencher!#ref!,#REF!),preencher!#ref!))","v":{"$error":"#NAME?"}},{"$f":"IF(preencher!#ref!=\"\",\"\",IF(COUNTIF(preencher!#ref!,preencher!#ref!)=0,CONCATENATE(preencher!#ref!,#REF!),preencher!#ref!))","v":{"$error":"#NAME?"}},{"$f":"IF(preencher!#ref!=\"\",\"\",IF(COUNTIF(preencher!#ref!,preencher!#ref!)=0,CONCATENATE(preencher!#ref!,#REF!),preencher!#ref!))","v":{"$error":"#NAME?"}},{"$f":"IF(ISERROR(ROUND(AVERAGE(E42:N42),2)),\"\",ROUND(AVERAGE(E42:N42),2))","v":""},{"$f":"IF(ISERROR(ROUND(O42*D42,2)),\"\",ROUND(O42*D42,2))","v":""},null,null,{"$f":"IF(ISERROR(MEDIAN(E42:N42)),\"\",MEDIAN(E42:N42))","v":""},{"$f":"IF(ISERROR(STDEV(E42:N42)),\"\",STDEV(E42:N42))","v":""},{"$f":"IF(ISERROR(T42/O42),\"\",T42/O42)","v":""}]
[{"$f":"IF(preencher!#ref!=\"\",\"\",preencher!#ref!)","v":{"$error":"#NAME?"}},{"$f":"IF(preencher!#ref!=\"\",\"\",preencher!#ref!)","v":{"$error":"#NAME?"}},{"$f":"IF(preencher!#ref!=\"\",\"\",preencher!#ref!)","v":{"$error":"#NAME?"}},{"$f":"IF(preencher!#ref!=\"\",\"\",preencher!#ref!)","v":{"$error":"#NAME?"}},{"$f":"IF(preencher!#ref!=\"\",\"\",IF(COUNTIF(preencher!#ref!,preencher!#ref!)=0,CONCATENATE(preencher!#ref!,#REF!),preencher!#ref!))","v":{"$error":"#NAME?"}},{"$f":"IF(preencher!#ref!=\"\",\"\",IF(COUNTIF(preencher!#ref!,preencher!#ref!)=0,CONCATENATE(preencher!#ref!,#REF!),preencher!#ref!))","v":{"$error":"#NAME?"}},{"$f":"IF(preencher!#ref!=\"\",\"\",IF(COUNTIF(preencher!#ref!,preencher!#ref!)=0,CONCATENATE(preencher!#ref!,#REF!),preencher!#ref!))","v":{"$error":"#NAME?"}},{"$f":"IF(preencher!#ref!=\"\",\"\",IF(COUNTIF(preencher!#ref!,preencher!#ref!)=0,CONCATENATE(preencher!#ref!,#REF!),preencher!#ref!))","v":{"$error":"#NAME?"}},{"$f":"IF(preencher!#ref!=\"\",\"\",IF(COUNTIF(preencher!#ref!,preencher!#ref!)=0,CONCATENATE(preencher!#ref!,#REF!),preencher!#ref!))","v":{"$error":"#NAME?"}},{"$f":"IF(preencher!#ref!=\"\",\"\",IF(COUNTIF(preencher!#ref!,preencher!#ref!)=0,CONCATENATE(preencher!#ref!,#REF!),preencher!#ref!))","v":{"$error":"#NAME?"}},{"$f":"IF(preencher!#ref!=\"\",\"\",IF(COUNTIF(preencher!#ref!,preencher!#ref!)=0,CONCATENATE(preencher!#ref!,#REF!),preencher!#ref!))","v":{"$error":"#NAME?"}},{"$f":"IF(preencher!#ref!=\"\",\"\",IF(COUNTIF(preencher!#ref!,preencher!#ref!)=0,CONCATENATE(preencher!#ref!,#REF!),preencher!#ref!))","v":{"$error":"#NAME?"}},{"$f":"IF(preencher!#ref!=\"\",\"\",IF(COUNTIF(preencher!#ref!,preencher!#ref!)=0,CONCATENATE(preencher!#ref!,#REF!),preencher!#ref!))","v":{"$error":"#NAME?"}},{"$f":"IF(preencher!#ref!=\"\",\"\",IF(COUNTIF(preencher!#ref!,preencher!#ref!)=0,CONCATENATE(preencher!#ref!,#REF!),preencher!#ref!))","v":{"$error":"#NAME?"}},{"$f":"IF(ISERROR(ROUND(AVERAGE(E43:N43),2)),\"\",ROUND(AVERAGE(E43:N43),2))","v":""},{"$f":"IF(ISERROR(ROUND(O43*D43,2)),\"\",ROUND(O43*D43,2))","v":""},null,null,{"$f":"IF(ISERROR(MEDIAN(E43:N43)),\"\",MEDIAN(E43:N43))","v":""},{"$f":"IF(ISERROR(STDEV(E43:N43)),\"\",STDEV(E43:N43))","v":""},{"$f":"IF(ISERROR(T43/O43),\"\",T43/O43)","v":""}]
[{"$f":"IF(preencher!#ref!=\"\",\"\",preencher!#ref!)","v":{"$error":"#NAME?"}},{"$f":"IF(preencher!#ref!=\"\",\"\",preencher!#ref!)","v":{"$error":"#NAME?"}},{"$f":"IF(preencher!#ref!=\"\",\"\",preencher!#ref!)","v":{"$error":"#NAME?"}},{"$f":"IF(preencher!#ref!=\"\",\"\",preencher!#ref!)","v":{"$error":"#NAME?"}},{"$f":"IF(preencher!#ref!=\"\",\"\",IF(COUNTIF(preencher!#ref!,preencher!#ref!)=0,CONCATENATE(preencher!#ref!,#REF!),preencher!#ref!))","v":{"$error":"#NAME?"}},{"$f":"IF(preencher!#ref!=\"\",\"\",IF(COUNTIF(preencher!#ref!,preencher!#ref!)=0,CONCATENATE(preencher!#ref!,#REF!),preencher!#ref!))","v":{"$error":"#NAME?"}},{"$f":"IF(preencher!#ref!=\"\",\"\",IF(COUNTIF(preencher!#ref!,preencher!#ref!)=0,CONCATENATE(preencher!#ref!,#REF!),preencher!#ref!))","v":{"$error":"#NAME?"}},{"$f":"IF(preencher!#ref!=\"\",\"\",IF(COUNTIF(preencher!#ref!,preencher!#ref!)=0,CONCATENATE(preencher!#ref!,#REF!),preencher!#ref!))","v":{"$error":"#NAME?"}},{"$f":"IF(preencher!#ref!=\"\",\"\",IF(COUNTIF(preencher!#ref!,preencher!#ref!)=0,CONCATENATE(preencher!#ref!,#REF!),preencher!#ref!))","v":{"$error":"#NAME?"}},{"$f":"IF(preencher!#ref!=\"\",\"\",IF(COUNTIF(preencher!#ref!,preencher!#ref!)=0,CONCATENATE(preencher!#ref!,#REF!),preencher!#ref!))","v":{"$error":"#NAME?"}},{"$f":"IF(preencher!#ref!=\"\",\"\",IF(COUNTIF(preencher!#ref!,preencher!#ref!)=0,CONCATENATE(preencher!#ref!,#REF!),preencher!#ref!))","v":{"$error":"#NAME?"}},{"$f":"IF(preencher!#ref!=\"\",\"\",IF(COUNTIF(preencher!#ref!,preencher!#ref!)=0,CONCATENATE(preencher!#ref!,#REF!),preencher!#ref!))","v":{"$error":"#NAME?"}},{"$f":"IF(preencher!#ref!=\"\",\"\",IF(COUNTIF(preencher!#ref!,preencher!#ref!)=0,CONCATENATE(preencher!#ref!,#REF!),preencher!#ref!))","v":{"$error":"#NAME?"}},{"$f":"IF(preencher!#ref!=\"\",\"\",IF(COUNTIF(preencher!#ref!,preencher!#ref!)=0,CONCATENATE(preencher!#ref!,#REF!),preencher!#ref!))","v":{"$error":"#NAME?"}},{"$f":"IF(ISERROR(ROUND(AVERAGE(E44:N44),2)),\"\",ROUND(AVERAGE(E44:N44),2))","v":""},{"$f":"IF(ISERROR(ROUND(O44*D44,2)),\"\",ROUND(O44*D44,2))","v":""},null,null,{"$f":"IF(ISERROR(MEDIAN(E44:N44)),\"\",MEDIAN(E44:N44))","v":""},{"$f":"IF(ISERROR(STDEV(E44:N44)),\"\",STDEV(E44:N44))","v":""},{"$f":"IF(ISERROR(T44/O44),\"\",T44/O44)","v":""}]
[{"$f":"IF(preencher!#ref!=\"\",\"\",preencher!#ref!)","v":{"$error":"#NAME?"}},{"$f":"IF(preencher!#ref!=\"\",\"\",preencher!#ref!)","v":{"$error":"#NAME?"}},{"$f":"IF(preencher!#ref!=\"\",\"\",preencher!#ref!)","v":{"$error":"#NAME?"}},{"$f":"IF(preencher!#ref!=\"\",\"\",preencher!#ref!)","v":{"$error":"#NAME?"}},{"$f":"IF(preencher!#ref!=\"\",\"\",IF(COUNTIF(preencher!#ref!,preencher!#ref!)=0,CONCATENATE(preencher!#ref!,#REF!),preencher!#ref!))","v":{"$error":"#NAME?"}},{"$f":"IF(preencher!#ref!=\"\",\"\",IF(COUNTIF(preencher!#ref!,preencher!#ref!)=0,CONCATENATE(preencher!#ref!,#REF!),preencher!#ref!))","v":{"$error":"#NAME?"}},{"$f":"IF(preencher!#ref!=\"\",\"\",IF(COUNTIF(preencher!#ref!,preencher!#ref!)=0,CONCATENATE(preencher!#ref!,#REF!),preencher!#ref!))","v":{"$error":"#NAME?"}},{"$f":"IF(preencher!#ref!=\"\",\"\",IF(COUNTIF(preencher!#ref!,preencher!#ref!)=0,CONCATENATE(preencher!#ref!,#REF!),preencher!#ref!))","v":{"$error":"#NAME?"}},{"$f":"IF(preencher!#ref!=\"\",\"\",IF(COUNTIF(preencher!#ref!,preencher!#ref!)=0,CONCATENATE(preencher!#ref!,#REF!),preencher!#ref!))","v":{"$error":"#NAME?"}},{"$f":"IF(preencher!#ref!=\"\",\"\",IF(COUNTIF(preencher!#ref!,preencher!#ref!)=0,CONCATENATE(preencher!#ref!,#REF!),preencher!#ref!))","v":{"$error":"#NAME?"}},{"$f":"IF(preencher!#ref!=\"\",\"\",IF(COUNTIF(preencher!#ref!,preencher!#ref!)=0,CONCATENATE(preencher!#ref!,#REF!),preencher!#ref!))","v":{"$error":"#NAME?"}},{"$f":"IF(preencher!#ref!=\"\",\"\",IF(COUNTIF(preencher!#ref!,preencher!#ref!)=0,CONCATENATE(preencher!#ref!,#REF!),preencher!#ref!))","v":{"$error":"#NAME?"}},{"$f":"IF(preencher!#ref!=\"\",\"\",IF(COUNTIF(preencher!#ref!,preencher!#ref!)=0,CONCATENATE(preencher!#ref!,#REF!),preencher!#ref!))","v":{"$error":"#NAME?"}},{"$f":"IF(preencher!#ref!=\"\",\"\",IF(COUNTIF(preencher!#ref!,preencher!#ref!)=0,CONCATENATE(preencher!#ref!,#REF!),preencher!#ref!))","v":{"$error":"#NAME?"}},{"$f":"IF(ISERROR(ROUND(AVERAGE(E45:N45),2)),\"\",ROUND(AVERAGE(E45:N45),2))","v":""},{"$f":"IF(ISERROR(ROUND(O45*D45,2)),\"\",ROUND(O45*D45,2))","v":""},null,null,{"$f":"IF(ISERROR(MEDIAN(E45:N45)),\"\",MEDIAN(E45:N45))","v":""},{"$f":"IF(ISERROR(STDEV(E45:N45)),\"\",STDEV(E45:N45))","v":""},{"$f":"IF(ISERROR(T45/O45),\"\",T45/O45)","v":""}]
[{"$f":"IF(preencher!#ref!=\"\",\"\",preencher!#ref!)","v":{"$error":"#NAME?"}},{"$f":"IF(preencher!#ref!=\"\",\"\",preencher!#ref!)","v":{"$error":"#NAME?"}},{"$f":"IF(preencher!#ref!=\"\",\"\",preencher!#ref!)","v":{"$error":"#NAME?"}},{"$f":"IF(preencher!#ref!=\"\",\"\",preencher!#ref!)","v":{"$error":"#NAME?"}},{"$f":"IF(preencher!#ref!=\"\",\"\",IF(COUNTIF(preencher!#ref!,preencher!#ref!)=0,CONCATENATE(preencher!#ref!,#REF!),preencher!#ref!))","v":{"$error":"#NAME?"}},{"$f":"IF(preencher!#ref!=\"\",\"\",IF(COUNTIF(preencher!#ref!,preencher!#ref!)=0,CONCATENATE(preencher!#ref!,#REF!),preencher!#ref!))","v":{"$error":"#NAME?"}},{"$f":"IF(preencher!#ref!=\"\",\"\",IF(COUNTIF(preencher!#ref!,preencher!#ref!)=0,CONCATENATE(preencher!#ref!,#REF!),preencher!#ref!))","v":{"$error":"#NAME?"}},{"$f":"IF(preencher!#ref!=\"\",\"\",IF(COUNTIF(preencher!#ref!,preencher!#ref!)=0,CONCATENATE(preencher!#ref!,#REF!),preencher!#ref!))","v":{"$error":"#NAME?"}},{"$f":"IF(preencher!#ref!=\"\",\"\",IF(COUNTIF(preencher!#ref!,preencher!#ref!)=0,CONCATENATE(preencher!#ref!,#REF!),preencher!#ref!))","v":{"$error":"#NAME?"}},{"$f":"IF(preencher!#ref!=\"\",\"\",IF(COUNTIF(preencher!#ref!,preencher!#ref!)=0,CONCATENATE(preencher!#ref!,#REF!),preencher!#ref!))","v":{"$error":"#NAME?"}},{"$f":"IF(preencher!#ref!=\"\",\"\",IF(COUNTIF(preencher!#ref!,preencher!#ref!)=0,CONCATENATE(preencher!#ref!,#REF!),preencher!#ref!))","v":{"$error":"#NAME?"}},{"$f":"IF(preencher!#ref!=\"\",\"\",IF(COUNTIF(preencher!#ref!,preencher!#ref!)=0,CONCATENATE(preencher!#ref!,#REF!),preencher!#ref!))","v":{"$error":"#NAME?"}},{"$f":"IF(preencher!#ref!=\"\",\"\",IF(COUNTIF(preencher!#ref!,preencher!#ref!)=0,CONCATENATE(preencher!#ref!,#REF!),preencher!#ref!))","v":{"$error":"#NAME?"}},{"$f":"IF(preencher!#ref!=\"\",\"\",IF(COUNTIF(preencher!#ref!,preencher!#ref!)=0,CONCATENATE(preencher!#ref!,#REF!),preencher!#ref!))","v":{"$error":"#NAME?"}},{"$f":"IF(ISERROR(ROUND(AVERAGE(E46:N46),2)),\"\",ROUND(AVERAGE(E46:N46),2))","v":""},{"$f":"IF(ISERROR(ROUND(O46*D46,2)),\"\",ROUND(O46*D46,2))","v":""},null,null,{"$f":"IF(ISERROR(MEDIAN(E46:N46)),\"\",MEDIAN(E46:N46))","v":""},{"$f":"IF(ISERROR(STDEV(E46:N46)),\"\",STDEV(E46:N46))","v":""},{"$f":"IF(ISERROR(T46/O46),\"\",T46/O46)","v":""}]
[{"$f":"IF(preencher!#ref!=\"\",\"\",preencher!#ref!)","v":{"$error":"#NAME?"}},{"$f":"IF(preencher!#ref!=\"\",\"\",preencher!#ref!)","v":{"$error":"#NAME?"}},{"$f":"IF(preencher!#ref!=\"\",\"\",preencher!#ref!)","v":{"$error":"#NAME?"}},{"$f":"IF(preencher!#ref!=\"\",\"\",preencher!#ref!)","v":{"$error":"#NAME?"}},{"$f":"IF(preencher!#ref!=\"\",\"\",IF(COUNTIF(preencher!#ref!,preencher!#ref!)=0,CONCATENATE(preencher!#ref!,#REF!),preencher!#ref!))","v":{"$error":"#NAME?"}},{"$f":"IF(preencher!#ref!=\"\",\"\",IF(COUNTIF(preencher!#ref!,preencher!#ref!)=0,CONCATENATE(preencher!#ref!,#REF!),preencher!#ref!))","v":{"$error":"#NAME?"}},{"$f":"IF(preencher!#ref!=\"\",\"\",IF(COUNTIF(preencher!#ref!,preencher!#ref!)=0,CONCATENATE(preencher!#ref!,#REF!),preencher!#ref!))","v":{"$error":"#NAME?"}},{"$f":"IF(preencher!#ref!=\"\",\"\",IF(COUNTIF(preencher!#ref!,preencher!#ref!)=0,CONCATENATE(preencher!#ref!,#REF!),preencher!#ref!))","v":{"$error":"#NAME?"}},{"$f":"IF(preencher!#ref!=\"\",\"\",IF(COUNTIF(preencher!#ref!,preencher!#ref!)=0,CONCATENATE(preencher!#ref!,#REF!),preencher!#ref!))","v":{"$error":"#NAME?"}},{"$f":"IF(preencher!#ref!=\"\",\"\",IF(COUNTIF(preencher!#ref!,preencher!#ref!)=0,CONCATENATE(preencher!#ref!,#REF!),preencher!#ref!))","v":{"$error":"#NAME?"}},{"$f":"IF(preencher!#ref!=\"\",\"\",IF(COUNTIF(preencher!#ref!,preencher!#ref!)=0,CONCATENATE(preencher!#ref!,#REF!),preencher!#ref!))","v":{"$error":"#NAME?"}},{"$f":"IF(preencher!#ref!=\"\",\"\",IF(COUNTIF(preencher!#ref!,preencher!#ref!)=0,CONCATENATE(preencher!#ref!,#REF!),preencher!#ref!))","v":{"$error":"#NAME?"}},{"$f":"IF(preencher!#ref!=\"\",\"\",IF(COUNTIF(preencher!#ref!,preencher!#ref!)=0,CONCATENATE(preencher!#ref!,#REF!),preencher!#ref!))","v":{"$error":"#NAME?"}},{"$f":"IF(preencher!#ref!=\"\",\"\",IF(COUNTIF(preencher!#ref!,preencher!#ref!)=0,CONCATENATE(preencher!#ref!,#REF!),preencher!#ref!))","v":{"$error":"#NAME?"}},{"$f":"IF(ISERROR(ROUND(AVERAGE(E47:N47),2)),\"\",ROUND(AVERAGE(E47:N47),2))","v":""},{"$f":"IF(ISERROR(ROUND(O47*D47,2)),\"\",ROUND(O47*D47,2))","v":""},null,null,{"$f":"IF(ISERROR(MEDIAN(E47:N47)),\"\",MEDIAN(E47:N47))","v":""},{"$f":"IF(ISERROR(STDEV(E47:N47)),\"\",STDEV(E47:N47))","v":""},{"$f":"IF(ISERROR(T47/O47),\"\",T47/O47)","v":""}]
[{"$f":"IF(preencher!#ref!=\"\",\"\",preencher!#ref!)","v":{"$error":"#NAME?"}},{"$f":"IF(preencher!#ref!=\"\",\"\",preencher!#ref!)","v":{"$error":"#NAME?"}},{"$f":"IF(preencher!#ref!=\"\",\"\",preencher!#ref!)","v":{"$error":"#NAME?"}},{"$f":"IF(preencher!#ref!=\"\",\"\",preencher!#ref!)","v":{"$error":"#NAME?"}},{"$f":"IF(preencher!#ref!=\"\",\"\",IF(COUNTIF(preencher!#ref!,preencher!#ref!)=0,CONCATENATE(preencher!#ref!,#REF!),preencher!#ref!))","v":{"$error":"#NAME?"}},{"$f":"IF(preencher!#ref!=\"\",\"\",IF(COUNTIF(preencher!#ref!,preencher!#ref!)=0,CONCATENATE(preencher!#ref!,#REF!),preencher!#ref!))","v":{"$error":"#NAME?"}},{"$f":"IF(preencher!#ref!=\"\",\"\",IF(COUNTIF(preencher!#ref!,preencher!#ref!)=0,CONCATENATE(preencher!#ref!,#REF!),preencher!#ref!))","v":{"$error":"#NAME?"}},{"$f":"IF(preencher!#ref!=\"\",\"\",IF(COUNTIF(preencher!#ref!,preencher!#ref!)=0,CONCATENATE(preencher!#ref!,#REF!),preencher!#ref!))","v":{"$error":"#NAME?"}},{"$f":"IF(preencher!#ref!=\"\",\"\",IF(COUNTIF(preencher!#ref!,preencher!#ref!)=0,CONCATENATE(preencher!#ref!,#REF!),preencher!#ref!))","v":{"$error":"#NAME?"}},{"$f":"IF(preencher!#ref!=\"\",\"\",IF(COUNTIF(preencher!#ref!,preencher!#ref!)=0,CONCATENATE(preencher!#ref!,#REF!),preencher!#ref!))","v":{"$error":"#NAME?"}},{"$f":"IF(preencher!#ref!=\"\",\"\",IF(COUNTIF(preencher!#ref!,preencher!#ref!)=0,CONCATENATE(preencher!#ref!,#REF!),preencher!#ref!))","v":{"$error":"#NAME?"}},{"$f":"IF(preencher!#ref!=\"\",\"\",IF(COUNTIF(preencher!#ref!,preencher!#ref!)=0,CONCATENATE(preencher!#ref!,#REF!),preencher!#ref!))","v":{"$error":"#NAME?"}},{"$f":"IF(preencher!#ref!=\"\",\"\",IF(COUNTIF(preencher!#ref!,preencher!#ref!)=0,CONCATENATE(preencher!#ref!,#REF!),preencher!#ref!))","v":{"$error":"#NAME?"}},{"$f":"IF(preencher!#ref!=\"\",\"\",IF(COUNTIF(preencher!#ref!,preencher!#ref!)=0,CONCATENATE(preencher!#ref!,#REF!),preencher!#ref!))","v":{"$error":"#NAME?"}},{"$f":"IF(ISERROR(ROUND(AVERAGE(E48:N48),2)),\"\",ROUND(AVERAGE(E48:N48),2))","v":""},{"$f":"IF(ISERROR(ROUND(O48*D48,2)),\"\",ROUND(O48*D48,2))","v":""},null,null,{"$f":"IF(ISERROR(MEDIAN(E48:N48)),\"\",MEDIAN(E48:N48))","v":""},{"$f":"IF(ISERROR(STDEV(E48:N48)),\"\",STDEV(E48:N48))","v":""},{"$f":"IF(ISERROR(T48/O48),\"\",T48/O48)","v":""}]
[{"$f":"IF(preencher!#ref!=\"\",\"\",preencher!#ref!)","v":{"$error":"#NAME?"}},{"$f":"IF(preencher!#ref!=\"\",\"\",preencher!#ref!)","v":{"$error":"#NAME?"}},{"$f":"IF(preencher!#ref!=\"\",\"\",preencher!#ref!)","v":{"$error":"#NAME?"}},{"$f":"IF(preencher!#ref!=\"\",\"\",preencher!#ref!)","v":{"$error":"#NAME?"}},{"$f":"IF(preencher!#ref!=\"\",\"\",IF(COUNTIF(preencher!#ref!,preencher!#ref!)=0,CONCATENATE(preencher!#ref!,#REF!),preencher!#ref!))","v":{"$error":"#NAME?"}},{"$f":"IF(preencher!#ref!=\"\",\"\",IF(COUNTIF(preencher!#ref!,preencher!#ref!)=0,CONCATENATE(preencher!#ref!,#REF!),preencher!#ref!))","v":{"$error":"#NAME?"}},{"$f":"IF(preencher!#ref!=\"\",\"\",IF(COUNTIF(preencher!#ref!,preencher!#ref!)=0,CONCATENATE(preencher!#ref!,#REF!),preencher!#ref!))","v":{"$error":"#NAME?"}},{"$f":"IF(preencher!#ref!=\"\",\"\",IF(COUNTIF(preencher!#ref!,preencher!#ref!)=0,CONCATENATE(preencher!#ref!,#REF!),preencher!#ref!))","v":{"$error":"#NAME?"}},{"$f":"IF(preencher!#ref!=\"\",\"\",IF(COUNTIF(preencher!#ref!,preencher!#ref!)=0,CONCATENATE(preencher!#ref!,#REF!),preencher!#ref!))","v":{"$error":"#NAME?"}},{"$f":"IF(preencher!#ref!=\"\",\"\",IF(COUNTIF(preencher!#ref!,preencher!#ref!)=0,CONCATENATE(preencher!#ref!,#REF!),preencher!#ref!))","v":{"$error":"#NAME?"}},{"$f":"IF(preencher!#ref!=\"\",\"\",IF(COUNTIF(preencher!#ref!,preencher!#ref!)=0,CONCATENATE(preencher!#ref!,#REF!),preencher!#ref!))","v":{"$error":"#NAME?"}},{"$f":"IF(preencher!#ref!=\"\",\"\",IF(COUNTIF(preencher!#ref!,preencher!#ref!)=0,CONCATENATE(preencher!#ref!,#REF!),preencher!#ref!))","v":{"$error":"#NAME?"}},{"$f":"IF(preencher!#ref!=\"\",\"\",IF(COUNTIF(preencher!#ref!,preencher!#ref!)=0,CONCATENATE(preencher!#ref!,#REF!),preencher!#ref!))","v":{"$error":"#NAME?"}},{"$f":"IF(preencher!#ref!=\"\",\"\",IF(COUNTIF(preencher!#ref!,preencher!#ref!)=0,CONCATENATE(preencher!#ref!,#REF!),preencher!#ref!))","v":{"$error":"#NAME?"}},{"$f":"IF(ISERROR(ROUND(AVERAGE(E49:N49),2)),\"\",ROUND(AVERAGE(E49:N49),2))","v":""},{"$f":"IF(ISERROR(ROUND(O49*D49,2)),\"\",ROUND(O49*D49,2))","v":""},null,null,{"$f":"IF(ISERROR(MEDIAN(E49:N49)),\"\",MEDIAN(E49:N49))","v":""},{"$f":"IF(ISERROR(STDEV(E49:N49)),\"\",STDEV(E49:N49))","v":""},{"$f":"IF(ISERROR(T49/O49),\"\",T49/O49)","v":""}]
[{"$f":"IF(preencher!#ref!=\"\",\"\",preencher!#ref!)","v":{"$error":"#NAME?"}},{"$f":"IF(preencher!#ref!=\"\",\"\",preencher!#ref!)","v":{"$error":"#NAME?"}},{"$f":"IF(preencher!#ref!=\"\",\"\",preencher!#ref!)","v":{"$error":"#NAME?"}},{"$f":"IF(preencher!#ref!=\"\",\"\",preencher!#ref!)","v":{"$error":"#NAME?"}},{"$f":"IF(preencher!#ref!=\"\",\"\",IF(COUNTIF(preencher!#ref!,preencher!#ref!)=0,CONCATENATE(preencher!#ref!,#REF!),preencher!#ref!))","v":{"$error":"#NAME?"}},{"$f":"IF(preencher!#ref!=\"\",\"\",IF(COUNTIF(preencher!#ref!,preencher!#ref!)=0,CONCATENATE(preencher!#ref!,#REF!),preencher!#ref!))","v":{"$error":"#NAME?"}},{"$f":"IF(preencher!#ref!=\"\",\"\",IF(COUNTIF(preencher!#ref!,preencher!#ref!)=0,CONCATENATE(preencher!#ref!,#REF!),preencher!#ref!))","v":{"$error":"#NAME?"}},{"$f":"IF(preencher!#ref!=\"\",\"\",IF(COUNTIF(preencher!#ref!,preencher!#ref!)=0,CONCATENATE(preencher!#ref!,#REF!),preencher!#ref!))","v":{"$error":"#NAME?"}},{"$f":"IF(preencher!#ref!=\"\",\"\",IF(COUNTIF(preencher!#ref!,preencher!#ref!)=0,CONCATENATE(preencher!#ref!,#REF!),preencher!#ref!))","v":{"$error":"#NAME?"}},{"$f":"IF(preencher!#ref!=\"\",\"\",IF(COUNTIF(preencher!#ref!,preencher!#ref!)=0,CONCATENATE(preencher!#ref!,#REF!),preencher!#ref!))","v":{"$error":"#NAME?"}},{"$f":"IF(preencher!#ref!=\"\",\"\",IF(COUNTIF(preencher!#ref!,preencher!#ref!)=0,CONCATENATE(preencher!#ref!,#REF!),preencher!#ref!))","v":{"$error":"#NAME?"}},{"$f":"IF(preencher!#ref!=\"\",\"\",IF(COUNTIF(preencher!#ref!,preencher!#ref!)=0,CONCATENATE(preencher!#ref!,#REF!),preencher!#ref!))","v":{"$error":"#NAME?"}},{"$f":"IF(preencher!#ref!=\"\",\"\",IF(COUNTIF(preencher!#ref!,preencher!#ref!)=0,CONCATENATE(preencher!#ref!,#REF!),preencher!#ref!))","v":{"$error":"#NAME?"}},{"$f":"IF(preencher!#ref!=\"\",\"\",IF(COUNTIF(preencher!#ref!,preencher!#ref!)=0,CONCATENATE(preencher!#ref!,#REF!),preencher!#ref!))","v":{"$error":"#NAME?"}},{"$f":"IF(ISERROR(ROUND(AVERAGE(E50:N50),2)),\"\",ROUND(AVERAGE(E50:N50),2))","v":""},{"$f":"IF(ISERROR(ROUND(O50*D50,2)),\"\",ROUND(O50*D50,2))","v":""},null,null,{"$f":"IF(ISERROR(MEDIAN(E50:N50)),\"\",MEDIAN(E50:N50))","v":""},{"$f":"IF(ISERROR(STDEV(E50:N50)),\"\",STDEV(E50:N50))","v":""},{"$f":"IF(ISERROR(T50/O50),\"\",T50/O50)","v":""}]
[{"$f":"IF(preencher!#ref!=\"\",\"\",preencher!#ref!)","v":{"$error":"#NAME?"}},{"$f":"IF(preencher!#ref!=\"\",\"\",preencher!#ref!)","v":{"$error":"#NAME?"}},{"$f":"IF(preencher!#ref!=\"\",\"\",preencher!#ref!)","v":{"$error":"#NAME?"}},{"$f":"IF(preencher!#ref!=\"\",\"\",preencher!#ref!)","v":{"$error":"#NAME?"}},{"$f":"IF(preencher!#ref!=\"\",\"\",IF(COUNTIF(preencher!#ref!,preencher!#ref!)=0,CONCATENATE(preencher!#ref!,#REF!),preencher!#ref!))","v":{"$error":"#NAME?"}},{"$f":"IF(preencher!#ref!=\"\",\"\",IF(COUNTIF(preencher!#ref!,preencher!#ref!)=0,CONCATENATE(preencher!#ref!,#REF!),preencher!#ref!))","v":{"$error":"#NAME?"}},{"$f":"IF(preencher!#ref!=\"\",\"\",IF(COUNTIF(preencher!#ref!,preencher!#ref!)=0,CONCATENATE(preencher!#ref!,#REF!),preencher!#ref!))","v":{"$error":"#NAME?"}},{"$f":"IF(preencher!#ref!=\"\",\"\",IF(COUNTIF(preencher!#ref!,preencher!#ref!)=0,CONCATENATE(preencher!#ref!,#REF!),preencher!#ref!))","v":{"$error":"#NAME?"}},{"$f":"IF(preencher!#ref!=\"\",\"\",IF(COUNTIF(preencher!#ref!,preencher!#ref!)=0,CONCATENATE(preencher!#ref!,#REF!),preencher!#ref!))","v":{"$error":"#NAME?"}},{"$f":"IF(preencher!#ref!=\"\",\"\",IF(COUNTIF(preencher!#ref!,preencher!#ref!)=0,CONCATENATE(preencher!#ref!,#REF!),preencher!#ref!))","v":{"$error":"#NAME?"}},{"$f":"IF(preencher!#ref!=\"\",\"\",IF(COUNTIF(preencher!#ref!,preencher!#ref!)=0,CONCATENATE(preencher!#ref!,#REF!),preencher!#ref!))","v":{"$error":"#NAME?"}},{"$f":"IF(preencher!#ref!=\"\",\"\",IF(COUNTIF(preencher!#ref!,preencher!#ref!)=0,CONCATENATE(preencher!#ref!,#REF!),preencher!#ref!))","v":{"$error":"#NAME?"}},{"$f":"IF(preencher!#ref!=\"\",\"\",IF(COUNTIF(preencher!#ref!,preencher!#ref!)=0,CONCATENATE(preencher!#ref!,#REF!),preencher!#ref!))","v":{"$error":"#NAME?"}},{"$f":"IF(preencher!#ref!=\"\",\"\",IF(COUNTIF(preencher!#ref!,preencher!#ref!)=0,CONCATENATE(preencher!#ref!,#REF!),preencher!#ref!))","v":{"$error":"#NAME?"}},{"$f":"IF(ISERROR(ROUND(AVERAGE(E51:N51),2)),\"\",ROUND(AVERAGE(E51:N51),2))","v":""},{"$f":"IF(ISERROR(ROUND(O51*D51,2)),\"\",ROUND(O51*D51,2))","v":""},null,null,{"$f":"IF(ISERROR(MEDIAN(E51:N51)),\"\",MEDIAN(E51:N51))","v":""},{"$f":"IF(ISERROR(STDEV(E51:N51)),\"\",STDEV(E51:N51))","v":""},{"$f":"IF(ISERROR(T51/O51),\"\",T51/O51)","v":""}]
[{"$f":"IF(preencher!#ref!=\"\",\"\",preencher!#ref!)","v":{"$error":"#NAME?"}},{"$f":"IF(preencher!#ref!=\"\",\"\",preencher!#ref!)","v":{"$error":"#NAME?"}},{"$f":"IF(preencher!#ref!=\"\",\"\",preencher!#ref!)","v":{"$error":"#NAME?"}},{"$f":"IF(preencher!#ref!=\"\",\"\",preencher!#ref!)","v":{"$error":"#NAME?"}},{"$f":"IF(preencher!#ref!=\"\",\"\",IF(COUNTIF(preencher!#ref!,preencher!#ref!)=0,CONCATENATE(preencher!#ref!,#REF!),preencher!#ref!))","v":{"$error":"#NAME?"}},{"$f":"IF(preencher!#ref!=\"\",\"\",IF(COUNTIF(preencher!#ref!,preencher!#ref!)=0,CONCATENATE(preencher!#ref!,#REF!),preencher!#ref!))","v":{"$error":"#NAME?"}},{"$f":"IF(preencher!#ref!=\"\",\"\",IF(COUNTIF(preencher!#ref!,preencher!#ref!)=0,CONCATENATE(preencher!#ref!,#REF!),preencher!#ref!))","v":{"$error":"#NAME?"}},{"$f":"IF(preencher!#ref!=\"\",\"\",IF(COUNTIF(preencher!#ref!,preencher!#ref!)=0,CONCATENATE(preencher!#ref!,#REF!),preencher!#ref!))","v":{"$error":"#NAME?"}},{"$f":"IF(preencher!#ref!=\"\",\"\",IF(COUNTIF(preencher!#ref!,preencher!#ref!)=0,CONCATENATE(preencher!#ref!,#REF!),preencher!#ref!))","v":{"$error":"#NAME?"}},{"$f":"IF(preencher!#ref!=\"\",\"\",IF(COUNTIF(preencher!#ref!,preencher!#ref!)=0,CONCATENATE(preencher!#ref!,#REF!),preencher!#ref!))","v":{"$error":"#NAME?"}},{"$f":"IF(preencher!#ref!=\"\",\"\",IF(COUNTIF(preencher!#ref!,preencher!#ref!)=0,CONCATENATE(preencher!#ref!,#REF!),preencher!#ref!))","v":{"$error":"#NAME?"}},{"$f":"IF(preencher!#ref!=\"\",\"\",IF(COUNTIF(preencher!#ref!,preencher!#ref!)=0,CONCATENATE(preencher!#ref!,#REF!),preencher!#ref!))","v":{"$error":"#NAME?"}},{"$f":"IF(preencher!#ref!=\"\",\"\",IF(COUNTIF(preencher!#ref!,preencher!#ref!)=0,CONCATENATE(preencher!#ref!,#REF!),preencher!#ref!))","v":{"$error":"#NAME?"}},{"$f":"IF(preencher!#ref!=\"\",\"\",IF(COUNTIF(preencher!#ref!,preencher!#ref!)=0,CONCATENATE(preencher!#ref!,#REF!),preencher!#ref!))","v":{"$error":"#NAME?"}},{"$f":"IF(ISERROR(ROUND(AVERAGE(E52:N52),2)),\"\",ROUND(AVERAGE(E52:N52),2))","v":""},{"$f":"IF(ISERROR(ROUND(O52*D52,2)),\"\",ROUND(O52*D52,2))","v":""},null,null,{"$f":"IF(ISERROR(MEDIAN(E52:N52)),\"\",MEDIAN(E52:N52))","v":""},{"$f":"IF(ISERROR(STDEV(E52:N52)),\"\",STDEV(E52:N52))","v":""},{"$f":"IF(ISERROR(T52/O52),\"\",T52/O52)","v":""}]
[{"$f":"IF(preencher!#ref!=\"\",\"\",preencher!#ref!)","v":{"$error":"#NAME?"}},{"$f":"IF(preencher!#ref!=\"\",\"\",preencher!#ref!)","v":{"$error":"#NAME?"}},{"$f":"IF(preencher!#ref!=\"\",\"\",preencher!#ref!)","v":{"$error":"#NAME?"}},{"$f":"IF(preencher!#ref!=\"\",\"\",preencher!#ref!)","v":{"$error":"#NAME?"}},{"$f":"IF(preencher!#ref!=\"\",\"\",IF(COUNTIF(preencher!#ref!,preencher!#ref!)=0,CONCATENATE(preencher!#ref!,#REF!),preencher!#ref!))","v":{"$error":"#NAME?"}},{"$f":"IF(preencher!#ref!=\"\",\"\",IF(COUNTIF(preencher!#ref!,preencher!#ref!)=0,CONCATENATE(preencher!#ref!,#REF!),preencher!#ref!))","v":{"$error":"#NAME?"}},{"$f":"IF(preencher!#ref!=\"\",\"\",IF(COUNTIF(preencher!#ref!,preencher!#ref!)=0,CONCATENATE(preencher!#ref!,#REF!),preencher!#ref!))","v":{"$error":"#NAME?"}},{"$f":"IF(preencher!#ref!=\"\",\"\",IF(COUNTIF(preencher!#ref!,preencher!#ref!)=0,CONCATENATE(preencher!#ref!,#REF!),preencher!#ref!))","v":{"$error":"#NAME?"}},{"$f":"IF(preencher!#ref!=\"\",\"\",IF(COUNTIF(preencher!#ref!,preencher!#ref!)=0,CONCATENATE(preencher!#ref!,#REF!),preencher!#ref!))","v":{"$error":"#NAME?"}},{"$f":"IF(preencher!#ref!=\"\",\"\",IF(COUNTIF(preencher!#ref!,preencher!#ref!)=0,CONCATENATE(preencher!#ref!,#REF!),preencher!#ref!))","v":{"$error":"#NAME?"}},{"$f":"IF(preencher!#ref!=\"\",\"\",IF(COUNTIF(preencher!#ref!,preencher!#ref!)=0,CONCATENATE(preencher!#ref!,#REF!),preencher!#ref!))","v":{"$error":"#NAME?"}},{"$f":"IF(preencher!#ref!=\"\",\"\",IF(COUNTIF(preencher!#ref!,preencher!#ref!)=0,CONCATENATE(preencher!#ref!,#REF!),preencher!#ref!))","v":{"$error":"#NAME?"}},{"$f":"IF(preencher!#ref!=\"\",\"\",IF(COUNTIF(preencher!#ref!,preencher!#ref!)=0,CONCATENATE(preencher!#ref!,#REF!),preencher!#ref!))","v":{"$error":"#NAME?"}},{"$f":"IF(preencher!#ref!=\"\",\"\",IF(COUNTIF(preencher!#ref!,preencher!#ref!)=0,CONCATENATE(preencher!#ref!,#REF!),preencher!#ref!))","v":{"$error":"#NAME?"}},{"$f":"IF(ISERROR(ROUND(AVERAGE(E53:N53),2)),\"\",ROUND(AVERAGE(E53:N53),2))","v":""},{"$f":"IF(ISERROR(ROUND(O53*D53,2)),\"\",ROUND(O53*D53,2))","v":""},null,null,{"$f":"IF(ISERROR(MEDIAN(E53:N53)),\"\",MEDIAN(E53:N53))","v":""},{"$f":"IF(ISERROR(STDEV(E53:N53)),\"\",STDEV(E53:N53))","v":""},{"$f":"IF(ISERROR(T53/O53),\"\",T53/O53)","v":""}]
[{"$f":"IF(preencher!#ref!=\"\",\"\",preencher!#ref!)","v":{"$error":"#NAME?"}},{"$f":"IF(preencher!#ref!=\"\",\"\",preencher!#ref!)","v":{"$error":"#NAME?"}},{"$f":"IF(preencher!#ref!=\"\",\"\",preencher!#ref!)","v":{"$error":"#NAME?"}},{"$f":"IF(preencher!#ref!=\"\",\"\",preencher!#ref!)","v":{"$error":"#NAME?"}},{"$f":"IF(preencher!#ref!=\"\",\"\",IF(COUNTIF(preencher!#ref!,preencher!#ref!)=0,CONCATENATE(preencher!#ref!,#REF!),preencher!#ref!))","v":{"$error":"#NAME?"}},{"$f":"IF(preencher!#ref!=\"\",\"\",IF(COUNTIF(preencher!#ref!,preencher!#ref!)=0,CONCATENATE(preencher!#ref!,#REF!),preencher!#ref!))","v":{"$error":"#NAME?"}},{"$f":"IF(preencher!#ref!=\"\",\"\",IF(COUNTIF(preencher!#ref!,preencher!#ref!)=0,CONCATENATE(preencher!#ref!,#REF!),preencher!#ref!))","v":{"$error":"#NAME?"}},{"$f":"IF(preencher!#ref!=\"\",\"\",IF(COUNTIF(preencher!#ref!,preencher!#ref!)=0,CONCATENATE(preencher!#ref!,#REF!),preencher!#ref!))","v":{"$error":"#NAME?"}},{"$f":"IF(preencher!#ref!=\"\",\"\",IF(COUNTIF(preencher!#ref!,preencher!#ref!)=0,CONCATENATE(preencher!#ref!,#REF!),preencher!#ref!))","v":{"$error":"#NAME?"}},{"$f":"IF(preencher!#ref!=\"\",\"\",IF(COUNTIF(preencher!#ref!,preencher!#ref!)=0,CONCATENATE(preencher!#ref!,#REF!),preencher!#ref!))","v":{"$error":"#NAME?"}},{"$f":"IF(preencher!#ref!=\"\",\"\",IF(COUNTIF(preencher!#ref!,preencher!#ref!)=0,CONCATENATE(preencher!#ref!,#REF!),preencher!#ref!))","v":{"$error":"#NAME?"}},{"$f":"IF(preencher!#ref!=\"\",\"\",IF(COUNTIF(preencher!#ref!,preencher!#ref!)=0,CONCATENATE(preencher!#ref!,#REF!),preencher!#ref!))","v":{"$error":"#NAME?"}},{"$f":"IF(preencher!#ref!=\"\",\"\",IF(COUNTIF(preencher!#ref!,preencher!#ref!)=0,CONCATENATE(preencher!#ref!,#REF!),preencher!#ref!))","v":{"$error":"#NAME?"}},{"$f":"IF(preencher!#ref!=\"\",\"\",IF(COUNTIF(preencher!#ref!,preencher!#ref!)=0,CONCATENATE(preencher!#ref!,#REF!),preencher!#ref!))","v":{"$error":"#NAME?"}},{"$f":"IF(ISERROR(ROUND(AVERAGE(E54:N54),2)),\"\",ROUND(AVERAGE(E54:N54),2))","v":""},{"$f":"IF(ISERROR(ROUND(O54*D54,2)),\"\",ROUND(O54*D54,2))","v":""},null,null,{"$f":"IF(ISERROR(MEDIAN(E54:N54)),\"\",MEDIAN(E54:N54))","v":""},{"$f":"IF(ISERROR(STDEV(E54:N54)),\"\",STDEV(E54:N54))","v":""},{"$f":"IF(ISERROR(T54/O54),\"\",T54/O54)","v":""}]
[{"$f":"IF(preencher!#ref!=\"\",\"\",preencher!#ref!)","v":{"$error":"#NAME?"}},{"$f":"IF(preencher!#ref!=\"\",\"\",preencher!#ref!)","v":{"$error":"#NAME?"}},{"$f":"IF(preencher!#ref!=\"\",\"\",preencher!#ref!)","v":{"$error":"#NAME?"}},{"$f":"IF(preencher!#ref!=\"\",\"\",preencher!#ref!)","v":{"$error":"#NAME?"}},{"$f":"IF(preencher!#ref!=\"\",\"\",IF(COUNTIF(preencher!#ref!,preencher!#ref!)=0,CONCATENATE(preencher!#ref!,#REF!),preencher!#ref!))","v":{"$error":"#NAME?"}},{"$f":"IF(preencher!#ref!=\"\",\"\",IF(COUNTIF(preencher!#ref!,preencher!#ref!)=0,CONCATENATE(preencher!#ref!,#REF!),preencher!#ref!))","v":{"$error":"#NAME?"}},{"$f":"IF(preencher!#ref!=\"\",\"\",IF(COUNTIF(preencher!#ref!,preencher!#ref!)=0,CONCATENATE(preencher!#ref!,#REF!),preencher!#ref!))","v":{"$error":"#NAME?"}},{"$f":"IF(preencher!#ref!=\"\",\"\",IF(COUNTIF(preencher!#ref!,preencher!#ref!)=0,CONCATENATE(preencher!#ref!,#REF!),preencher!#ref!))","v":{"$error":"#NAME?"}},{"$f":"IF(preencher!#ref!=\"\",\"\",IF(COUNTIF(preencher!#ref!,preencher!#ref!)=0,CONCATENATE(preencher!#ref!,#REF!),preencher!#ref!))","v":{"$error":"#NAME?"}},{"$f":"IF(preencher!#ref!=\"\",\"\",IF(COUNTIF(preencher!#ref!,preencher!#ref!)=0,CONCATENATE(preencher!#ref!,#REF!),preencher!#ref!))","v":{"$error":"#NAME?"}},{"$f":"IF(preencher!#ref!=\"\",\"\",IF(COUNTIF(preencher!#ref!,preencher!#ref!)=0,CONCATENATE(preencher!#ref!,#REF!),preencher!#ref!))","v":{"$error":"#NAME?"}},{"$f":"IF(preencher!#ref!=\"\",\"\",IF(COUNTIF(preencher!#ref!,preencher!#ref!)=0,CONCATENATE(preencher!#ref!,#REF!),preencher!#ref!))","v":{"$error":"#NAME?"}},{"$f":"IF(preencher!#ref!=\"\",\"\",IF(COUNTIF(preencher!#ref!,preencher!#ref!)=0,CONCATENATE(preencher!#ref!,#REF!),preencher!#ref!))","v":{"$error":"#NAME?"}},{"$f":"IF(preencher!#ref!=\"\",\"\",IF(COUNTIF(preencher!#ref!,preencher!#ref!)=0,CONCATENATE(preencher!#ref!,#REF!),preencher!#ref!))","v":{"$error":"#NAME?"}},{"$f":"IF(ISERROR(ROUND(AVERAGE(E55:N55),2)),\"\",ROUND(AVERAGE(E55:N55),2))","v":""},{"$f":"IF(ISERROR(ROUND(O55*D55,2)),\"\",ROUND(O55*D55,2))","v":""},null,null,{"$f":"IF(ISERROR(MEDIAN(E55:N55)),\"\",MEDIAN(E55:N55))","v":""},{"$f":"IF(ISERROR(STDEV(E55:N55)),\"\",STDEV(E55:N55))","v":""},{"$f":"IF(ISERROR(T55/O55),\"\",T55/O55)","v":""}]
[{"$f":"IF(preencher!#ref!=\"\",\"\",preencher!#ref!)","v":{"$error":"#NAME?"}},{"$f":"IF(preencher!#ref!=\"\",\"\",preencher!#ref!)","v":{"$error":"#NAME?"}},{"$f":"IF(preencher!#ref!=\"\",\"\",preencher!#ref!)","v":{"$error":"#NAME?"}},{"$f":"IF(preencher!#ref!=\"\",\"\",preencher!#ref!)","v":{"$error":"#NAME?"}},{"$f":"IF(preencher!#ref!=\"\",\"\",IF(COUNTIF(preencher!#ref!,preencher!#ref!)=0,CONCATENATE(preencher!#ref!,#REF!),preencher!#ref!))","v":{"$error":"#NAME?"}},{"$f":"IF(preencher!#ref!=\"\",\"\",IF(COUNTIF(preencher!#ref!,preencher!#ref!)=0,CONCATENATE(preencher!#ref!,#REF!),preencher!#ref!))","v":{"$error":"#NAME?"}},{"$f":"IF(preencher!#ref!=\"\",\"\",IF(COUNTIF(preencher!#ref!,preencher!#ref!)=0,CONCATENATE(preencher!#ref!,#REF!),preencher!#ref!))","v":{"$error":"#NAME?"}},{"$f":"IF(preencher!#ref!=\"\",\"\",IF(COUNTIF(preencher!#ref!,preencher!#ref!)=0,CONCATENATE(preencher!#ref!,#REF!),preencher!#ref!))","v":{"$error":"#NAME?"}},{"$f":"IF(preencher!#ref!=\"\",\"\",IF(COUNTIF(preencher!#ref!,preencher!#ref!)=0,CONCATENATE(preencher!#ref!,#REF!),preencher!#ref!))","v":{"$error":"#NAME?"}},{"$f":"IF(preencher!#ref!=\"\",\"\",IF(COUNTIF(preencher!#ref!,preencher!#ref!)=0,CONCATENATE(preencher!#ref!,#REF!),preencher!#ref!))","v":{"$error":"#NAME?"}},{"$f":"IF(preencher!#ref!=\"\",\"\",IF(COUNTIF(preencher!#ref!,preencher!#ref!)=0,CONCATENATE(preencher!#ref!,#REF!),preencher!#ref!))","v":{"$error":"#NAME?"}},{"$f":"IF(preencher!#ref!=\"\",\"\",IF(COUNTIF(preencher!#ref!,preencher!#ref!)=0,CONCATENATE(preencher!#ref!,#REF!),preencher!#ref!))","v":{"$error":"#NAME?"}},{"$f":"IF(preencher!#ref!=\"\",\"\",IF(COUNTIF(preencher!#ref!,preencher!#ref!)=0,CONCATENATE(preencher!#ref!,#REF!),preencher!#ref!))","v":{"$error":"#NAME?"}},{"$f":"IF(preencher!#ref!=\"\",\"\",IF(COUNTIF(preencher!#ref!,preencher!#ref!)=0,CONCATENATE(preencher!#ref!,#REF!),preencher!#ref!))","v":{"$error":"#NAME?"}},{"$f":"IF(ISERROR(ROUND(AVERAGE(E56:N56),2)),\"\",ROUND(AVERAGE(E56:N56),2))","v":""},{"$f":"IF(ISERROR(ROUND(O56*D56,2)),\"\",ROUND(O56*D56,2))","v":""},null,null,{"$f":"IF(ISERROR(MEDIAN(E56:N56)),\"\",MEDIAN(E56:N56))","v":""},{"$f":"IF(ISERROR(STDEV(E56:N56)),\"\",STDEV(E56:N56))","v":""},{"$f":"IF(ISERROR(T56/O56),\"\",T56/O56)","v":""}]
[{"$f":"IF(preencher!#ref!=\"\",\"\",preencher!#ref!)","v":{"$error":"#NAME?"}},{"$f":"IF(preencher!#ref!=\"\",\"\",preencher!#ref!)","v":{"$error":"#NAME?"}},{"$f":"IF(preencher!#ref!=\"\",\"\",preencher!#ref!)","v":{"$error":"#NAME?"}},{"$f":"IF(preencher!#ref!=\"\",\"\",preencher!#ref!)","v":{"$error":"#NAME?"}},{"$f":"IF(preencher!#ref!=\"\",\"\",IF(COUNTIF(preencher!#ref!,preencher!#ref!)=0,CONCATENATE(preencher!#ref!,#REF!),preencher!#ref!))","v":{"$error":"#NAME?"}},{"$f":"IF(preencher!#ref!=\"\",\"\",IF(COUNTIF(preencher!#ref!,preencher!#ref!)=0,CONCATENATE(preencher!#ref!,#REF!),preencher!#ref!))","v":{"$error":"#NAME?"}},{"$f":"IF(preencher!#ref!=\"\",\"\",IF(COUNTIF(preencher!#ref!,preencher!#ref!)=0,CONCATENATE(preencher!#ref!,#REF!),preencher!#ref!))","v":{"$error":"#NAME?"}},{"$f":"IF(preencher!#ref!=\"\",\"\",IF(COUNTIF(preencher!#ref!,preencher!#ref!)=0,CONCATENATE(preencher!#ref!,#REF!),preencher!#ref!))","v":{"$error":"#NAME?"}},{"$f":"IF(preencher!#ref!=\"\",\"\",IF(COUNTIF(preencher!#ref!,preencher!#ref!)=0,CONCATENATE(preencher!#ref!,#REF!),preencher!#ref!))","v":{"$error":"#NAME?"}},{"$f":"IF(preencher!#ref!=\"\",\"\",IF(COUNTIF(preencher!#ref!,preencher!#ref!)=0,CONCATENATE(preencher!#ref!,#REF!),preencher!#ref!))","v":{"$error":"#NAME?"}},{"$f":"IF(preencher!#ref!=\"\",\"\",IF(COUNTIF(preencher!#ref!,preencher!#ref!)=0,CONCATENATE(preencher!#ref!,#REF!),preencher!#ref!))","v":{"$error":"#NAME?"}},{"$f":"IF(preencher!#ref!=\"\",\"\",IF(COUNTIF(preencher!#ref!,preencher!#ref!)=0,CONCATENATE(preencher!#ref!,#REF!),preencher!#ref!))","v":{"$error":"#NAME?"}},{"$f":"IF(preencher!#ref!=\"\",\"\",IF(COUNTIF(preencher!#ref!,preencher!#ref!)=0,CONCATENATE(preencher!#ref!,#REF!),preencher!#ref!))","v":{"$error":"#NAME?"}},{"$f":"IF(preencher!#ref!=\"\",\"\",IF(COUNTIF(preencher!#ref!,preencher!#ref!)=0,CONCATENATE(preencher!#ref!,#REF!),preencher!#ref!))","v":{"$error":"#NAME?"}},{"$f":"IF(ISERROR(ROUND(AVERAGE(E57:N57),2)),\"\",ROUND(AVERAGE(E57:N57),2))","v":""},{"$f":"IF(ISERROR(ROUND(O57*D57,2)),\"\",ROUND(O57*D57,2))","v":""},null,null,{"$f":"IF(ISERROR(MEDIAN(E57:N57)),\"\",MEDIAN(E57:N57))","v":""},{"$f":"IF(ISERROR(STDEV(E57:N57)),\"\",STDEV(E57:N57))","v":""},{"$f":"IF(ISERROR(T57/O57),\"\",T57/O57)","v":""}]
[{"$f":"IF(preencher!#ref!=\"\",\"\",preencher!#ref!)","v":{"$error":"#NAME?"}},{"$f":"IF(preencher!#ref!=\"\",\"\",preencher!#ref!)","v":{"$error":"#NAME?"}},{"$f":"IF(preencher!#ref!=\"\",\"\",preencher!#ref!)","v":{"$error":"#NAME?"}},{"$f":"IF(preencher!#ref!=\"\",\"\",preencher!#ref!)","v":{"$error":"#NAME?"}},{"$f":"IF(preencher!#ref!=\"\",\"\",IF(COUNTIF(preencher!#ref!,preencher!#ref!)=0,CONCATENATE(preencher!#ref!,#REF!),preencher!#ref!))","v":{"$error":"#NAME?"}},{"$f":"IF(preencher!#ref!=\"\",\"\",IF(COUNTIF(preencher!#ref!,preencher!#ref!)=0,CONCATENATE(preencher!#ref!,#REF!),preencher!#ref!))","v":{"$error":"#NAME?"}},{"$f":"IF(preencher!#ref!=\"\",\"\",IF(COUNTIF(preencher!#ref!,preencher!#ref!)=0,CONCATENATE(preencher!#ref!,#REF!),preencher!#ref!))","v":{"$error":"#NAME?"}},{"$f":"IF(preencher!#ref!=\"\",\"\",IF(COUNTIF(preencher!#ref!,preencher!#ref!)=0,CONCATENATE(preencher!#ref!,#REF!),preencher!#ref!))","v":{"$error":"#NAME?"}},{"$f":"IF(preencher!#ref!=\"\",\"\",IF(COUNTIF(preencher!#ref!,preencher!#ref!)=0,CONCATENATE(preencher!#ref!,#REF!),preencher!#ref!))","v":{"$error":"#NAME?"}},{"$f":"IF(preencher!#ref!=\"\",\"\",IF(COUNTIF(preencher!#ref!,preencher!#ref!)=0,CONCATENATE(preencher!#ref!,#REF!),preencher!#ref!))","v":{"$error":"#NAME?"}},{"$f":"IF(preencher!#ref!=\"\",\"\",IF(COUNTIF(preencher!#ref!,preencher!#ref!)=0,CONCATENATE(preencher!#ref!,#REF!),preencher!#ref!))","v":{"$error":"#NAME?"}},{"$f":"IF(preencher!#ref!=\"\",\"\",IF(COUNTIF(preencher!#ref!,preencher!#ref!)=0,CONCATENATE(preencher!#ref!,#REF!),preencher!#ref!))","v":{"$error":"#NAME?"}},{"$f":"IF(preencher!#ref!=\"\",\"\",IF(COUNTIF(preencher!#ref!,preencher!#ref!)=0,CONCATENATE(preencher!#ref!,#REF!),preencher!#ref!))","v":{"$error":"#NAME?"}},{"$f":"IF(preencher!#ref!=\"\",\"\",IF(COUNTIF(preencher!#ref!,preencher!#ref!)=0,CONCATENATE(preencher!#ref!,#REF!),preencher!#ref!))","v":{"$error":"#NAME?"}},{"$f":"IF(ISERROR(ROUND(AVERAGE(E58:N58),2)),\"\",ROUND(AVERAGE(E58:N58),2))","v":""},{"$f":"IF(ISERROR(ROUND(O58*D58,2)),\"\",ROUND(O58*D58,2))","v":""},null,null,{"$f":"IF(ISERROR(MEDIAN(E58:N58)),\"\",MEDIAN(E58:N58))","v":""},{"$f":"IF(ISERROR(STDEV(E58:N58)),\"\",STDEV(E58:N58))","v":""},{"$f":"IF(ISERROR(T58/O58),\"\",T58/O58)","v":""}]
[{"$f":"IF(preencher!#ref!=\"\",\"\",preencher!#ref!)","v":{"$error":"#NAME?"}},{"$f":"IF(preencher!#ref!=\"\",\"\",preencher!#ref!)","v":{"$error":"#NAME?"}},{"$f":"IF(preencher!#ref!=\"\",\"\",preencher!#ref!)","v":{"$error":"#NAME?"}},{"$f":"IF(preencher!#ref!=\"\",\"\",preencher!#ref!)","v":{"$error":"#NAME?"}},{"$f":"IF(preencher!#ref!=\"\",\"\",IF(COUNTIF(preencher!#ref!,preencher!#ref!)=0,CONCATENATE(preencher!#ref!,#REF!),preencher!#ref!))","v":{"$error":"#NAME?"}},{"$f":"IF(preencher!#ref!=\"\",\"\",IF(COUNTIF(preencher!#ref!,preencher!#ref!)=0,CONCATENATE(preencher!#ref!,#REF!),preencher!#ref!))","v":{"$error":"#NAME?"}},{"$f":"IF(preencher!#ref!=\"\",\"\",IF(COUNTIF(preencher!#ref!,preencher!#ref!)=0,CONCATENATE(preencher!#ref!,#REF!),preencher!#ref!))","v":{"$error":"#NAME?"}},{"$f":"IF(preencher!#ref!=\"\",\"\",IF(COUNTIF(preencher!#ref!,preencher!#ref!)=0,CONCATENATE(preencher!#ref!,#REF!),preencher!#ref!))","v":{"$error":"#NAME?"}},{"$f":"IF(preencher!#ref!=\"\",\"\",IF(COUNTIF(preencher!#ref!,preencher!#ref!)=0,CONCATENATE(preencher!#ref!,#REF!),preencher!#ref!))","v":{"$error":"#NAME?"}},{"$f":"IF(preencher!#ref!=\"\",\"\",IF(COUNTIF(preencher!#ref!,preencher!#ref!)=0,CONCATENATE(preencher!#ref!,#REF!),preencher!#ref!))","v":{"$error":"#NAME?"}},{"$f":"IF(preencher!#ref!=\"\",\"\",IF(COUNTIF(preencher!#ref!,preencher!#ref!)=0,CONCATENATE(preencher!#ref!,#REF!),preencher!#ref!))","v":{"$error":"#NAME?"}},{"$f":"IF(preencher!#ref!=\"\",\"\",IF(COUNTIF(preencher!#ref!,preencher!#ref!)=0,CONCATENATE(preencher!#ref!,#REF!),preencher!#ref!))","v":{"$error":"#NAME?"}},{"$f":"IF(preencher!#ref!=\"\",\"\",IF(COUNTIF(preencher!#ref!,preencher!#ref!)=0,CONCATENATE(preencher!#ref!,#REF!),preencher!#ref!))","v":{"$error":"#NAME?"}},{"$f":"IF(preencher!#ref!=\"\",\"\",IF(COUNTIF(preencher!#ref!,preencher!#ref!)=0,CONCATENATE(preencher!#ref!,#REF!),preencher!#ref!))","v":{"$error":"#NAME?"}},{"$f":"IF(ISERROR(ROUND(AVERAGE(E59:N59),2)),\"\",ROUND(AVERAGE(E59:N59),2))","v":""},{"$f":"IF(ISERROR(ROUND(O59*D59,2)),\"\",ROUND(O59*D59,2))","v":""},null,null,{"$f":"IF(ISERROR(MEDIAN(E59:N59)),\"\",MEDIAN(E59:N59))","v":""},{"$f":"IF(ISERROR(STDEV(E59:N59)),\"\",STDEV(E59:N59))","v":""},{"$f":"IF(ISERROR(T59/O59),\"\",T59/O59)","v":""}]
[{"$f":"IF(preencher!#ref!=\"\",\"\",preencher!#ref!)","v":{"$error":"#NAME?"}},{"$f":"IF(preencher!#ref!=\"\",\"\",preencher!#ref!)","v":{"$error":"#NAME?"}},{"$f":"IF(preencher!#ref!=\"\",\"\",preencher!#ref!)","v":{"$error":"#NAME?"}},{"$f":"IF(preencher!#ref!=\"\",\"\",preencher!#ref!)","v":{"$error":"#NAME?"}},{"$f":"IF(preencher!#ref!=\"\",\"\",IF(COUNTIF(preencher!#ref!,preencher!#ref!)=0,CONCATENATE(preencher!#ref!,#REF!),preencher!#ref!))","v":{"$error":"#NAME?"}},{"$f":"IF(preencher!#ref!=\"\",\"\",IF(COUNTIF(preencher!#ref!,preencher!#ref!)=0,CONCATENATE(preencher!#ref!,#REF!),preencher!#ref!))","v":{"$error":"#NAME?"}},{"$f":"IF(preencher!#ref!=\"\",\"\",IF(COUNTIF(preencher!#ref!,preencher!#ref!)=0,CONCATENATE(preencher!#ref!,#REF!),preencher!#ref!))","v":{"$error":"#NAME?"}},{"$f":"IF(preencher!#ref!=\"\",\"\",IF(COUNTIF(preencher!#ref!,preencher!#ref!)=0,CONCATENATE(preencher!#ref!,#REF!),preencher!#ref!))","v":{"$error":"#NAME?"}},{"$f":"IF(preencher!#ref!=\"\",\"\",IF(COUNTIF(preencher!#ref!,preencher!#ref!)=0,CONCATENATE(preencher!#ref!,#REF!),preencher!#ref!))","v":{"$error":"#NAME?"}},{"$f":"IF(preencher!#ref!=\"\",\"\",IF(COUNTIF(preencher!#ref!,preencher!#ref!)=0,CONCATENATE(preencher!#ref!,#REF!),preencher!#ref!))","v":{"$error":"#NAME?"}},{"$f":"IF(preencher!#ref!=\"\",\"\",IF(COUNTIF(preencher!#ref!,preencher!#ref!)=0,CONCATENATE(preencher!#ref!,#REF!),preencher!#ref!))","v":{"$error":"#NAME?"}},{"$f":"IF(preencher!#ref!=\"\",\"\",IF(COUNTIF(preencher!#ref!,preencher!#ref!)=0,CONCATENATE(preencher!#ref!,#REF!),preencher!#ref!))","v":{"$error":"#NAME?"}},{"$f":"IF(preencher!#ref!=\"\",\"\",IF(COUNTIF(preencher!#ref!,preencher!#ref!)=0,CONCATENATE(preencher!#ref!,#REF!),preencher!#ref!))","v":{"$error":"#NAME?"}},{"$f":"IF(preencher!#ref!=\"\",\"\",IF(COUNTIF(preencher!#ref!,preencher!#ref!)=0,CONCATENATE(preencher!#ref!,#REF!),preencher!#ref!))","v":{"$error":"#NAME?"}},{"$f":"IF(ISERROR(ROUND(AVERAGE(E60:N60),2)),\"\",ROUND(AVERAGE(E60:N60),2))","v":""},{"$f":"IF(ISERROR(ROUND(O60*D60,2)),\"\",ROUND(O60*D60,2))","v":""},null,null,{"$f":"IF(ISERROR(MEDIAN(E60:N60)),\"\",MEDIAN(E60:N60))","v":""},{"$f":"IF(ISERROR(STDEV(E60:N60)),\"\",STDEV(E60:N60))","v":""},{"$f":"IF(ISERROR(T60/O60),\"\",T60/O60)","v":""}]
[{"$f":"IF(preencher!#ref!=\"\",\"\",preencher!#ref!)","v":{"$error":"#NAME?"}},{"$f":"IF(preencher!#ref!=\"\",\"\",preencher!#ref!)","v":{"$error":"#NAME?"}},{"$f":"IF(preencher!#ref!=\"\",\"\",preencher!#ref!)","v":{"$error":"#NAME?"}},{"$f":"IF(preencher!#ref!=\"\",\"\",preencher!#ref!)","v":{"$error":"#NAME?"}},{"$f":"IF(preencher!#ref!=\"\",\"\",IF(COUNTIF(preencher!#ref!,preencher!#ref!)=0,CONCATENATE(preencher!#ref!,#REF!),preencher!#ref!))","v":{"$error":"#NAME?"}},{"$f":"IF(preencher!#ref!=\"\",\"\",IF(COUNTIF(preencher!#ref!,preencher!#ref!)=0,CONCATENATE(preencher!#ref!,#REF!),preencher!#ref!))","v":{"$error":"#NAME?"}},{"$f":"IF(preencher!#ref!=\"\",\"\",IF(COUNTIF(preencher!#ref!,preencher!#ref!)=0,CONCATENATE(preencher!#ref!,#REF!),preencher!#ref!))","v":{"$error":"#NAME?"}},{"$f":"IF(preencher!#ref!=\"\",\"\",IF(COUNTIF(preencher!#ref!,preencher!#ref!)=0,CONCATENATE(preencher!#ref!,#REF!),preencher!#ref!))","v":{"$error":"#NAME?"}},{"$f":"IF(preencher!#ref!=\"\",\"\",IF(COUNTIF(preencher!#ref!,preencher!#ref!)=0,CONCATENATE(preencher!#ref!,#REF!),preencher!#ref!))","v":{"$error":"#NAME?"}},{"$f":"IF(preencher!#ref!=\"\",\"\",IF(COUNTIF(preencher!#ref!,preencher!#ref!)=0,CONCATENATE(preencher!#ref!,#REF!),preencher!#ref!))","v":{"$error":"#NAME?"}},{"$f":"IF(preencher!#ref!=\"\",\"\",IF(COUNTIF(preencher!#ref!,preencher!#ref!)=0,CONCATENATE(preencher!#ref!,#REF!),preencher!#ref!))","v":{"$error":"#NAME?"}},{"$f":"IF(preencher!#ref!=\"\",\"\",IF(COUNTIF(preencher!#ref!,preencher!#ref!)=0,CONCATENATE(preencher!#ref!,#REF!),preencher!#ref!))","v":{"$error":"#NAME?"}},{"$f":"IF(preencher!#ref!=\"\",\"\",IF(COUNTIF(preencher!#ref!,preencher!#ref!)=0,CONCATENATE(preencher!#ref!,#REF!),preencher!#ref!))","v":{"$error":"#NAME?"}},{"$f":"IF(preencher!#ref!=\"\",\"\",IF(COUNTIF(preencher!#ref!,preencher!#ref!)=0,CONCATENATE(preencher!#ref!,#REF!),preencher!#ref!))","v":{"$error":"#NAME?"}},{"$f":"IF(ISERROR(ROUND(AVERAGE(E61:N61),2)),\"\",ROUND(AVERAGE(E61:N61),2))","v":""},{"$f":"IF(ISERROR(ROUND(O61*D61,2)),\"\",ROUND(O61*D61,2))","v":""},null,null,{"$f":"IF(ISERROR(MEDIAN(E61:N61)),\"\",MEDIAN(E61:N61))","v":""},{"$f":"IF(ISERROR(STDEV(E61:N61)),\"\",STDEV(E61:N61))","v":""},{"$f":"IF(ISERROR(T61/O61),\"\",T61/O61)","v":""}]
[{"$f":"IF(preencher!#ref!=\"\",\"\",preencher!#ref!)","v":{"$error":"#NAME?"}},{"$f":"IF(preencher!#ref!=\"\",\"\",preencher!#ref!)","v":{"$error":"#NAME?"}},{"$f":"IF(preencher!#ref!=\"\",\"\",preencher!#ref!)","v":{"$error":"#NAME?"}},{"$f":"IF(preencher!#ref!=\"\",\"\",preencher!#ref!)","v":{"$error":"#NAME?"}},{"$f":"IF(preencher!#ref!=\"\",\"\",IF(COUNTIF(preencher!#ref!,preencher!#ref!)=0,CONCATENATE(preencher!#ref!,#REF!),preencher!#ref!))","v":{"$error":"#NAME?"}},{"$f":"IF(preencher!#ref!=\"\",\"\",IF(COUNTIF(preencher!#ref!,preencher!#ref!)=0,CONCATENATE(preencher!#ref!,#REF!),preencher!#ref!))","v":{"$error":"#NAME?"}},{"$f":"IF(preencher!#ref!=\"\",\"\",IF(COUNTIF(preencher!#ref!,preencher!#ref!)=0,CONCATENATE(preencher!#ref!,#REF!),preencher!#ref!))","v":{"$error":"#NAME?"}},{"$f":"IF(preencher!#ref!=\"\",\"\",IF(COUNTIF(preencher!#ref!,preencher!#ref!)=0,CONCATENATE(preencher!#ref!,#REF!),preencher!#ref!))","v":{"$error":"#NAME?"}},{"$f":"IF(preencher!#ref!=\"\",\"\",IF(COUNTIF(preencher!#ref!,preencher!#ref!)=0,CONCATENATE(preencher!#ref!,#REF!),preencher!#ref!))","v":{"$error":"#NAME?"}},{"$f":"IF(preencher!#ref!=\"\",\"\",IF(COUNTIF(preencher!#ref!,preencher!#ref!)=0,CONCATENATE(preencher!#ref!,#REF!),preencher!#ref!))","v":{"$error":"#NAME?"}},{"$f":"IF(preencher!#ref!=\"\",\"\",IF(COUNTIF(preencher!#ref!,preencher!#ref!)=0,CONCATENATE(preencher!#ref!,#REF!),preencher!#ref!))","v":{"$error":"#NAME?"}},{"$f":"IF(preencher!#ref!=\"\",\"\",IF(COUNTIF(preencher!#ref!,preencher!#ref!)=0,CONCATENATE(preencher!#ref!,#REF!),preencher!#ref!))","v":{"$error":"#NAME?"}},{"$f":"IF(preencher!#ref!=\"\",\"\",IF(COUNTIF(preencher!#ref!,preencher!#ref!)=0,CONCATENATE(preencher!#ref!,#REF!),preencher!#ref!))","v":{"$error":"#NAME?"}},{"$f":"IF(preencher!#ref!=\"\",\"\",IF(COUNTIF(preencher!#ref!,preencher!#ref!)=0,CONCATENATE(preencher!#ref!,#REF!),preencher!#ref!))","v":{"$error":"#NAME?"}},{"$f":"IF(ISERROR(ROUND(AVERAGE(E62:N62),2)),\"\",ROUND(AVERAGE(E62:N62),2))","v":""},{"$f":"IF(ISERROR(ROUND(O62*D62,2)),\"\",ROUND(O62*D62,2))","v":""},null,null,{"$f":"IF(ISERROR(MEDIAN(E62:N62)),\"\",MEDIAN(E62:N62))","v":""},{"$f":"IF(ISERROR(STDEV(E62:N62)),\"\",STDEV(E62:N62))","v":""},{"$f":"IF(ISERROR(T62/O62),\"\",T62/O62)","v":""}]
[{"$f":"IF(preencher!#ref!=\"\",\"\",preencher!#ref!)","v":{"$error":"#NAME?"}},{"$f":"IF(preencher!#ref!=\"\",\"\",preencher!#ref!)","v":{"$error":"#NAME?"}},{"$f":"IF(preencher!#ref!=\"\",\"\",preencher!#ref!)","v":{"$error":"#NAME?"}},{"$f":"IF(preencher!#ref!=\"\",\"\",preencher!#ref!)","v":{"$error":"#NAME?"}},{"$f":"IF(preencher!#ref!=\"\",\"\",IF(COUNTIF(preencher!#ref!,preencher!#ref!)=0,CONCATENATE(preencher!#ref!,#REF!),preencher!#ref!))","v":{"$error":"#NAME?"}},{"$f":"IF(preencher!#ref!=\"\",\"\",IF(COUNTIF(preencher!#ref!,preencher!#ref!)=0,CONCATENATE(preencher!#ref!,#REF!),preencher!#ref!))","v":{"$error":"#NAME?"}},{"$f":"IF(preencher!#ref!=\"\",\"\",IF(COUNTIF(preencher!#ref!,preencher!#ref!)=0,CONCATENATE(preencher!#ref!,#REF!),preencher!#ref!))","v":{"$error":"#NAME?"}},{"$f":"IF(preencher!#ref!=\"\",\"\",IF(COUNTIF(preencher!#ref!,preencher!#ref!)=0,CONCATENATE(preencher!#ref!,#REF!),preencher!#ref!))","v":{"$error":"#NAME?"}},{"$f":"IF(preencher!#ref!=\"\",\"\",IF(COUNTIF(preencher!#ref!,preencher!#ref!)=0,CONCATENATE(preencher!#ref!,#REF!),preencher!#ref!))","v":{"$error":"#NAME?"}},{"$f":"IF(preencher!#ref!=\"\",\"\",IF(COUNTIF(preencher!#ref!,preencher!#ref!)=0,CONCATENATE(preencher!#ref!,#REF!),preencher!#ref!))","v":{"$error":"#NAME?"}},{"$f":"IF(preencher!#ref!=\"\",\"\",IF(COUNTIF(preencher!#ref!,preencher!#ref!)=0,CONCATENATE(preencher!#ref!,#REF!),preencher!#ref!))","v":{"$error":"#NAME?"}},{"$f":"IF(preencher!#ref!=\"\",\"\",IF(COUNTIF(preencher!#ref!,preencher!#ref!)=0,CONCATENATE(preencher!#ref!,#REF!),preencher!#ref!))","v":{"$error":"#NAME?"}},{"$f":"IF(preencher!#ref!=\"\",\"\",IF(COUNTIF(preencher!#ref!,preencher!#ref!)=0,CONCATENATE(preencher!#ref!,#REF!),preencher!#ref!))","v":{"$error":"#NAME?"}},{"$f":"IF(preencher!#ref!=\"\",\"\",IF(COUNTIF(preencher!#ref!,preencher!#ref!)=0,CONCATENATE(preencher!#ref!,#REF!),preencher!#ref!))","v":{"$error":"#NAME?"}},{"$f":"IF(ISERROR(ROUND(AVERAGE(E63:N63),2)),\"\",ROUND(AVERAGE(E63:N63),2))","v":""},{"$f":"IF(ISERROR(ROUND(O63*D63,2)),\"\",ROUND(O63*D63,2))","v":""},null,null,{"$f":"IF(ISERROR(MEDIAN(E63:N63)),\"\",MEDIAN(E63:N63))","v":""},{"$f":"IF(ISERROR(STDEV(E63:N63)),\"\",STDEV(E63:N63))","v":""},{"$f":"IF(ISERROR(T63/O63),\"\",T63/O63)","v":""}]
[{"$f":"IF(preencher!#ref!=\"\",\"\",preencher!#ref!)","v":{"$error":"#NAME?"}},{"$f":"IF(preencher!#ref!=\"\",\"\",preencher!#ref!)","v":{"$error":"#NAME?"}},{"$f":"IF(preencher!#ref!=\"\",\"\",preencher!#ref!)","v":{"$error":"#NAME?"}},{"$f":"IF(preencher!#ref!=\"\",\"\",preencher!#ref!)","v":{"$error":"#NAME?"}},{"$f":"IF(preencher!#ref!=\"\",\"\",IF(COUNTIF(preencher!#ref!,preencher!#ref!)=0,CONCATENATE(preencher!#ref!,#REF!),preencher!#ref!))","v":{"$error":"#NAME?"}},{"$f":"IF(preencher!#ref!=\"\",\"\",IF(COUNTIF(preencher!#ref!,preencher!#ref!)=0,CONCATENATE(preencher!#ref!,#REF!),preencher!#ref!))","v":{"$error":"#NAME?"}},{"$f":"IF(preencher!#ref!=\"\",\"\",IF(COUNTIF(preencher!#ref!,preencher!#ref!)=0,CONCATENATE(preencher!#ref!,#REF!),preencher!#ref!))","v":{"$error":"#NAME?"}},{"$f":"IF(preencher!#ref!=\"\",\"\",IF(COUNTIF(preencher!#ref!,preencher!#ref!)=0,CONCATENATE(preencher!#ref!,#REF!),preencher!#ref!))","v":{"$error":"#NAME?"}},{"$f":"IF(preencher!#ref!=\"\",\"\",IF(COUNTIF(preencher!#ref!,preencher!#ref!)=0,CONCATENATE(preencher!#ref!,#REF!),preencher!#ref!))","v":{"$error":"#NAME?"}},{"$f":"IF(preencher!#ref!=\"\",\"\",IF(COUNTIF(preencher!#ref!,preencher!#ref!)=0,CONCATENATE(preencher!#ref!,#REF!),preencher!#ref!))","v":{"$error":"#NAME?"}},{"$f":"IF(preencher!#ref!=\"\",\"\",IF(COUNTIF(preencher!#ref!,preencher!#ref!)=0,CONCATENATE(preencher!#ref!,#REF!),preencher!#ref!))","v":{"$error":"#NAME?"}},{"$f":"IF(preencher!#ref!=\"\",\"\",IF(COUNTIF(preencher!#ref!,preencher!#ref!)=0,CONCATENATE(preencher!#ref!,#REF!),preencher!#ref!))","v":{"$error":"#NAME?"}},{"$f":"IF(preencher!#ref!=\"\",\"\",IF(COUNTIF(preencher!#ref!,preencher!#ref!)=0,CONCATENATE(preencher!#ref!,#REF!),preencher!#ref!))","v":{"$error":"#NAME?"}},{"$f":"IF(preencher!#ref!=\"\",\"\",IF(COUNTIF(preencher!#ref!,preencher!#ref!)=0,CONCATENATE(preencher!#ref!,#REF!),preencher!#ref!))","v":{"$error":"#NAME?"}},{"$f":"IF(ISERROR(ROUND(AVERAGE(E64:N64),2)),\"\",ROUND(AVERAGE(E64:N64),2))","v":""},{"$f":"IF(ISERROR(ROUND(O64*D64,2)),\"\",ROUND(O64*D64,2))","v":""},null,null,{"$f":"IF(ISERROR(MEDIAN(E64:N64)),\"\",MEDIAN(E64:N64))","v":""},{"$f":"IF(ISERROR(STDEV(E64:N64)),\"\",STDEV(E64:N64))","v":""},{"$f":"IF(ISERROR(T64/O64),\"\",T64/O64)","v":""}]
[{"$f":"IF(preencher!#ref!=\"\",\"\",preencher!#ref!)","v":{"$error":"#NAME?"}},{"$f":"IF(preencher!#ref!=\"\",\"\",preencher!#ref!)","v":{"$error":"#NAME?"}},{"$f":"IF(preencher!#ref!=\"\",\"\",preencher!#ref!)","v":{"$error":"#NAME?"}},{"$f":"IF(preencher!#ref!=\"\",\"\",preencher!#ref!)","v":{"$error":"#NAME?"}},{"$f":"IF(preencher!#ref!=\"\",\"\",IF(COUNTIF(preencher!#ref!,preencher!#ref!)=0,CONCATENATE(preencher!#ref!,#REF!),preencher!#ref!))","v":{"$error":"#NAME?"}},{"$f":"IF(preencher!#ref!=\"\",\"\",IF(COUNTIF(preencher!#ref!,preencher!#ref!)=0,CONCATENATE(preencher!#ref!,#REF!),preencher!#ref!))","v":{"$error":"#NAME?"}},{"$f":"IF(preencher!#ref!=\"\",\"\",IF(COUNTIF(preencher!#ref!,preencher!#ref!)=0,CONCATENATE(preencher!#ref!,#REF!),preencher!#ref!))","v":{"$error":"#NAME?"}},{"$f":"IF(preencher!#ref!=\"\",\"\",IF(COUNTIF(preencher!#ref!,preencher!#ref!)=0,CONCATENATE(preencher!#ref!,#REF!),preencher!#ref!))","v":{"$error":"#NAME?"}},{"$f":"IF(preencher!#ref!=\"\",\"\",IF(COUNTIF(preencher!#ref!,preencher!#ref!)=0,CONCATENATE(preencher!#ref!,#REF!),preencher!#ref!))","v":{"$error":"#NAME?"}},{"$f":"IF(preencher!#ref!=\"\",\"\",IF(COUNTIF(preencher!#ref!,preencher!#ref!)=0,CONCATENATE(preencher!#ref!,#REF!),preencher!#ref!))","v":{"$error":"#NAME?"}},{"$f":"IF(preencher!#ref!=\"\",\"\",IF(COUNTIF(preencher!#ref!,preencher!#ref!)=0,CONCATENATE(preencher!#ref!,#REF!),preencher!#ref!))","v":{"$error":"#NAME?"}},{"$f":"IF(preencher!#ref!=\"\",\"\",IF(COUNTIF(preencher!#ref!,preencher!#ref!)=0,CONCATENATE(preencher!#ref!,#REF!),preencher!#ref!))","v":{"$error":"#NAME?"}},{"$f":"IF(preencher!#ref!=\"\",\"\",IF(COUNTIF(preencher!#ref!,preencher!#ref!)=0,CONCATENATE(preencher!#ref!,#REF!),preencher!#ref!))","v":{"$error":"#NAME?"}},{"$f":"IF(preencher!#ref!=\"\",\"\",IF(COUNTIF(preencher!#ref!,preencher!#ref!)=0,CONCATENATE(preencher!#ref!,#REF!),preencher!#ref!))","v":{"$error":"#NAME?"}},{"$f":"IF(ISERROR(ROUND(AVERAGE(E65:N65),2)),\"\",ROUND(AVERAGE(E65:N65),2))","v":""},{"$f":"IF(ISERROR(ROUND(O65*D65,2)),\"\",ROUND(O65*D65,2))","v":""},null,null,{"$f":"IF(ISERROR(MEDIAN(E65:N65)),\"\",MEDIAN(E65:N65))","v":""},{"$f":"IF(ISERROR(STDEV(E65:N65)),\"\",STDEV(E65:N65))","v":""},{"$f":"IF(ISERROR(T65/O65),\"\",T65/O65)","v":""}]
[{"$f":"IF(preencher!#ref!=\"\",\"\",preencher!#ref!)","v":{"$error":"#NAME?"}},{"$f":"IF(preencher!#ref!=\"\",\"\",preencher!#ref!)","v":{"$error":"#NAME?"}},{"$f":"IF(preencher!#ref!=\"\",\"\",preencher!#ref!)","v":{"$error":"#NAME?"}},{"$f":"IF(preencher!#ref!=\"\",\"\",preencher!#ref!)","v":{"$error":"#NAME?"}},{"$f":"IF(preencher!#ref!=\"\",\"\",IF(COUNTIF(preencher!#ref!,preencher!#ref!)=0,CONCATENATE(preencher!#ref!,#REF!),preencher!#ref!))","v":{"$error":"#NAME?"}},{"$f":"IF(preencher!#ref!=\"\",\"\",IF(COUNTIF(preencher!#ref!,preencher!#ref!)=0,CONCATENATE(preencher!#ref!,#REF!),preencher!#ref!))","v":{"$error":"#NAME?"}},{"$f":"IF(preencher!#ref!=\"\",\"\",IF(COUNTIF(preencher!#ref!,preencher!#ref!)=0,CONCATENATE(preencher!#ref!,#REF!),preencher!#ref!))","v":{"$error":"#NAME?"}},{"$f":"IF(preencher!#ref!=\"\",\"\",IF(COUNTIF(preencher!#ref!,preencher!#ref!)=0,CONCATENATE(preencher!#ref!,#REF!),preencher!#ref!))","v":{"$error":"#NAME?"}},{"$f":"IF(preencher!#ref!=\"\",\"\",IF(COUNTIF(preencher!#ref!,preencher!#ref!)=0,CONCATENATE(preencher!#ref!,#REF!),preencher!#ref!))","v":{"$error":"#NAME?"}},{"$f":"IF(preencher!#ref!=\"\",\"\",IF(COUNTIF(preencher!#ref!,preencher!#ref!)=0,CONCATENATE(preencher!#ref!,#REF!),preencher!#ref!))","v":{"$error":"#NAME?"}},{"$f":"IF(preencher!#ref!=\"\",\"\",IF(COUNTIF(preencher!#ref!,preencher!#ref!)=0,CONCATENATE(preencher!#ref!,#REF!),preencher!#ref!))","v":{"$error":"#NAME?"}},{"$f":"IF(preencher!#ref!=\"\",\"\",IF(COUNTIF(preencher!#ref!,preencher!#ref!)=0,CONCATENATE(preencher!#ref!,#REF!),preencher!#ref!))","v":{"$error":"#NAME?"}},{"$f":"IF(preencher!#ref!=\"\",\"\",IF(COUNTIF(preencher!#ref!,preencher!#ref!)=0,CONCATENATE(preencher!#ref!,#REF!),preencher!#ref!))","v":{"$error":"#NAME?"}},{"$f":"IF(preencher!#ref!=\"\",\"\",IF(COUNTIF(preencher!#ref!,preencher!#ref!)=0,CONCATENATE(preencher!#ref!,#REF!),preencher!#ref!))","v":{"$error":"#NAME?"}},{"$f":"IF(ISERROR(ROUND(AVERAGE(E66:N66),2)),\"\",ROUND(AVERAGE(E66:N66),2))","v":""},{"$f":"IF(ISERROR(ROUND(O66*D66,2)),\"\",ROUND(O66*D66,2))","v":""},null,null,{"$f":"IF(ISERROR(MEDIAN(E66:N66)),\"\",MEDIAN(E66:N66))","v":""},{"$f":"IF(ISERROR(STDEV(E66:N66)),\"\",STDEV(E66:N66))","v":""},{"$f":"IF(ISERROR(T66/O66),\"\",T66/O66)","v":""}]
[{"$f":"IF(preencher!#ref!=\"\",\"\",preencher!#ref!)","v":{"$error":"#NAME?"}},{"$f":"IF(preencher!#ref!=\"\",\"\",preencher!#ref!)","v":{"$error":"#NAME?"}},{"$f":"IF(preencher!#ref!=\"\",\"\",preencher!#ref!)","v":{"$error":"#NAME?"}},{"$f":"IF(preencher!#ref!=\"\",\"\",preencher!#ref!)","v":{"$error":"#NAME?"}},{"$f":"IF(preencher!#ref!=\"\",\"\",IF(COUNTIF(preencher!#ref!,preencher!#ref!)=0,CONCATENATE(preencher!#ref!,#REF!),preencher!#ref!))","v":{"$error":"#NAME?"}},{"$f":"IF(preencher!#ref!=\"\",\"\",IF(COUNTIF(preencher!#ref!,preencher!#ref!)=0,CONCATENATE(preencher!#ref!,#REF!),preencher!#ref!))","v":{"$error":"#NAME?"}},{"$f":"IF(preencher!#ref!=\"\",\"\",IF(COUNTIF(preencher!#ref!,preencher!#ref!)=0,CONCATENATE(preencher!#ref!,#REF!),preencher!#ref!))","v":{"$error":"#NAME?"}},{"$f":"IF(preencher!#ref!=\"\",\"\",IF(COUNTIF(preencher!#ref!,preencher!#ref!)=0,CONCATENATE(preencher!#ref!,#REF!),preencher!#ref!))","v":{"$error":"#NAME?"}},{"$f":"IF(preencher!#ref!=\"\",\"\",IF(COUNTIF(preencher!#ref!,preencher!#ref!)=0,CONCATENATE(preencher!#ref!,#REF!),preencher!#ref!))","v":{"$error":"#NAME?"}},{"$f":"IF(preencher!#ref!=\"\",\"\",IF(COUNTIF(preencher!#ref!,preencher!#ref!)=0,CONCATENATE(preencher!#ref!,#REF!),preencher!#ref!))","v":{"$error":"#NAME?"}},{"$f":"IF(preencher!#ref!=\"\",\"\",IF(COUNTIF(preencher!#ref!,preencher!#ref!)=0,CONCATENATE(preencher!#ref!,#REF!),preencher!#ref!))","v":{"$error":"#NAME?"}},{"$f":"IF(preencher!#ref!=\"\",\"\",IF(COUNTIF(preencher!#ref!,preencher!#ref!)=0,CONCATENATE(preencher!#ref!,#REF!),preencher!#ref!))","v":{"$error":"#NAME?"}},{"$f":"IF(preencher!#ref!=\"\",\"\",IF(COUNTIF(preencher!#ref!,preencher!#ref!)=0,CONCATENATE(preencher!#ref!,#REF!),preencher!#ref!))","v":{"$error":"#NAME?"}},{"$f":"IF(preencher!#ref!=\"\",\"\",IF(COUNTIF(preencher!#ref!,preencher!#ref!)=0,CONCATENATE(preencher!#ref!,#REF!),preencher!#ref!))","v":{"$error":"#NAME?"}},{"$f":"IF(ISERROR(ROUND(AVERAGE(E67:N67),2)),\"\",ROUND(AVERAGE(E67:N67),2))","v":""},{"$f":"IF(ISERROR(ROUND(O67*D67,2)),\"\",ROUND(O67*D67,2))","v":""},null,null,{"$f":"IF(ISERROR(MEDIAN(E67:N67)),\"\",MEDIAN(E67:N67))","v":""},{"$f":"IF(ISERROR(STDEV(E67:N67)),\"\",STDEV(E67:N67))","v":""},{"$f":"IF(ISERROR(T67/O67),\"\",T67/O67)","v":""}]
["VALOR GLOBAL",null,null,null,null,null,null,null,null,null,null,null,null,null,null,{"$f":"IF(SUM(P8:P67)=0,\"\",SUM(P8:P67))","v":""}]

{"sheet":"Média 2º, 3º e 4º","index":2,"n_rows":68,"n_cols":21,"rows_kept":68,"cut":false,"hidden":true,"merged":[[5,18,5,20],[67,0,67,14]]}
[]
[]
[]
[]
[]
[null,null,null,null,null,null,null,null,null,null,null,null,null,null,null,null,null,null,"ANÁLISE ESTATÍSTICA"]
[{"$f":"PREENCHER!A4","v":"ITEM"},{"$f":"PREENCHER!B4","v":"ESPECIFICAÇÃO"},{"$f":"PREENCHER!C4","v":"UN"},{"$f":"PREENCHER!D4","v":"QTDE"},{"$f":"preencher!#ref!","v":{"$error":"#NAME?"}},{"$f":"preencher!#ref!","v":{"$error":"#NAME?"}},{"$f":"PREENCHER!G5","v":"MAGAZINE LUIZA"},{"$f":"preencher!#ref!","v":{"$error":"#NAME?"}},{"$f":"preencher!#ref!","v":{"$error":"#NAME?"}},{"$f":"preencher!#ref!","v":{"$error":"#NAME?"}},{"$f":"preencher!#ref!","v":{"$error":"#NAME?"}},{"$f":"preencher!#ref!","v":{"$error":"#NAME?"}},{"$f":"preencher!#ref!","v":{"$error":"#NAME?"}},{"$f":"preencher!#ref!","v":{"$error":"#NAME?"}},{"$f":"PREENCHER!M5","v":"UNITÁRIO"},{"$f":"PREENCHER!N5","v":"TOTAL"},{"$f":"PREENCHER!Q4","v":"OBSERVAÇÃO"},null,"MEDIANA","DESVIO PADRÃO","COEFICIENTE DE VARIAÇÃO"]
[{"$f":"IF(PREENCHER!A6=\"\",\"\",PREENCHER!A6)","v":1},{"$f":"IF(PREENCHER!B6=\"\",\"\",PREENCHER!B6)","v":"ESCADA PLATAFORMA EM ALUMÍNIO, NR 12, CAPACIDADE MÍNIMA 150 KG, COM BASE FIXA E 2 RODAS TRASEIRAS PARA MOVIMENTAÇÃO. COM CORRIMÃO. "},{"$f":"IF(PREENCHER!C6=\"\",\"\",PREENCHER!C6)","v":"UNIDADE"},{"$f":"IF(PREENCHER!D6=\"\",\"\",PREENCHER!D6)","v":2},{"$f":"IF(preencher!#ref!=\"\",\"\",IF(COUNTIF(PREENCHER!$AE6:$AG6,preencher!#ref!)=0,CONCATENATE(PREENCHER!AO6,#REF!),preencher!#ref!))","v":{"$error":"#NAME?"}},{"$f":"IF(PREENCHER!G6=\"\",\"\",IF(COUNTIF(PREENCHER!$AE6:$AG6,PREENCHER!G6)=0,CONCATENATE(PREENCHER!AP6,#REF!),PREENCHER!G6))","v":{"$error":"#REF!"}},{"$f":"IF(preencher!#ref!=\"\",\"\",IF(COUNTIF(PREENCHER!$AE6:$AG6,preencher!#ref!)=0,CONCATENATE(PREENCHER!AQ6,#REF!),preencher!#ref!))","v":{"$error":"#NAME?"}},{"$f":"IF(preencher!#ref!=\"\",\"\",IF(COUNTIF(PREENCHER!$AE6:$AG6,preencher!#ref!)=0,CONCATENATE(PREENCHER!AR6,#REF!),preencher!#ref!))","v":{"$error":"#NAME?"}},{"$f":"IF(preencher!#ref!=\"\",\"\",IF(COUNTIF(PREENCHER!$AE6:$AG6,preencher!#ref!)=0,CONCATENATE(PREENCHER!AS6,#REF!),preencher!#ref!))","v":{"$error":"#NAME?"}},{"$f":"IF(preencher!#ref!=\"\",\"\",IF(COUNTIF(PREENCHER!$AE6:$AG6,preencher!#ref!)=0,CONCATENATE(PREENCHER!AT6,#REF!),preencher!#ref!))","v":{"$error":"#NAME?"}},{"$f":"IF(preencher!#ref!=\"\",\"\",IF(COUNTIF(PREENCHER!$AE6:$AG6,preencher!#ref!)=0,CONCATENATE(PREENCHER!AU6,#REF!),preencher!#ref!))","v":{"$error":"#NAME?"}},{"$f":"IF(preencher!#ref!=\"\",\"\",IF(COUNTIF(PREENCHER!$AE6:$AG6,preencher!#ref!)=0,CONCATENATE(PREENCHER!AV6,#REF!),preencher!#ref!))","v":{"$error":"#NAME?"}},{"$f":"IF(preencher!#ref!=\"\",\"\",IF(COUNTIF(PREENCHER!$AE6:$AG6,preencher!#ref!)=0,CONCATENATE(PREENCHER!AW6,#REF!),preencher!#ref!))","v":{"$error":"#NAME?"}},{"$f":"IF(preencher!#ref!=\"\",\"\",IF(COUNTIF(PREENCHER!$AE6:$AG6,preencher!#ref!)=0,CONCATENATE(PREENCHER!AX6,#REF!),preencher!#ref!))","v":{"$error":"#NAME?"}},{"$f":"IF(ISERROR(ROUND(AVERAGE(E8:N8),2)),\"\",ROUND(AVERAGE(E8:N8),2))","v":""},{"$f":"IF(ISERROR(ROUND(O8*D8,2)),\"\",ROUND(O8*D8,2))","v":""},null,null,{"$f":"IF(ISERROR(MEDIAN(E8:N8)),\"\",MEDIAN(E8:N8))","v":""},{"$f":"IF(ISERROR(STDEV(E8:N8)),\"\",STDEV(E8:N8))","v":""},{"$f":"IF(ISERROR(T8/O8),\"\",T8/O8)","v":""}]
[{"$f":"IF(PREENCHER!A7=\"\",\"\",PREENCHER!A7)","v":2},{"$f":"IF(PREENCHER!B7=\"\",\"\",PREENCHER!B7)","v":""},{"$f":"IF(PREENCHER!C7=\"\",\"\",PREENCHER!C7)","v":"GRAMAS"},{"$f":"IF(PREENCHER!D7=\"\",\"\",PREENCHER!D7)","v":0},{"$f":"IF(preencher!#ref!=\"\",\"\",IF(COUNTIF(PREENCHER!$AE7:$AG7,preencher!#ref!)=0,CONCATENATE(PREENCHER!AO7,#REF!),preencher!#ref!))","v":{"$error":"#NAME?"}},{"$f":"IF(PREENCHER!G7=\"\",\"\",IF(COUNTIF(PREENCHER!$AE7:$AG7,PREENCHER!G7)=0,CONCATENATE(PREENCHER!AP7,#REF!),PREENCHER!G7))","v":""},{"$f":"IF(preencher!#ref!=\"\",\"\",IF(COUNTIF(PREENCHER!$AE7:$AG7,preencher!#ref!)=0,CONCATENATE(PREENCHER!AQ7,#REF!),preencher!#ref!))","v":{"$error":"#NAME?"}},{"$f":"IF(preencher!#ref!=\"\",\"\",IF(COUNTIF(PREENCHER!$AE7:$AG7,preencher!#ref!)=0,CONCATENATE(PREENCHER!AR7,#REF!),preencher!#ref!))","v":{"$error":"#NAME?"}},{"$f":"IF(preencher!#ref!=\"\",\"\",IF(COUNTIF(PREENCHER!$AE7:$AG7,preencher!#ref!)=0,CONCATENATE(PREENCHER!AS7,#REF!),preencher!#ref!))","v":{"$error":"#NAME?"}},{"$f":"IF(preencher!#ref!=\"\",\"\",IF(COUNTIF(PREENCHER!$AE7:$AG7,preencher!#ref!)=0,CONCATENATE(PREENCHER!AT7,#REF!),preencher!#ref!))","v":{"$error":"#NAME?"}},{"$f":"IF(preencher!#ref!=\"\",\"\",IF(COUNTIF(PREENCHER!$AE7:$AG7,preencher!#ref!)=0,CONCATENATE(PREENCHER!AU7,#REF!),preencher!#ref!))","v":{"$error":"#NAME?"}},{"$f":"IF(preencher!#ref!=\"\",\"\",IF(COUNTIF(PREENCHER!$AE7:$AG7,preencher!#ref!)=0,CONCATENATE(PREENCHER!AV7,#REF!),preencher!#ref!))","v":{"$error":"#NAME?"}},{"$f":"IF(preencher!#ref!=\"\",\"\",IF(COUNTIF(PREENCHER!$AE7:$AG7,preencher!#ref!)=0,CONCATENATE(PREENCHER!AW7,#REF!),preencher!#ref!))","v":{"$error":"#NAME?"}},{"$f":"IF(preencher!#ref!=\"\",\"\",IF(COUNTIF(PREENCHER!$AE7:$AG7,preencher!#ref!)=0,CONCATENATE(PREENCHER!AX7,#REF!),preencher!#ref!))","v":{"$error":"#NAME?"}},{"$f":"IF(ISERROR(ROUND(AVERAGE(E9:N9),2)),\"\",ROUND(AVERAGE(E9:N9),2))","v":""},{"$f":"IF(ISERROR(ROUND(O9*D9,2)),\"\",ROUND(O9*D9,2))","v":""},null,null,{"$f":"IF(ISERROR(MEDIAN(E9:N9)),\"\",MEDIAN(E9:N9))","v":""},{"$f":"IF(ISERROR(STDEV(E9:N9)),\"\",STDEV(E9:N9))","v":""},{"$f":"IF(ISERROR(T9/O9),\"\",T9/O9)","v":""}]
[{"$f":"IF(PREENCHER!A8=\"\",\"\",PREENCHER!A8)","v":3},{"$f":"IF(PREENCHER!B8=\"\",\"\",PREENCHER!B8)","v":""},{"$f":"IF(PREENCHER!C8=\"\",\"\",PREENCHER!C8)","v":"GRAMAS"},{"$f":"IF(PREENCHER!D8=\"\",\"\",PREENCHER!D8)","v":0},{"$f":"IF(preencher!#ref!=\"\",\"\",IF(COUNTIF(PREENCHER!$AE8:$AG8,preencher!#ref!)=0,CONCATENATE(PREENCHER!AO8,#REF!),preencher!#ref!))","v":{"$error":"#NAME?"}},{"$f":"IF(PREENCHER!G8=\"\",\"\",IF(COUNTIF(PREENCHER!$AE8:$AG8,PREENCHER!G8)=0,CONCATENATE(PREENCHER!AP8,#REF!),PREENCHER!G8))","v":""},{"$f":"IF(preencher!#ref!=\"\",\"\",IF(COUNTIF(PREENCHER!$AE8:$AG8,preencher!#ref!)=0,CONCATENATE(PREENCHER!AQ8,#REF!),preencher!#ref!))","v":{"$error":"#NAME?"}},{"$f":"IF(preencher!#ref!=\"\",\"\",IF(COUNTIF(PREENCHER!$AE8:$AG8,preencher!#ref!)=0,CONCATENATE(PREENCHER!AR8,#REF!),preencher!#ref!))","v":{"$error":"#NAME?"}},{"$f":"IF(preencher!#ref!=\"\",\"\",IF(COUNTIF(PREENCHER!$AE8:$AG8,preencher!#ref!)=0,CONCATENATE(PREENCHER!AS8,#REF!),preencher!#ref!))","v":{"$error":"#NAME?"}},{"$f":"IF(preencher!#ref!=\"\",\"\",IF(COUNTIF(PREENCHER!$AE8:$AG8,preencher!#ref!)=0,CONCATENATE(PREENCHER!AT8,#REF!),preencher!#ref!))","v":{"$error":"#NAME?"}},{"$f":"IF(preencher!#ref!=\"\",\"\",IF(COUNTIF(PREENCHER!$AE8:$AG8,preencher!#ref!)=0,CONCATENATE(PREENCHER!AU8,#REF!),preencher!#ref!))","v":{"$error":"#NAME?"}},{"$f":"IF(preencher!#ref!=\"\",\"\",IF(COUNTIF(PREENCHER!$AE8:$AG8,preencher!#ref!)=0,CONCATENATE(PREENCHER!AV8,#REF!),preencher!#ref!))","v":{"$error":"#NAME?"}},{"$f":"IF(preencher!#ref!=\"\",\"\",IF(COUNTIF(PREENCHER!$AE8:$AG8,preencher!#ref!)=0,CONCATENATE(PREENCHER!AW8,#REF!),preencher!#ref!))","v":{"$error":"#NAME?"}},{"$f":"IF(preencher!#ref!=\"\",\"\",IF(COUNTIF(PREENCHER!$AE8:$AG8,preencher!#ref!)=0,CONCATENATE(PREENCHER!AX8,#REF!),preencher!#ref!))","v":{"$error":"#NAME?"}},{"$f":"IF(ISERROR(ROUND(AVERAGE(E10:N10),2)),\"\",ROUND(AVERAGE(E10:N10),2))","v":""},{"$f":"IF(ISERROR(ROUND(O10*D10,2)),\"\",ROUND(O10*D10,2))","v":""},null,null,{"$f":"IF(ISERROR(MEDIAN(E10:N10)),\"\",MEDIAN(E10:N10))","v":""},{"$f":"IF(ISERROR(STDEV(E10:N10)),\"\",STDEV(E10:N10))","v":""},{"$f":"IF(ISERROR(T10/O10),\"\",T10/O10)","v":""}]
[{"$f":"IF(preencher!#ref!=\"\",\"\",preencher!#ref!)","v":{"$error":"#NAME?"}},{"$f":"IF(preencher!#ref!=\"\",\"\",preencher!#ref!)","v":{"$error":"#NAME?"}},{"$f":"IF(preencher!#ref!=\"\",\"\",preencher!#ref!)","v":{"$error":"#NAME?"}},{"$f":"IF(preencher!#ref!=\"\",\"\",preencher!#ref!)","v":{"$error":"#NAME?"}},{"$f":"IF(preencher!#ref!=\"\",\"\",IF(COUNTIF(preencher!#ref!,preencher!#ref!)=0,CONCATENATE(preencher!#ref!,#REF!),preencher!#ref!))","v":{"$error":"#NAME?"}},{"$f":"IF(preencher!#ref!=\"\",\"\",IF(COUNTIF(preencher!#ref!,preencher!#ref!)=0,CONCATENATE(preencher!#ref!,#REF!),preencher!#ref!))","v":{"$error":"#NAME?"}},{"$f":"IF(preencher!#ref!=\"\",\"\",IF(COUNTIF(preencher!#ref!,preencher!#ref!)=0,CONCATENATE(preencher!#ref!,#REF!),preencher!#ref!))","v":{"$error":"#NAME?"}},{"$f":"IF(preencher!#ref!=\"\",\"\",IF(COUNTIF(preencher!#ref!,preencher!#ref!)=0,CONCATENATE(preencher!#ref!,#REF!),preencher!#ref!))","v":{"$error":"#NAME?"}},{"$f":"IF(preencher!#ref!=\"\",\"\",IF(COUNTIF(preencher!#ref!,preencher!#ref!)=0,CONCATENATE(preencher!#ref!,#REF!),preencher!#ref!))","v":{"$error":"#NAME?"}},{"$f":"IF(preencher!#ref!=\"\",\"\",IF(COUNTIF(preencher!#ref!,preencher!#ref!)=0,CONCATENATE(preencher!#ref!,#REF!),preencher!#ref!))","v":{"$error":"#NAME?"}},{"$f":"IF(preencher!#ref!=\"\",\"\",IF(COUNTIF(preencher!#ref!,preencher!#ref!)=0,CONCATENATE(preencher!#ref!,#REF!),preencher!#ref!))","v":{"$error":"#NAME?"}},{"$f":"IF(preencher!#ref!=\"\",\"\",IF(COUNTIF(preencher!#ref!,preencher!#ref!)=0,CONCATENATE(preencher!#ref!,#REF!),preencher!#ref!))","v":{"$error":"#NAME?"}},{"$f":"IF(preencher!#ref!=\"\",\"\",IF(COUNTIF(preencher!#ref!,preencher!#ref!)=0,CONCATENATE(preencher!#ref!,#REF!),preencher!#ref!))","v":{"$error":"#NAME?"}},{"$f":"IF(preencher!#ref!=\"\",\"\",IF(COUNTIF(preencher!#ref!,preencher!#ref!)=0,CONCATENATE(preencher!#ref!,#REF!),preencher!#ref!))","v":{"$error":"#NAME?"}},{"$f":"IF(ISERROR(ROUND(AVERAGE(E11:N11),2)),\"\",ROUND(AVERAGE(E11:N11),2))","v":""},{"$f":"IF(ISERROR(ROUND(O11*D11,2)),\"\",ROUND(O11*D11,2))","v":""},null,null,{"$f":"IF(ISERROR(MEDIAN(E11:N11)),\"\",MEDIAN(E11:N11))","v":""},{"$f":"IF(ISERROR(STDEV(E11:N11)),\"\",STDEV(E11:N11))","v":""},{"$f":"IF(ISERROR(T11/O11),\"\",T11/O11)","v":""}]
[{"$f":"IF(preencher!#ref!=\"\",\"\",preencher!#ref!)","v":{"$error":"#NAME?"}},{"$f":"IF(preencher!#ref!=\"\",\"\",preencher!#ref!)","v":{"$error":"#NAME?"}},{"$f":"IF(preencher!#ref!=\"\",\"\",preencher!#ref!)","v":{"$error":"#NAME?"}},{"$f":"IF(preencher!#ref!=\"\",\"\",preencher!#ref!)","v":{"$error":"#NAME?"}},{"$f":"IF(preencher!#ref!=\"\",\"\",IF(COUNTIF(preencher!#ref!,preencher!#ref!)=0,CONCATENATE(preencher!#ref!,#REF!),preencher!#ref!))","v":{"$error":"#NAME?"}},{"$f":"IF(preencher!#ref!=\"\",\"\",IF(COUNTIF(preencher!#ref!,preencher!#ref!)=0,CONCATENATE(preencher!#ref!,#REF!),preencher!#ref!))","v":{"$error":"#NAME?"}},{"$f":"IF(preencher!#ref!=\"\",\"\",IF(COUNTIF(preencher!#ref!,preencher!#ref!)=0,CONCATENATE(preencher!#ref!,#REF!),preencher!#ref!))","v":{"$error":"#NAME?"}},{"$f":"IF(preencher!#ref!=\"\",\"\",IF(COUNTIF(preencher!#ref!,preencher!#ref!)=0,CONCATENATE(preencher!#ref!,#REF!),preencher!#ref!))","v":{"$error":"#NAME?"}},{"$f":"IF(preencher!#ref!=\"\",\"\",IF(COUNTIF(preencher!#ref!,preencher!#ref!)=0,CONCATENATE(preencher!#ref!,#REF!),preencher!#ref!))","v":{"$error":"#NAME?"}},{"$f":"IF(preencher!#ref!=\"\",\"\",IF(COUNTIF(preencher!#ref!,preencher!#ref!)=0,CONCATENATE(preencher!#ref!,#REF!),preencher!#ref!))","v":{"$error":"#NAME?"}},{"$f":"IF(preencher!#ref!=\"\",\"\",IF(COUNTIF(preencher!#ref!,preencher!#ref!)=0,CONCATENATE(preencher!#ref!,#REF!),preencher!#ref!))","v":{"$error":"#NAME?"}},{"$f":"IF(preencher!#ref!=\"\",\"\",IF(COUNTIF(preencher!#ref!,preencher!#ref!)=0,CONCATENATE(preencher!#ref!,#REF!),preencher!#ref!))","v":{"$error":"#NAME?"}},{"$f":"IF(preencher!#ref!=\"\",\"\",IF(COUNTIF(preencher!#ref!,preencher!#ref!)=0,CONCATENATE(preencher!#ref!,#REF!),preencher!#ref!))","v":{"$error":"#NAME?"}},{"$f":"IF(preencher!#ref!=\"\",\"\",IF(COUNTIF(preencher!#ref!,preencher!#ref!)=0,CONCATENATE(preencher!#ref!,#REF!),preencher!#ref!))","v":{"$error":"#NAME?"}},{"$f":"IF(ISERROR(ROUND(AVERAGE(E12:N12),2)),\"\",ROUND(AVERAGE(E12:N12),2))","v":""},{"$f":"IF(ISERROR(ROUND(O12*D12,2)),\"\",ROUND(O12*D12,2))","v":""},null,null,{"$f":"IF(ISERROR(MEDIAN(E12:N12)),\"\",MEDIAN(E12:N12))","v":""},{"$f":"IF(ISERROR(STDEV(E12:N12)),\"\",STDEV(E12:N12))","v":""},{"$f":"IF(ISERROR(T12/O12),\"\",T12/O12)","v":""}]
[{"$f":"IF(preencher!#ref!=\"\",\"\",preencher!#ref!)","v":{"$error":"#NAME?"}},{"$f":"IF(preencher!#ref!=\"\",\"\",preencher!#ref!)","v":{"$error":"#NAME?"}},{"$f":"IF(preencher!#ref!=\"\",\"\",preencher!#ref!)","v":{"$error":"#NAME?"}},{"$f":"IF(preencher!#ref!=\"\",\"\",preencher!#ref!)","v":{"$error":"#NAME?"}},{"$f":"IF(preencher!#ref!=\"\",\"\",IF(COUNTIF(preencher!#ref!,preencher!#ref!)=0,CONCATENATE(preencher!#ref!,#REF!),preencher!#ref!))","v":{"$error":"#NAME?"}},{"$f":"IF(preencher!#ref!=\"\",\"\",IF(COUNTIF(preencher!#ref!,preencher!#ref!)=0,CONCATENATE(preencher!#ref!,#REF!),preencher!#ref!))","v":{"$error":"#NAME?"}},{"$f":"IF(preencher!#ref!=\"\",\"\",IF(COUNTIF(preencher!#ref!,preencher!#ref!)=0,CONCATENATE(preencher!#ref!,#REF!),preencher!#ref!))","v":{"$error":"#NAME?"}},{"$f":"IF(preencher!#ref!=\"\",\"\",IF(COUNTIF(preencher!#ref!,preencher!#ref!)=0,CONCATENATE(preencher!#ref!,#REF!),preencher!#ref!))","v":{"$error":"#NAME?"}},{"$f":"IF(preencher!#ref!=\"\",\"\",IF(COUNTIF(preencher!#ref!,preencher!#ref!)=0,CONCATENATE(preencher!#ref!,#REF!),preencher!#ref!))","v":{"$error":"#NAME?"}},{"$f":"IF(preencher!#ref!=\"\",\"\",IF(COUNTIF(preencher!#ref!,preencher!#ref!)=0,CONCATENATE(preencher!#ref!,#REF!),preencher!#ref!))","v":{"$error":"#NAME?"}},{"$f":"IF(preencher!#ref!=\"\",\"\",IF(COUNTIF(preencher!#ref!,preencher!#ref!)=0,CONCATENATE(preencher!#ref!,#REF!),preencher!#ref!))","v":{"$error":"#NAME?"}},{"$f":"IF(preencher!#ref!=\"\",\"\",IF(COUNTIF(preencher!#ref!,preencher!#ref!)=0,CONCATENATE(preencher!#ref!,#REF!),preencher!#ref!))","v":{"$error":"#NAME?"}},{"$f":"IF(preencher!#ref!=\"\",\"\",IF(COUNTIF(preencher!#ref!,preencher!#ref!)=0,CONCATENATE(preencher!#ref!,#REF!),preencher!#ref!))","v":{"$error":"#NAME?"}},{"$f":"IF(preencher!#ref!=\"\",\"\",IF(COUNTIF(preencher!#ref!,preencher!#ref!)=0,CONCATENATE(preencher!#ref!,#REF!),preencher!#ref!))","v":{"$error":"#NAME?"}},{"$f":"IF(ISERROR(ROUND(AVERAGE(E13:N13),2)),\"\",ROUND(AVERAGE(E13:N13),2))","v":""},{"$f":"IF(ISERROR(ROUND(O13*D13,2)),\"\",ROUND(O13*D13,2))","v":""},null,null,{"$f":"IF(ISERROR(MEDIAN(E13:N13)),\"\",MEDIAN(E13:N13))","v":""},{"$f":"IF(ISERROR(STDEV(E13:N13)),\"\",STDEV(E13:N13))","v":""},{"$f":"IF(ISERROR(T13/O13),\"\",T13/O13)","v":""}]
[{"$f":"IF(preencher!#ref!=\"\",\"\",preencher!#ref!)","v":{"$error":"#NAME?"}},{"$f":"IF(preencher!#ref!=\"\",\"\",preencher!#ref!)","v":{"$error":"#NAME?"}},{"$f":"IF(preencher!#ref!=\"\",\"\",preencher!#ref!)","v":{"$error":"#NAME?"}},{"$f":"IF(preencher!#ref!=\"\",\"\",preencher!#ref!)","v":{"$error":"#NAME?"}},{"$f":"IF(preencher!#ref!=\"\",\"\",IF(COUNTIF(preencher!#ref!,preencher!#ref!)=0,CONCATENATE(preencher!#ref!,#REF!),preencher!#ref!))","v":{"$error":"#NAME?"}},{"$f":"IF(preencher!#ref!=\"\",\"\",IF(COUNTIF(preencher!#ref!,preencher!#ref!)=0,CONCATENATE(preencher!#ref!,#REF!),preencher!#ref!))","v":{"$error":"#NAME?"}},{"$f":"IF(preencher!#ref!=\"\",\"\",IF(COUNTIF(preencher!#ref!,preencher!#ref!)=0,CONCATENATE(preencher!#ref!,#REF!),preencher!#ref!))","v":{"$error":"#NAME?"}},{"$f":"IF(preencher!#ref!=\"\",\"\",IF(COUNTIF(preencher!#ref!,preencher!#ref!)=0,CONCATENATE(preencher!#ref!,#REF!),preencher!#ref!))","v":{"$error":"#NAME?"}},{"$f":"IF(preencher!#ref!=\"\",\"\",IF(COUNTIF(preencher!#ref!,preencher!#ref!)=0,CONCATENATE(preencher!#ref!,#REF!),preencher!#ref!))","v":{"$error":"#NAME?"}},{"$f":"IF(preencher!#ref!=\"\",\"\",IF(COUNTIF(preencher!#ref!,preencher!#ref!)=0,CONCATENATE(preencher!#ref!,#REF!),preencher!#ref!))","v":{"$error":"#NAME?"}},{"$f":"IF(preencher!#ref!=\"\",\"\",IF(COUNTIF(preencher!#ref!,preencher!#ref!)=0,CONCATENATE(preencher!#ref!,#REF!),preencher!#ref!))","v":{"$error":"#NAME?"}},{"$f":"IF(preencher!#ref!=\"\",\"\",IF(COUNTIF(preencher!#ref!,preencher!#ref!)=0,CONCATENATE(preencher!#ref!,#REF!),preencher!#ref!))","v":{"$error":"#NAME?"}},{"$f":"IF(preencher!#ref!=\"\",\"\",IF(COUNTIF(preencher!#ref!,preencher!#ref!)=0,CONCATENATE(preencher!#ref!,#REF!),preencher!#ref!))","v":{"$error":"#NAME?"}},{"$f":"IF(preencher!#ref!=\"\",\"\",IF(COUNTIF(preencher!#ref!,preencher!#ref!)=0,CONCATENATE(preencher!#ref!,#REF!),preencher!#ref!))","v":{"$error":"#NAME?"}},{"$f":"IF(ISERROR(ROUND(AVERAGE(E14:N14),2)),\"\",ROUND(AVERAGE(E14:N14),2))","v":""},{"$f":"IF(ISERROR(ROUND(O14*D14,2)),\"\",ROUND(O14*D14,2))","v":""},null,null,{"$f":"IF(ISERROR(MEDIAN(E14:N14)),\"\",MEDIAN(E14:N14))","v":""},{"$f":"IF(ISERROR(STDEV(E14:N14)),\"\",STDEV(E14:N14))","v":""},{"$f":"IF(ISERROR(T14/O14),\"\",T14/O14)","v":""}]
[{"$f":"IF(preencher!#ref!=\"\",\"\",preencher!#ref!)","v":{"$error":"#NAME?"}},{"$f":"IF(preencher!#ref!=\"\",\"\",preencher!#ref!)","v":{"$error":"#NAME?"}},{"$f":"IF(preencher!#ref!=\"\",\"\",preencher!#ref!)","v":{"$error":"#NAME?"}},{"$f":"IF(preencher!#ref!=\"\",\"\",preencher!#ref!)","v":{"$error":"#NAME?"}},{"$f":"IF(preencher!#ref!=\"\",\"\",IF(COUNTIF(preencher!#ref!,preencher!#ref!)=0,CONCATENATE(preencher!#ref!,#REF!),preencher!#ref!))","v":{"$error":"#NAME?"}},{"$f":"IF(preencher!#ref!=\"\",\"\",IF(COUNTIF(preencher!#ref!,preencher!#ref!)=0,CONCATENATE(preencher!#ref!,#REF!),preencher!#ref!))","v":{"$error":"#NAME?"}},{"$f":"IF(preencher!#ref!=\"\",\"\",IF(COUNTIF(preencher!#ref!,preencher!#ref!)=0,CONCATENATE(preencher!#ref!,#REF!),preencher!#ref!))","v":{"$error":"#NAME?"}},{"$f":"IF(preencher!#ref!=\"\",\"\",IF(COUNTIF(preencher!#ref!,preencher!#ref!)=0,CONCATENATE(preencher!#ref!,#REF!),preencher!#ref!))","v":{"$error":"#NAME?"}},{"$f":"IF(preencher!#ref!=\"\",\"\",IF(COUNTIF(preencher!#ref!,preencher!#ref!)=0,CONCATENATE(preencher!#ref!,#REF!),preencher!#ref!))","v":{"$error":"#NAME?"}},{"$f":"IF(preencher!#ref!=\"\",\"\",IF(COUNTIF(preencher!#ref!,preencher!#ref!)=0,CONCATENATE(preencher!#ref!,#REF!),preencher!#ref!))","v":{"$error":"#NAME?"}},{"$f":"IF(preencher!#ref!=\"\",\"\",IF(COUNTIF(preencher!#ref!,preencher!#ref!)=0,CONCATENATE(preencher!#ref!,#REF!),preencher!#ref!))","v":{"$error":"#NAME?"}},{"$f":"IF(preencher!#ref!=\"\",\"\",IF(COUNTIF(preencher!#ref!,preencher!#ref!)=0,CONCATENATE(preencher!#ref!,#REF!),preencher!#ref!))","v":{"$error":"#NAME?"}},{"$f":"IF(preencher!#ref!=\"\",\"\",IF(COUNTIF(preencher!#ref!,preencher!#ref!)=0,CONCATENATE(preencher!#ref!,#REF!),preencher!#ref!))","v":{"$error":"#NAME?"}},{"$f":"IF(preencher!#ref!=\"\",\"\",IF(COUNTIF(preencher!#ref!,preencher!#ref!)=0,CONCATENATE(preencher!#ref!,#REF!),preencher!#ref!))","v":{"$error":"#NAME?"}},{"$f":"IF(ISERROR(ROUND(AVERAGE(E15:N15),2)),\"\",ROUND(AVERAGE(E15:N15),2))","v":""},{"$f":"IF(ISERROR(ROUND(O15*D15,2)),\"\",ROUND(O15*D15,2))","v":""},null,null,{"$f":"IF(ISERROR(MEDIAN(E15:N15)),\"\",MEDIAN(E15:N15))","v":""},{"$f":"IF(ISERROR(STDEV(E15:N15)),\"\",STDEV(E15:N15))","v":""},{"$f":"IF(ISERROR(T15/O15),\"\",T15/O15)","v":""}]
[{"$f":"IF(preencher!#ref!=\"\",\"\",preencher!#ref!)","v":{"$error":"#NAME?"}},{"$f":"IF(preencher!#ref!=\"\",\"\",preencher!#ref!)","v":{"$error":"#NAME?"}},{"$f":"IF(preencher!#ref!=\"\",\"\",preencher!#ref!)","v":{"$error":"#NAME?"}},{"$f":"IF(preencher!#ref!=\"\",\"\",preencher!#ref!)","v":{"$error":"#NAME?"}},{"$f":"IF(preencher!#ref!=\"\",\"\",IF(COUNTIF(preencher!#ref!,preencher!#ref!)=0,CONCATENATE(preencher!#ref!,#REF!),preencher!#ref!))","v":{"$error":"#NAME?"}},{"$f":"IF(preencher!#ref!=\"\",\"\",IF(COUNTIF(preencher!#ref!,preencher!#ref!)=0,CONCATENATE(preencher!#ref!,#REF!),preencher!#ref!))","v":{"$error":"#NAME?"}},{"$f":"IF(preencher!#ref!=\"\",\"\",IF(COUNTIF(preencher!#ref!,preencher!#ref!)=0,CONCATENATE(preencher!#ref!,#REF!),preencher!#ref!))","v":{"$error":"#NAME?"}},{"$f":"IF(preencher!#ref!=\"\",\"\",IF(COUNTIF(preencher!#ref!,preencher!#ref!)=0,CONCATENATE(preencher!#ref!,#REF!),preencher!#ref!))","v":{"$error":"#NAME?"}},{"$f":"IF(preencher!#ref!=\"\",\"\",IF(COUNTIF(preencher!#ref!,preencher!#ref!)=0,CONCATENATE(preencher!#ref!,#REF!),preencher!#ref!))","v":{"$error":"#NAME?"}},{"$f":"IF(preencher!#ref!=\"\",\"\",IF(COUNTIF(preencher!#ref!,preencher!#ref!)=0,CONCATENATE(preencher!#ref!,#REF!),preencher!#ref!))","v":{"$error":"#NAME?"}},{"$f":"IF(preencher!#ref!=\"\",\"\",IF(COUNTIF(preencher!#ref!,preencher!#ref!)=0,CONCATENATE(preencher!#ref!,#REF!),preencher!#ref!))","v":{"$error":"#NAME?"}},{"$f":"IF(preencher!#ref!=\"\",\"\",IF(COUNTIF(preencher!#ref!,preencher!#ref!)=0,CONCATENATE(preencher!#ref!,#REF!),preencher!#ref!))","v":{"$error":"#NAME?"}},{"$f":"IF(preencher!#ref!=\"\",\"\",IF(COUNTIF(preencher!#ref!,preencher!#ref!)=0,CONCATENATE(preencher!#ref!,#REF!),preencher!#ref!))","v":{"$error":"#NAME?"}},{"$f":"IF(preencher!#ref!=\"\",\"\",IF(COUNTIF(preencher!#ref!,preencher!#ref!)=0,CONCATENATE(preencher!#ref!,#REF!),preencher!#ref!))","v":{"$error":"#NAME?"}},{"$f":"IF(ISERROR(ROUND(AVERAGE(E16:N16),2)),\"\",ROUND(AVERAGE(E16:N16),2))","v":""},{"$f":"IF(ISERROR(ROUND(O16*D16,2)),\"\",ROUND(O16*D16,2))","v":""},null,null,{"$f":"IF(ISERROR(MEDIAN(E16:N16)),\"\",MEDIAN(E16:N16))","v":""},{"$f":"IF(ISERROR(STDEV(E16:N16)),\"\",STDEV(E16:N16))","v":""},{"$f":"IF(ISERROR(T16/O16),\"\",T16/O16)","v":""}]
[{"$f":"IF(preencher!#ref!=\"\",\"\",preencher!#ref!)","v":{"$error":"#NAME?"}},{"$f":"IF(preencher!#ref!=\"\",\"\",preencher!#ref!)","v":{"$error":"#NAME?"}},{"$f":"IF(preencher!#ref!=\"\",\"\",preencher!#ref!)","v":{"$error":"#NAME?"}},{"$f":"IF(preencher!#ref!=\"\",\"\",preencher!#ref!)","v":{"$error":"#NAME?"}},{"$f":"IF(preencher!#ref!=\"\",\"\",IF(COUNTIF(preencher!#ref!,preencher!#ref!)=0,CONCATENATE(preencher!#ref!,#REF!),preencher!#ref!))","v":{"$error":"#NAME?"}},{"$f":"IF(preencher!#ref!=\"\",\"\",IF(COUNTIF(preencher!#ref!,preencher!#ref!)=0,CONCATENATE(preencher!#ref!,#REF!),preencher!#ref!))","v":{"$error":"#NAME?"}},{"$f":"IF(preencher!#ref!=\"\",\"\",IF(COUNTIF(preencher!#ref!,preencher!#ref!)=0,CONCATENATE(preencher!#ref!,#REF!),preencher!#ref!))","v":{"$error":"#NAME?"}},{"$f":"IF(preencher!#ref!=\"\",\"\",IF(COUNTIF(preencher!#ref!,preencher!#ref!)=0,CONCATENATE(preencher!#ref!,#REF!),preencher!#ref!))","v":{"$error":"#NAME?"}},{"$f":"IF(preencher!#ref!=\"\",\"\",IF(COUNTIF(preencher!#ref!,preencher!#ref!)=0,CONCATENATE(preencher!#ref!,#REF!),preencher!#ref!))","v":{"$error":"#NAME?"}},{"$f":"IF(preencher!#ref!=\"\",\"\",IF(COUNTIF(preencher!#ref!,preencher!#ref!)=0,CONCATENATE(preencher!#ref!,#REF!),preencher!#ref!))","v":{"$error":"#NAME?"}},{"$f":"IF(preencher!#ref!=\"\",\"\",IF(COUNTIF(preencher!#ref!,preencher!#ref!)=0,CONCATENATE(preencher!#ref!,#REF!),preencher!#ref!))","v":{"$error":"#NAME?"}},{"$f":"IF(preencher!#ref!=\"\",\"\",IF(COUNTIF(preencher!#ref!,preencher!#ref!)=0,CONCATENATE(preencher!#ref!,#REF!),preencher!#ref!))","v":{"$error":"#NAME?"}},{"$f":"IF(preencher!#ref!=\"\",\"\",IF(COUNTIF(preencher!#ref!,preencher!#ref!)=0,CONCATENATE(preencher!#ref!,#REF!),preencher!#ref!))","v":{"$error":"#NAME?"}},{"$f":"IF(preencher!#ref!=\"\",\"\",IF(COUNTIF(preencher!#ref!,preencher!#ref!)=0,CONCATENATE(preencher!#ref!,#REF!),preencher!#ref!))","v":{"$error":"#NAME?"}},{"$f":"IF(ISERROR(ROUND(AVERAGE(E17:N17),2)),\"\",ROUND(AVERAGE(E17:N17),2))","v":""},{"$f":"IF(ISERROR(ROUND(O17*D17,2)),\"\",ROUND(O17*D17,2))","v":""},null,null,{"$f":"IF(ISERROR(MEDIAN(E17:N17)),\"\",MEDIAN(E17:N17))","v":""},{"$f":"IF(ISERROR(STDEV(E17:N17)),\"\",STDEV(E17:N17))","v":""},{"$f":"IF(ISERROR(T17/O17),\"\",T17/O17)","v":""}]
[{"$f":"IF(preencher!#ref!=\"\",\"\",preencher!#ref!)","v":{"$error":"#NAME?"}},{"$f":"IF(preencher!#ref!=\"\",\"\",preencher!#ref!)","v":{"$error":"#NAME?"}},{"$f":"IF(preencher!#ref!=\"\",\"\",preencher!#ref!)","v":{"$error":"#NAME?"}},{"$f":"IF(preencher!#ref!=\"\",\"\",preencher!#ref!)","v":{"$error":"#NAME?"}},{"$f":"IF(preencher!#ref!=\"\",\"\",IF(COUNTIF(preencher!#ref!,preencher!#ref!)=0,CONCATENATE(preencher!#ref!,#REF!),preencher!#ref!))","v":{"$error":"#NAME?"}},{"$f":"IF(preencher!#ref!=\"\",\"\",IF(COUNTIF(preencher!#ref!,preencher!#ref!)=0,CONCATENATE(preencher!#ref!,#REF!),preencher!#ref!))","v":{"$error":"#NAME?"}},{"$f":"IF(preencher!#ref!=\"\",\"\",IF(COUNTIF(preencher!#ref!,preencher!#ref!)=0,CONCATENATE(preencher!#ref!,#REF!),preencher!#ref!))","v":{"$error":"#NAME?"}},{"$f":"IF(preencher!#ref!=\"\",\"\",IF(COUNTIF(preencher!#ref!,preencher!#ref!)=0,CONCATENATE(preencher!#ref!,#REF!),preencher!#ref!))","v":{"$error":"#NAME?"}},{"$f":"IF(preencher!#ref!=\"\",\"\",IF(COUNTIF(preencher!#ref!,preencher!#ref!)=0,CONCATENATE(preencher!#ref!,#REF!),preencher!#ref!))","v":{"$error":"#NAME?"}},{"$f":"IF(preencher!#ref!=\"\",\"\",IF(COUNTIF(preencher!#ref!,preencher!#ref!)=0,CONCATENATE(preencher!#ref!,#REF!),preencher!#ref!))","v":{"$error":"#NAME?"}},{"$f":"IF(preencher!#ref!=\"\",\"\",IF(COUNTIF(preencher!#ref!,preencher!#ref!)=0,CONCATENATE(preencher!#ref!,#REF!),preencher!#ref!))","v":{"$error":"#NAME?"}},{"$f":"IF(preencher!#ref!=\"\",\"\",IF(COUNTIF(preencher!#ref!,preencher!#ref!)=0,CONCATENATE(preencher!#ref!,#REF!),preencher!#ref!))","v":{"$error":"#NAME?"}},{"$f":"IF(preencher!#ref!=\"\",\"\",IF(COUNTIF(preencher!#ref!,preencher!#ref!)=0,CONCATENATE(preencher!#ref!,#REF!),preencher!#ref!))","v":{"$error":"#NAME?"}},{"$f":"IF(preencher!#ref!=\"\",\"\",IF(COUNTIF(preencher!#ref!,preencher!#ref!)=0,CONCATENATE(preencher!#ref!,#REF!),preencher!#ref!))","v":{"$error":"#NAME?"}},{"$f":"IF(ISERROR(ROUND(AVERAGE(E18:N18),2)),\"\",ROUND(AVERAGE(E18:N18),2))","v":""},{"$f":"IF(ISERROR(ROUND(O18*D18,2)),\"\",ROUND(O18*D18,2))","v":""},null,null,{"$f":"IF(ISERROR(MEDIAN(E18:N18)),\"\",MEDIAN(E18:N18))","v":""},{"$f":"IF(ISERROR(STDEV(E18:N18)),\"\",STDEV(E18:N18))","v":""},{"$f":"IF(ISERROR(T18/O18),\"\",T18/O18)","v":""}]
[{"$f":"IF(preencher!#ref!=\"\",\"\",preencher!#ref!)","v":{"$error":"#NAME?"}},{"$f":"IF(preencher!#ref!=\"\",\"\",preencher!#ref!)","v":{"$error":"#NAME?"}},{"$f":"IF(preencher!#ref!=\"\",\"\",preencher!#ref!)","v":{"$error":"#NAME?"}},{"$f":"IF(preencher!#ref!=\"\",\"\",preencher!#ref!)","v":{"$error":"#NAME?"}},{"$f":"IF(preencher!#ref!=\"\",\"\",IF(COUNTIF(preencher!#ref!,preencher!#ref!)=0,CONCATENATE(preencher!#ref!,#REF!),preencher!#ref!))","v":{"$error":"#NAME?"}},{"$f":"IF(preencher!#ref!=\"\",\"\",IF(COUNTIF(preencher!#ref!,preencher!#ref!)=0,CONCATENATE(preencher!#ref!,#REF!),preencher!#ref!))","v":{"$error":"#NAME?"}},{"$f":"IF(preencher!#ref!=\"\",\"\",IF(COUNTIF(preencher!#ref!,preencher!#ref!)=0,CONCATENATE(preencher!#ref!,#REF!),preencher!#ref!))","v":{"$error":"#NAME?"}},{"$f":"IF(preencher!#ref!=\"\",\"\",IF(COUNTIF(preencher!#ref!,preencher!#ref!)=0,CONCATENATE(preencher!#ref!,#REF!),preencher!#ref!))","v":{"$error":"#NAME?"}},{"$f":"IF(preencher!#ref!=\"\",\"\",IF(COUNTIF(preencher!#ref!,preencher!#ref!)=0,CONCATENATE(preencher!#ref!,#REF!),preencher!#ref!))","v":{"$error":"#NAME?"}},{"$f":"IF(preencher!#ref!=\"\",\"\",IF(COUNTIF(preencher!#ref!,preencher!#ref!)=0,CONCATENATE(preencher!#ref!,#REF!),preencher!#ref!))","v":{"$error":"#NAME?"}},{"$f":"IF(preencher!#ref!=\"\",\"\",IF(COUNTIF(preencher!#ref!,preencher!#ref!)=0,CONCATENATE(preencher!#ref!,#REF!),preencher!#ref!))","v":{"$error":"#NAME?"}},{"$f":"IF(preencher!#ref!=\"\",\"\",IF(COUNTIF(preencher!#ref!,preencher!#ref!)=0,CONCATENATE(preencher!#ref!,#REF!),preencher!#ref!))","v":{"$error":"#NAME?"}},{"$f":"IF(preencher!#ref!=\"\",\"\",IF(COUNTIF(preencher!#ref!,preencher!#ref!)=0,CONCATENATE(preencher!#ref!,#REF!),preencher!#ref!))","v":{"$error":"#NAME?"}},{"$f":"IF(preencher!#ref!=\"\",\"\",IF(COUNTIF(preencher!#ref!,preencher!#ref!)=0,CONCATENATE(preencher!#ref!,#REF!),preencher!#ref!))","v":{"$error":"#NAME?"}},{"$f":"IF(ISERROR(ROUND(AVERAGE(E19:N19),2)),\"\",ROUND(AVERAGE(E19:N19),2))","v":""},{"$f":"IF(ISERROR(ROUND(O19*D19,2)),\"\",ROUND(O19*D19,2))","v":""},null,null,{"$f":"IF(ISERROR(MEDIAN(E19:N19)),\"\",MEDIAN(E19:N19))","v":""},{"$f":"IF(ISERROR(STDEV(E19:N19)),\"\",STDEV(E19:N19))","v":""},{"$f":"IF(ISERROR(T19/O19),\"\",T19/O19)","v":""}]
[{"$f":"IF(preencher!#ref!=\"\",\"\",preencher!#ref!)","v":{"$error":"#NAME?"}},{"$f":"IF(preencher!#ref!=\"\",\"\",preencher!#ref!)","v":{"$error":"#NAME?"}},{"$f":"IF(preencher!#ref!=\"\",\"\",preencher!#ref!)","v":{"$error":"#NAME?"}},{"$f":"IF(preencher!#ref!=\"\",\"\",preencher!#ref!)","v":{"$error":"#NAME?"}},{"$f":"IF(preencher!#ref!=\"\",\"\",IF(COUNTIF(preencher!#ref!,preencher!#ref!)=0,CONCATENATE(preencher!#ref!,#REF!),preencher!#ref!))","v":{"$error":"#NAME?"}},{"$f":"IF(preencher!#ref!=\"\",\"\",IF(COUNTIF(preencher!#ref!,preencher!#ref!)=0,CONCATENATE(preencher!#ref!,#REF!),preencher!#ref!))","v":{"$error":"#NAME?"}},{"$f":"IF(preencher!#ref!=\"\",\"\",IF(COUNTIF(preencher!#ref!,preencher!#ref!)=0,CONCATENATE(preencher!#ref!,#REF!),preencher!#ref!))","v":{"$error":"#NAME?"}},{"$f":"IF(preencher!#ref!=\"\",\"\",IF(COUNTIF(preencher!#ref!,preencher!#ref!)=0,CONCATENATE(preencher!#ref!,#REF!),preencher!#ref!))","v":{"$error":"#NAME?"}},{"$f":"IF(preencher!#ref!=\"\",\"\",IF(COUNTIF(preencher!#ref!,preencher!#ref!)=0,CONCATENATE(preencher!#ref!,#REF!),preencher!#ref!))","v":{"$error":"#NAME?"}},{"$f":"IF(preencher!#ref!=\"\",\"\",IF(COUNTIF(preencher!#ref!,preencher!#ref!)=0,CONCATENATE(preencher!#ref!,#REF!),preencher!#ref!))","v":{"$error":"#NAME?"}},{"$f":"IF(preencher!#ref!=\"\",\"\",IF(COUNTIF(preencher!#ref!,preencher!#ref!)=0,CONCATENATE(preencher!#ref!,#REF!),preencher!#ref!))","v":{"$error":"#NAME?"}},{"$f":"IF(preencher!#ref!=\"\",\"\",IF(COUNTIF(preencher!#ref!,preencher!#ref!)=0,CONCATENATE(preencher!#ref!,#REF!),preencher!#ref!))","v":{"$error":"#NAME?"}},{"$f":"IF(preencher!#ref!=\"\",\"\",IF(COUNTIF(preencher!#ref!,preencher!#ref!)=0,CONCATENATE(preencher!#ref!,#REF!),preencher!#ref!))","v":{"$error":"#NAME?"}},{"$f":"IF(preencher!#ref!=\"\",\"\",IF(COUNTIF(preencher!#ref!,preencher!#ref!)=0,CONCATENATE(preencher!#ref!,#REF!),preencher!#ref!))","v":{"$error":"#NAME?"}},{"$f":"IF(ISERROR(ROUND(AVERAGE(E20:N20),2)),\"\",ROUND(AVERAGE(E20:N20),2))","v":""},{"$f":"IF(ISERROR(ROUND(O20*D20,2)),\"\",ROUND(O20*D20,2))","v":""},null,null,{"$f":"IF(ISERROR(MEDIAN(E20:N20)),\"\",MEDIAN(E20:N20))","v":""},{"$f":"IF(ISERROR(STDEV(E20:N20)),\"\",STDEV(E20:N20))","v":""},{"$f":"IF(ISERROR(T20/O20),\"\",T20/O20)","v":""}]
[{"$f":"IF(preencher!#ref!=\"\",\"\",preencher!#ref!)","v":{"$error":"#NAME?"}},{"$f":"IF(preencher!#ref!=\"\",\"\",preencher!#ref!)","v":{"$error":"#NAME?"}},{"$f":"IF(preencher!#ref!=\"\",\"\",preencher!#ref!)","v":{"$error":"#NAME?"}},{"$f":"IF(preencher!#ref!=\"\",\"\",preencher!#ref!)","v":{"$error":"#NAME?"}},{"$f":"IF(preencher!#ref!=\"\",\"\",IF(COUNTIF(preencher!#ref!,preencher!#ref!)=0,CONCATENATE(preencher!#ref!,#REF!),preencher!#ref!))","v":{"$error":"#NAME?"}},{"$f":"IF(preencher!#ref!=\"\",\"\",IF(COUNTIF(preencher!#ref!,preencher!#ref!)=0,CONCATENATE(preencher!#ref!,#REF!),preencher!#ref!))","v":{"$error":"#NAME?"}},{"$f":"IF(preencher!#ref!=\"\",\"\",IF(COUNTIF(preencher!#ref!,preencher!#ref!)=0,CONCATENATE(preencher!#ref!,#REF!),preencher!#ref!))","v":{"$error":"#NAME?"}},{"$f":"IF(preencher!#ref!=\"\",\"\",IF(COUNTIF(preencher!#ref!,preencher!#ref!)=0,CONCATENATE(preencher!#ref!,#REF!),preencher!#ref!))","v":{"$error":"#NAME?"}},{"$f":"IF(preencher!#ref!=\"\",\"\",IF(COUNTIF(preencher!#ref!,preencher!#ref!)=0,CONCATENATE(preencher!#ref!,#REF!),preencher!#ref!))","v":{"$error":"#NAME?"}},{"$f":"IF(preencher!#ref!=\"\",\"\",IF(COUNTIF(preencher!#ref!,preencher!#ref!)=0,CONCATENATE(preencher!#ref!,#REF!),preencher!#ref!))","v":{"$error":"#NAME?"}},{"$f":"IF(preencher!#ref!=\"\",\"\",IF(COUNTIF(preencher!#ref!,preencher!#ref!)=0,CONCATENATE(preencher!#ref!,#REF!),preencher!#ref!))","v":{"$error":"#NAME?"}},{"$f":"IF(preencher!#ref!=\"\",\"\",IF(COUNTIF(preencher!#ref!,preencher!#ref!)=0,CONCATENATE(preencher!#ref!,#REF!),preencher!#ref!))","v":{"$error":"#NAME?"}},{"$f":"IF(preencher!#ref!=\"\",\"\",IF(COUNTIF(preencher!#ref!,preencher!#ref!)=0,CONCATENATE(preencher!#ref!,#REF!),preencher!#ref!))","v":{"$error":"#NAME?"}},{"$f":"IF(preencher!#ref!=\"\",\"\",IF(COUNTIF(preencher!#ref!,preencher!#ref!)=0,CONCATENATE(preencher!#ref!,#REF!),preencher!#ref!))","v":{"$error":"#NAME?"}},{"$f":"IF(ISERROR(ROUND(AVERAGE(E21:N21),2)),\"\",ROUND(AVERAGE(E21:N21),2))","v":""},{"$f":"IF(ISERROR(ROUND(O21*D21,2)),\"\",ROUND(O21*D21,2))","v":""},null,null,{"$f":"IF(ISERROR(MEDIAN(E21:N21)),\"\",MEDIAN(E21:N21))","v":""},{"$f":"IF(ISERROR(STDEV(E21:N21)),\"\",STDEV(E21:N21))","v":""},{"$f":"IF(ISERROR(T21/O21),\"\",T21/O21)","v":""}]
[{"$f":"IF(preencher!#ref!=\"\",\"\",preencher!#ref!)","v":{"$error":"#NAME?"}},{"$f":"IF(preencher!#ref!=\"\",\"\",preencher!#ref!)","v":{"$error":"#NAME?"}},{"$f":"IF(preencher!#ref!=\"\",\"\",preencher!#ref!)","v":{"$error":"#NAME?"}},{"$f":"IF(preencher!#ref!=\"\",\"\",preencher!#ref!)","v":{"$error":"#NAME?"}},{"$f":"IF(preencher!#ref!=\"\",\"\",IF(COUNTIF(preencher!#ref!,preencher!#ref!)=0,CONCATENATE(preencher!#ref!,#REF!),preencher!#ref!))","v":{"$error":"#NAME?"}},{"$f":"IF(preencher!#ref!=\"\",\"\",IF(COUNTIF(preencher!#ref!,preencher!#ref!)=0,CONCATENATE(preencher!#ref!,#REF!),preencher!#ref!))","v":{"$error":"#NAME?"}},{"$f":"IF(preencher!#ref!=\"\",\"\",IF(COUNTIF(preencher!#ref!,preencher!#ref!)=0,CONCATENATE(preencher!#ref!,#REF!),preencher!#ref!))","v":{"$error":"#NAME?"}},{"$f":"IF(preencher!#ref!=\"\",\"\",IF(COUNTIF(preencher!#ref!,preencher!#ref!)=0,CONCATENATE(preencher!#ref!,#REF!),preencher!#ref!))","v":{"$error":"#NAME?"}},{"$f":"IF(preencher!#ref!=\"\",\"\",IF(COUNTIF(preencher!#ref!,preencher!#ref!)=0,CONCATENATE(preencher!#ref!,#REF!),preencher!#ref!))","v":{"$error":"#NAME?"}},{"$f":"IF(preencher!#ref!=\"\",\"\",IF(COUNTIF(preencher!#ref!,preencher!#ref!)=0,CONCATENATE(preencher!#ref!,#REF!),preencher!#ref!))","v":{"$error":"#NAME?"}},{"$f":"IF(preencher!#ref!=\"\",\"\",IF(COUNTIF(preencher!#ref!,preencher!#ref!)=0,CONCATENATE(preencher!#ref!,#REF!),preencher!#ref!))","v":{"$error":"#NAME?"}},{"$f":"IF(preencher!#ref!=\"\",\"\",IF(COUNTIF(preencher!#ref!,preencher!#ref!)=0,CONCATENATE(preencher!#ref!,#REF!),preencher!#ref!))","v":{"$error":"#NAME?"}},{"$f":"IF(preencher!#ref!=\"\",\"\",IF(COUNTIF(preencher!#ref!,preencher!#ref!)=0,CONCATENATE(preencher!#ref!,#REF!),preencher!#ref!))","v":{"$error":"#NAME?"}},{"$f":"IF(preencher!#ref!=\"\",\"\",IF(COUNTIF(preencher!#ref!,preencher!#ref!)=0,CONCATENATE(preencher!#ref!,#REF!),preencher!#ref!))","v":{"$error":"#NAME?"}},{"$f":"IF(ISERROR(ROUND(AVERAGE(E22:N22),2)),\"\",ROUND(AVERAGE(E22:N22),2))","v":""},{"$f":"IF(ISERROR(ROUND(O22*D22,2)),\"\",ROUND(O22*D22,2))","v":""},null,null,{"$f":"IF(ISERROR(MEDIAN(E22:N22)),\"\",MEDIAN(E22:N22))","v":""},{"$f":"IF(ISERROR(STDEV(E22:N22)),\"\",STDEV(E22:N22))","v":""},{"$f":"IF(ISERROR(T22/O22),\"\",T22/O22)","v":""}]
[{"$f":"IF(preencher!#ref!=\"\",\"\",preencher!#ref!)","v":{"$error":"#NAME?"}},{"$f":"IF(preencher!#ref!=\"\",\"\",preencher!#ref!)","v":{"$error":"#NAME?"}},{"$f":"IF(preencher!#ref!=\"\",\"\",preencher!#ref!)","v":{"$error":"#NAME?"}},{"$f":"IF(preencher!#ref!=\"\",\"\",preencher!#ref!)","v":{"$error":"#NAME?"}},{"$f":"IF(preencher!#ref!=\"\",\"\",IF(COUNTIF(preencher!#ref!,preencher!#ref!)=0,CONCATENATE(preencher!#ref!,#REF!),preencher!#ref!))","v":{"$error":"#NAME?"}},{"$f":"IF(preencher!#ref!=\"\",\"\",IF(COUNTIF(preencher!#ref!,preencher!#ref!)=0,CONCATENATE(preencher!#ref!,#REF!),preencher!#ref!))","v":{"$error":"#NAME?"}},{"$f":"IF(preencher!#ref!=\"\",\"\",IF(COUNTIF(preencher!#ref!,preencher!#ref!)=0,CONCATENATE(preencher!#ref!,#REF!),preencher!#ref!))","v":{"$error":"#NAME?"}},{"$f":"IF(preencher!#ref!=\"\",\"\",IF(COUNTIF(preencher!#ref!,preencher!#ref!)=0,CONCATENATE(preencher!#ref!,#REF!),preencher!#ref!))","v":{"$error":"#NAME?"}},{"$f":"IF(preencher!#ref!=\"\",\"\",IF(COUNTIF(preencher!#ref!,preencher!#ref!)=0,CONCATENATE(preencher!#ref!,#REF!),preencher!#ref!))","v":{"$error":"#NAME?"}},{"$f":"IF(preencher!#ref!=\"\",\"\",IF(COUNTIF(preencher!#ref!,preencher!#ref!)=0,CONCATENATE(preencher!#ref!,#REF!),preencher!#ref!))","v":{"$error":"#NAME?"}},{"$f":"IF(preencher!#ref!=\"\",\"\",IF(COUNTIF(preencher!#ref!,preencher!#ref!)=0,CONCATENATE(preencher!#ref!,#REF!),preencher!#ref!))","v":{"$error":"#NAME?"}},{"$f":"IF(preencher!#ref!=\"\",\"\",IF(COUNTIF(preencher!#ref!,preencher!#ref!)=0,CONCATENATE(preencher!#ref!,#REF!),preencher!#ref!))","v":{"$error":"#NAME?"}},{"$f":"IF(preencher!#ref!=\"\",\"\",IF(COUNTIF(preencher!#ref!,preencher!#ref!)=0,CONCATENATE(preencher!#ref!,#REF!),preencher!#ref!))","v":{"$error":"#NAME?"}},{"$f":"IF(preencher!#ref!=\"\",\"\",IF(COUNTIF(preencher!#ref!,preencher!#ref!)=0,CONCATENATE(preencher!#ref!,#REF!),preencher!#ref!))","v":{"$error":"#NAME?"}},{"$f":"IF(ISERROR(ROUND(AVERAGE(E23:N23),2)),\"\",ROUND(AVERAGE(E23:N23),2))","v":""},{"$f":"IF(ISERROR(ROUND(O23*D23,2)),\"\",ROUND(O23*D23,2))","v":""},null,null,{"$f":"IF(ISERROR(MEDIAN(E23:N23)),\"\",MEDIAN(E23:N23))","v":""},{"$f":"IF(ISERROR(STDEV(E23:N23)),\"\",STDEV(E23:N23))","v":""},{"$f":"IF(ISERROR(T23/O23),\"\",T23/O23)","v":""}]
[{"$f":"IF(preencher!#ref!=\"\",\"\",preencher!#ref!)","v":{"$error":"#NAME?"}},{"$f":"IF(preencher!#ref!=\"\",\"\",preencher!#ref!)","v":{"$error":"#NAME?"}},{"$f":"IF(preencher!#ref!=\"\",\"\",preencher!#ref!)","v":{"$error":"#NAME?"}},{"$f":"IF(preencher!#ref!=\"\",\"\",preencher!#ref!)","v":{"$error":"#NAME?"}},{"$f":"IF(preencher!#ref!=\"\",\"\",IF(COUNTIF(preencher!#ref!,preencher!#ref!)=0,CONCATENATE(preencher!#ref!,#REF!),preencher!#ref!))","v":{"$error":"#NAME?"}},{"$f":"IF(preencher!#ref!=\"\",\"\",IF(COUNTIF(preencher!#ref!,preencher!#ref!)=0,CONCATENATE(preencher!#ref!,#REF!),preencher!#ref!))","v":{"$error":"#NAME?"}},{"$f":"IF(preencher!#ref!=\"\",\"\",IF(COUNTIF(preencher!#ref!,preencher!#ref!)=0,CONCATENATE(preencher!#ref!,#REF!),preencher!#ref!))","v":{"$error":"#NAME?"}},{"$f":"IF(preencher!#ref!=\"\",\"\",IF(COUNTIF(preencher!#ref!,preencher!#ref!)=0,CONCATENATE(preencher!#ref!,#REF!),preencher!#ref!))","v":{"$error":"#NAME?"}},{"$f":"IF(preencher!#ref!=\"\",\"\",IF(COUNTIF(preencher!#ref!,preencher!#ref!)=0,CONCATENATE(preencher!#ref!,#REF!),preencher!#ref!))","v":{"$error":"#NAME?"}},{"$f":"IF(preencher!#ref!=\"\",\"\",IF(COUNTIF(preencher!#ref!,preencher!#ref!)=0,CONCATENATE(preencher!#ref!,#REF!),preencher!#ref!))","v":{"$error":"#NAME?"}},{"$f":"IF(preencher!#ref!=\"\",\"\",IF(COUNTIF(preencher!#ref!,preencher!#ref!)=0,CONCATENATE(preencher!#ref!,#REF!),preencher!#ref!))","v":{"$error":"#NAME?"}},{"$f":"IF(preencher!#ref!=\"\",\"\",IF(COUNTIF(preencher!#ref!,preencher!#ref!)=0,CONCATENATE(preencher!#ref!,#REF!),preencher!#ref!))","v":{"$error":"#NAME?"}},{"$f":"IF(preencher!#ref!=\"\",\"\",IF(COUNTIF(preencher!#ref!,preencher!#ref!)=0,CONCATENATE(preencher!#ref!,#REF!),preencher!#ref!))","v":{"$error":"#NAME?"}},{"$f":"IF(preencher!#ref!=\"\",\"\",IF(COUNTIF(preencher!#ref!,preencher!#ref!)=0,CONCATENATE(preencher!#ref!,#REF!),preencher!#ref!))","v":{"$error":"#NAME?"}},{"$f":"IF(ISERROR(ROUND(AVERAGE(E24:N24),2)),\"\",ROUND(AVERAGE(E24:N24),2))","v":""},{"$f":"IF(ISERROR(ROUND(O24*D24,2)),\"\",ROUND(O24*D24,2))","v":""},null,null,{"$f":"IF(ISERROR(MEDIAN(E24:N24)),\"\",MEDIAN(E24:N24))","v":""},{"$f":"IF(ISERROR(STDEV(E24:N24)),\"\",STDEV(E24:N24))","v":""},{"$f":"IF(ISERROR(T24/O24),\"\",T24/O24)","v":""}]
[{"$f":"IF(preencher!#ref!=\"\",\"\",preencher!#ref!)","v":{"$error":"#NAME?"}},{"$f":"IF(preencher!#ref!=\"\",\"\",preencher!#ref!)","v":{"$error":"#NAME?"}},{"$f":"IF(preencher!#ref!=\"\",\"\",preencher!#ref!)","v":{"$error":"#NAME?"}},{"$f":"IF(preencher!#ref!=\"\",\"\",preencher!#ref!)","v":{"$error":"#NAME?"}},{"$f":"IF(preencher!#ref!=\"\",\"\",IF(COUNTIF(preencher!#ref!,preencher!#ref!)=0,CONCATENATE(preencher!#ref!,#REF!),preencher!#ref!))","v":{"$error":"#NAME?"}},{"$f":"IF(preencher!#ref!=\"\",\"\",IF(COUNTIF(preencher!#ref!,preencher!#ref!)=0,CONCATENATE(preencher!#ref!,#REF!),preencher!#ref!))","v":{"$error":"#NAME?"}},{"$f":"IF(preencher!#ref!=\"\",\"\",IF(COUNTIF(preencher!#ref!,preencher!#ref!)=0,CONCATENATE(preencher!#ref!,#REF!),preencher!#ref!))","v":{"$error":"#NAME?"}},{"$f":"IF(preencher!#ref!=\"\",\"\",IF(COUNTIF(preencher!#ref!,preencher!#ref!)=0,CONCATENATE(preencher!#ref!,#REF!),preencher!#ref!))","v":{"$error":"#NAME?"}},{"$f":"IF(preencher!#ref!=\"\",\"\",IF(COUNTIF(preencher!#ref!,preencher!#ref!)=0,CONCATENATE(preencher!#ref!,#REF!),preencher!#ref!))","v":{"$error":"#NAME?"}},{"$f":"IF(preencher!#ref!=\"\",\"\",IF(COUNTIF(preencher!#ref!,preencher!#ref!)=0,CONCATENATE(preencher!#ref!,#REF!),preencher!#ref!))","v":{"$error":"#NAME?"}},{"$f":"IF(preencher!#ref!=\"\",\"\",IF(COUNTIF(preencher!#ref!,preencher!#ref!)=0,CONCATENATE(preencher!#ref!,#REF!),preencher!#ref!))","v":{"$error":"#NAME?"}},{"$f":"IF(preencher!#ref!=\"\",\"\",IF(COUNTIF(preencher!#ref!,preencher!#ref!)=0,CONCATENATE(preencher!#ref!,#REF!),preencher!#ref!))","v":{"$error":"#NAME?"}},{"$f":"IF(preencher!#ref!=\"\",\"\",IF(COUNTIF(preencher!#ref!,preencher!#ref!)=0,CONCATENATE(preencher!#ref!,#REF!),preencher!#ref!))","v":{"$error":"#NAME?"}},{"$f":"IF(preencher!#ref!=\"\",\"\",IF(COUNTIF(preencher!#ref!,preencher!#ref!)=0,CONCATENATE(preencher!#ref!,#REF!),preencher!#ref!))","v":{"$error":"#NAME?"}},{"$f":"IF(ISERROR(ROUND(AVERAGE(E25:N25),2)),\"\",ROUND(AVERAGE(E25:N25),2))","v":""},{"$f":"IF(ISERROR(ROUND(O25*D25,2)),\"\",ROUND(O25*D25,2))","v":""},null,null,{"$f":"IF(ISERROR(MEDIAN(E25:N25)),\"\",MEDIAN(E25:N25))","v":""},{"$f":"IF(ISERROR(STDEV(E25:N25)),\"\",STDEV(E25:N25))","v":""},{"$f":"IF(ISERROR(T25/O25),\"\",T25/O25)","v":""}]
[{"$f":"IF(preencher!#ref!=\"\",\"\",preencher!#ref!)","v":{"$error":"#NAME?"}},{"$f":"IF(preencher!#ref!=\"\",\"\",preencher!#ref!)","v":{"$error":"#NAME?"}},{"$f":"IF(preencher!#ref!=\"\",\"\",preencher!#ref!)","v":{"$error":"#NAME?"}},{"$f":"IF(preencher!#ref!=\"\",\"\",preencher!#ref!)","v":{"$error":"#NAME?"}},{"$f":"IF(preencher!#ref!=\"\",\"\",IF(COUNTIF(preencher!#ref!,preencher!#ref!)=0,CONCATENATE(preencher!#ref!,#REF!),preencher!#ref!))","v":{"$error":"#NAME?"}},{"$f":"IF(preencher!#ref!=\"\",\"\",IF(COUNTIF(preencher!#ref!,preencher!#ref!)=0,CONCATENATE(preencher!#ref!,#REF!),preencher!#ref!))","v":{"$error":"#NAME?"}},{"$f":"IF(preencher!#ref!=\"\",\"\",IF(COUNTIF(preencher!#ref!,preencher!#ref!)=0,CONCATENATE(preencher!#ref!,#REF!),preencher!#ref!))","v":{"$error":"#NAME?"}},{"$f":"IF(preencher!#ref!=\"\",\"\",IF(COUNTIF(preencher!#ref!,preencher!#ref!)=0,CONCATENATE(preencher!#ref!,#REF!),preencher!#ref!))","v":{"$error":"#NAME?"}},{"$f":"IF(preencher!#ref!=\"\",\"\",IF(COUNTIF(preencher!#ref!,preencher!#ref!)=0,CONCATENATE(preencher!#ref!,#REF!),preencher!#ref!))","v":{"$error":"#NAME?"}},{"$f":"IF(preencher!#ref!=\"\",\"\",IF(COUNTIF(preencher!#ref!,preencher!#ref!)=0,CONCATENATE(preencher!#ref!,#REF!),preencher!#ref!))","v":{"$error":"#NAME?"}},{"$f":"IF(preencher!#ref!=\"\",\"\",IF(COUNTIF(preencher!#ref!,preencher!#ref!)=0,CONCATENATE(preencher!#ref!,#REF!),preencher!#ref!))","v":{"$error":"#NAME?"}},{"$f":"IF(preencher!#ref!=\"\",\"\",IF(COUNTIF(preencher!#ref!,preencher!#ref!)=0,CONCATENATE(preencher!#ref!,#REF!),preencher!#ref!))","v":{"$error":"#NAME?"}},{"$f":"IF(preencher!#ref!=\"\",\"\",IF(COUNTIF(preencher!#ref!,preencher!#ref!)=0,CONCATENATE(preencher!#ref!,#REF!),preencher!#ref!))","v":{"$error":"#NAME?"}},{"$f":"IF(preencher!#ref!=\"\",\"\",IF(COUNTIF(preencher!#ref!,preencher!#ref!)=0,CONCATENATE(preencher!#ref!,#REF!),preencher!#ref!))","v":{"$error":"#NAME?"}},{"$f":"IF(ISERROR(ROUND(AVERAGE(E26:N26),2)),\"\",ROUND(AVERAGE(E26:N26),2))","v":""},{"$f":"IF(ISERROR(ROUND(O26*D26,2)),\"\",ROUND(O26*D26,2))","v":""},null,null,{"$f":"IF(ISERROR(MEDIAN(E26:N26)),\"\",MEDIAN(E26:N26))","v":""},{"$f":"IF(ISERROR(STDEV(E26:N26)),\"\",STDEV(E26:N26))","v":""},{"$f":"IF(ISERROR(T26/O26),\"\",T26/O26)","v":""}]
[{"$f":"IF(preencher!#ref!=\"\",\"\",preencher!#ref!)","v":{"$error":"#NAME?"}},{"$f":"IF(preencher!#ref!=\"\",\"\",preencher!#ref!)","v":{"$error":"#NAME?"}},{"$f":"IF(preencher!#ref!=\"\",\"\",preencher!#ref!)","v":{"$error":"#NAME?"}},{"$f":"IF(preencher!#ref!=\"\",\"\",preencher!#ref!)","v":{"$error":"#NAME?"}},{"$f":"IF(preencher!#ref!=\"\",\"\",IF(COUNTIF(preencher!#ref!,preencher!#ref!)=0,CONCATENATE(preencher!#ref!,#REF!),preencher!#ref!))","v":{"$error":"#NAME?"}},{"$f":"IF(preencher!#ref!=\"\",\"\",IF(COUNTIF(preencher!#ref!,preencher!#ref!)=0,CONCATENATE(preencher!#ref!,#REF!),preencher!#ref!))","v":{"$error":"#NAME?"}},{"$f":"IF(preencher!#ref!=\"\",\"\",IF(COUNTIF(preencher!#ref!,preencher!#ref!)=0,CONCATENATE(preencher!#ref!,#REF!),preencher!#ref!))","v":{"$error":"#NAME?"}},{"$f":"IF(preencher!#ref!=\"\",\"\",IF(COUNTIF(preencher!#ref!,preencher!#ref!)=0,CONCATENATE(preencher!#ref!,#REF!),preencher!#ref!))","v":{"$error":"#NAME?"}},{"$f":"IF(preencher!#ref!=\"\",\"\",IF(COUNTIF(preencher!#ref!,preencher!#ref!)=0,CONCATENATE(preencher!#ref!,#REF!),preencher!#ref!))","v":{"$error":"#NAME?"}},{"$f":"IF(preencher!#ref!=\"\",\"\",IF(COUNTIF(preencher!#ref!,preencher!#ref!)=0,CONCATENATE(preencher!#ref!,#REF!),preencher!#ref!))","v":{"$error":"#NAME?"}},{"$f":"IF(preencher!#ref!=\"\",\"\",IF(COUNTIF(preencher!#ref!,preencher!#ref!)=0,CONCATENATE(preencher!#ref!,#REF!),preencher!#ref!))","v":{"$error":"#NAME?"}},{"$f":"IF(preencher!#ref!=\"\",\"\",IF(COUNTIF(preencher!#ref!,preencher!#ref!)=0,CONCATENATE(preencher!#ref!,#REF!),preencher!#ref!))","v":{"$error":"#NAME?"}},{"$f":"IF(preencher!#ref!=\"\",\"\",IF(COUNTIF(preencher!#ref!,preencher!#ref!)=0,CONCATENATE(preencher!#ref!,#REF!),preencher!#ref!))","v":{"$error":"#NAME?"}},{"$f":"IF(preencher!#ref!=\"\",\"\",IF(COUNTIF(preencher!#ref!,preencher!#ref!)=0,CONCATENATE(preencher!#ref!,#REF!),preencher!#ref!))","v":{"$error":"#NAME?"}},{"$f":"IF(ISERROR(ROUND(AVERAGE(E27:N27),2)),\"\",ROUND(AVERAGE(E27:N27),2))","v":""},{"$f":"IF(ISERROR(ROUND(O27*D27,2)),\"\",ROUND(O27*D27,2))","v":""},null,null,{"$f":"IF(ISERROR(MEDIAN(E27:N27)),\"\",MEDIAN(E27:N27))","v":""},{"$f":"IF(ISERROR(STDEV(E27:N27)),\"\",STDEV(E27:N27))","v":""},{"$f":"IF(ISERROR(T27/O27),\"\",T27/O27)","v":""}]
[{"$f":"IF(preencher!#ref!=\"\",\"\",preencher!#ref!)","v":{"$error":"#NAME?"}},{"$f":"IF(preencher!#ref!=\"\",\"\",preencher!#ref!)","v":{"$error":"#NAME?"}},{"$f":"IF(preencher!#ref!=\"\",\"\",preencher!#ref!)","v":{"$error":"#NAME?"}},{"$f":"IF(preencher!#ref!=\"\",\"\",preencher!#ref!)","v":{"$error":"#NAME?"}},{"$f":"IF(preencher!#ref!=\"\",\"\",IF(COUNTIF(preencher!#ref!,preencher!#ref!)=0,CONCATENATE(preencher!#ref!,#REF!),preencher!#ref!))","v":{"$error":"#NAME?"}},{"$f":"IF(preencher!#ref!=\"\",\"\",IF(COUNTIF(preencher!#ref!,preencher!#ref!)=0,CONCATENATE(preencher!#ref!,#REF!),preencher!#ref!))","v":{"$error":"#NAME?"}},{"$f":"IF(preencher!#ref!=\"\",\"\",IF(COUNTIF(preencher!#ref!,preencher!#ref!)=0,CONCATENATE(preencher!#ref!,#REF!),preencher!#ref!))","v":{"$error":"#NAME?"}},{"$f":"IF(preencher!#ref!=\"\",\"\",IF(COUNTIF(preencher!#ref!,preencher!#ref!)=0,CONCATENATE(preencher!#ref!,#REF!),preencher!#ref!))","v":{"$error":"#NAME?"}},{"$f":"IF(preencher!#ref!=\"\",\"\",IF(COUNTIF(preencher!#ref!,preencher!#ref!)=0,CONCATENATE(preencher!#ref!,#REF!),preencher!#ref!))","v":{"$error":"#NAME?"}},{"$f":"IF(preencher!#ref!=\"\",\"\",IF(COUNTIF(preencher!#ref!,preencher!#ref!)=0,CONCATENATE(preencher!#ref!,#REF!),preencher!#ref!))","v":{"$error":"#NAME?"}},{"$f":"IF(preencher!#ref!=\"\",\"\",IF(COUNTIF(preencher!#ref!,preencher!#ref!)=0,CONCATENATE(preencher!#ref!,#REF!),preencher!#ref!))","v":{"$error":"#NAME?"}},{"$f":"IF(preencher!#ref!=\"\",\"\",IF(COUNTIF(preencher!#ref!,preencher!#ref!)=0,CONCATENATE(preencher!#ref!,#REF!),preencher!#ref!))","v":{"$error":"#NAME?"}},{"$f":"IF(preencher!#ref!=\"\",\"\",IF(COUNTIF(preencher!#ref!,preencher!#ref!)=0,CONCATENATE(preencher!#ref!,#REF!),preencher!#ref!))","v":{"$error":"#NAME?"}},{"$f":"IF(preencher!#ref!=\"\",\"\",IF(COUNTIF(preencher!#ref!,preencher!#ref!)=0,CONCATENATE(preencher!#ref!,#REF!),preencher!#ref!))","v":{"$error":"#NAME?"}},{"$f":"IF(ISERROR(ROUND(AVERAGE(E28:N28),2)),\"\",ROUND(AVERAGE(E28:N28),2))","v":""},{"$f":"IF(ISERROR(ROUND(O28*D28,2)),\"\",ROUND(O28*D28,2))","v":""},null,null,{"$f":"IF(ISERROR(MEDIAN(E28:N28)),\"\",MEDIAN(E28:N28))","v":""},{"$f":"IF(ISERROR(STDEV(E28:N28)),\"\",STDEV(E28:N28))","v":""},{"$f":"IF(ISERROR(T28/O28),\"\",T28/O28)","v":""}]
[{"$f":"IF(preencher!#ref!=\"\",\"\",preencher!#ref!)","v":{"$error":"#NAME?"}},{"$f":"IF(preencher!#ref!=\"\",\"\",preencher!#ref!)","v":{"$error":"#NAME?"}},{"$f":"IF(preencher!#ref!=\"\",\"\",preencher!#ref!)","v":{"$error":"#NAME?"}},{"$f":"IF(preencher!#ref!=\"\",\"\",preencher!#ref!)","v":{"$error":"#NAME?"}},{"$f":"IF(preencher!#ref!=\"\",\"\",IF(COUNTIF(preencher!#ref!,preencher!#ref!)=0,CONCATENATE(preencher!#ref!,#REF!),preencher!#ref!))","v":{"$error":"#NAME?"}},{"$f":"IF(preencher!#ref!=\"\",\"\",IF(COUNTIF(preencher!#ref!,preencher!#ref!)=0,CONCATENATE(preencher!#ref!,#REF!),preencher!#ref!))","v":{"$error":"#NAME?"}},{"$f":"IF(preencher!#ref!=\"\",\"\",IF(COUNTIF(preencher!#ref!,preencher!#ref!)=0,CONCATENATE(preencher!#ref!,#REF!),preencher!#ref!))","v":{"$error":"#NAME?"}},{"$f":"IF(preencher!#ref!=\"\",\"\",IF(COUNTIF(preencher!#ref!,preencher!#ref!)=0,CONCATENATE(preencher!#ref!,#REF!),preencher!#ref!))","v":{"$error":"#NAME?"}},{"$f":"IF(preencher!#ref!=\"\",\"\",IF(COUNTIF(preencher!#ref!,preencher!#ref!)=0,CONCATENATE(preencher!#ref!,#REF!),preencher!#ref!))","v":{"$error":"#NAME?"}},{"$f":"IF(preencher!#ref!=\"\",\"\",IF(COUNTIF(preencher!#ref!,preencher!#ref!)=0,CONCATENATE(preencher!#ref!,#REF!),preencher!#ref!))","v":{"$error":"#NAME?"}},{"$f":"IF(preencher!#ref!=\"\",\"\",IF(COUNTIF(preencher!#ref!,preencher!#ref!)=0,CONCATENATE(preencher!#ref!,#REF!),preencher!#ref!))","v":{"$error":"#NAME?"}},{"$f":"IF(preencher!#ref!=\"\",\"\",IF(COUNTIF(preencher!#ref!,preencher!#ref!)=0,CONCATENATE(preencher!#ref!,#REF!),preencher!#ref!))","v":{"$error":"#NAME?"}},{"$f":"IF(preencher!#ref!=\"\",\"\",IF(COUNTIF(preencher!#ref!,preencher!#ref!)=0,CONCATENATE(preencher!#ref!,#REF!),preencher!#ref!))","v":{"$error":"#NAME?"}},{"$f":"IF(preencher!#ref!=\"\",\"\",IF(COUNTIF(preencher!#ref!,preencher!#ref!)=0,CONCATENATE(preencher!#ref!,#REF!),preencher!#ref!))","v":{"$error":"#NAME?"}},{"$f":"IF(ISERROR(ROUND(AVERAGE(E29:N29),2)),\"\",ROUND(AVERAGE(E29:N29),2))","v":""},{"$f":"IF(ISERROR(ROUND(O29*D29,2)),\"\",ROUND(O29*D29,2))","v":""},null,null,{"$f":"IF(ISERROR(MEDIAN(E29:N29)),\"\",MEDIAN(E29:N29))","v":""},{"$f":"IF(ISERROR(STDEV(E29:N29)),\"\",STDEV(E29:N29))","v":""},{"$f":"IF(ISERROR(T29/O29),\"\",T29/O29)","v":""}]
[{"$f":"IF(preencher!#ref!=\"\",\"\",preencher!#ref!)","v":{"$error":"#NAME?"}},{"$f":"IF(preencher!#ref!=\"\",\"\",preencher!#ref!)","v":{"$error":"#NAME?"}},{"$f":"IF(preencher!#ref!=\"\",\"\",preencher!#ref!)","v":{"$error":"#NAME?"}},{"$f":"IF(preencher!#ref!=\"\",\"\",preencher!#ref!)","v":{"$error":"#NAME?"}},{"$f":"IF(preencher!#ref!=\"\",\"\",IF(COUNTIF(preencher!#ref!,preencher!#ref!)=0,CONCATENATE(preencher!#ref!,#REF!),preencher!#ref!))","v":{"$error":"#NAME?"}},{"$f":"IF(preencher!#ref!=\"\",\"\",IF(COUNTIF(preencher!#ref!,preencher!#ref!)=0,CONCATENATE(preencher!#ref!,#REF!),preencher!#ref!))","v":{"$error":"#NAME?"}},{"$f":"IF(preencher!#ref!=\"\",\"\",IF(COUNTIF(preencher!#ref!,preencher!#ref!)=0,CONCATENATE(preencher!#ref!,#REF!),preencher!#ref!))","v":{"$error":"#NAME?"}},{"$f":"IF(preencher!#ref!=\"\",\"\",IF(COUNTIF(preencher!#ref!,preencher!#ref!)=0,CONCATENATE(preencher!#ref!,#REF!),preencher!#ref!))","v":{"$error":"#NAME?"}},{"$f":"IF(preencher!#ref!=\"\",\"\",IF(COUNTIF(preencher!#ref!,preencher!#ref!)=0,CONCATENATE(preencher!#ref!,#REF!),preencher!#ref!))","v":{"$error":"#NAME?"}},{"$f":"IF(preencher!#ref!=\"\",\"\",IF(COUNTIF(preencher!#ref!,preencher!#ref!)=0,CONCATENATE(preencher!#ref!,#REF!),preencher!#ref!))","v":{"$error":"#NAME?"}},{"$f":"IF(preencher!#ref!=\"\",\"\",IF(COUNTIF(preencher!#ref!,preencher!#ref!)=0,CONCATENATE(preencher!#ref!,#REF!),preencher!#ref!))","v":{"$error":"#NAME?"}},{"$f":"IF(preencher!#ref!=\"\",\"\",IF(COUNTIF(preencher!#ref!,preencher!#ref!)=0,CONCATENATE(preencher!#ref!,#REF!),preencher!#ref!))","v":{"$error":"#NAME?"}},{"$f":"IF(preencher!#ref!=\"\",\"\",IF(COUNTIF(preencher!#ref!,preencher!#ref!)=0,CONCATENATE(preencher!#ref!,#REF!),preencher!#ref!))","v":{"$error":"#NAME?"}},{"$f":"IF(preencher!#ref!=\"\",\"\",IF(COUNTIF(preencher!#ref!,preencher!#ref!)=0,CONCATENATE(preencher!#ref!,#REF!),preencher!#ref!))","v":{"$error":"#NAME?"}},{"$f":"IF(ISERROR(ROUND(AVERAGE(E30:N30),2)),\"\",ROUND(AVERAGE(E30:N30),2))","v":""},{"$f":"IF(ISERROR(ROUND(O30*D30,2)),\"\",ROUND(O30*D30,2))","v":""},null,null,{"$f":"IF(ISERROR(MEDIAN(E30:N30)),\"\",MEDIAN(E30:N30))","v":""},{"$f":"IF(ISERROR(STDEV(E30:N30)),\"\",STDEV(E30:N30))","v":""},{"$f":"IF(ISERROR(T30/O30),\"\",T30/O30)","v":""}]
[{"$f":"IF(preencher!#ref!=\"\",\"\",preencher!#ref!)","v":{"$error":"#NAME?"}},{"$f":"IF(preencher!#ref!=\"\",\"\",preencher!#ref!)","v":{"$error":"#NAME?"}},{"$f":"IF(preencher!#ref!=\"\",\"\",preencher!#ref!)","v":{"$error":"#NAME?"}},{"$f":"IF(preencher!#ref!=\"\",\"\",preencher!#ref!)","v":{"$error":"#NAME?"}},{"$f":"IF(preencher!#ref!=\"\",\"\",IF(COUNTIF(preencher!#ref!,preencher!#ref!)=0,CONCATENATE(preencher!#ref!,#REF!),preencher!#ref!))","v":{"$error":"#NAME?"}},{"$f":"IF(preencher!#ref!=\"\",\"\",IF(COUNTIF(preencher!#ref!,preencher!#ref!)=0,CONCATENATE(preencher!#ref!,#REF!),preencher!#ref!))","v":{"$error":"#NAME?"}},{"$f":"IF(preencher!#ref!=\"\",\"\",IF(COUNTIF(preencher!#ref!,preencher!#ref!)=0,CONCATENATE(preencher!#ref!,#REF!),preencher!#ref!))","v":{"$error":"#NAME?"}},{"$f":"IF(preencher!#ref!=\"\",\"\",IF(COUNTIF(preencher!#ref!,preencher!#ref!)=0,CONCATENATE(preencher!#ref!,#REF!),preencher!#ref!))","v":{"$error":"#NAME?"}},{"$f":"IF(preencher!#ref!=\"\",\"\",IF(COUNTIF(preencher!#ref!,preencher!#ref!)=0,CONCATENATE(preencher!#ref!,#REF!),preencher!#ref!))","v":{"$error":"#NAME?"}},{"$f":"IF(preencher!#ref!=\"\",\"\",IF(COUNTIF(preencher!#ref!,preencher!#ref!)=0,CONCATENATE(preencher!#ref!,#REF!),preencher!#ref!))","v":{"$error":"#NAME?"}},{"$f":"IF(preencher!#ref!=\"\",\"\",IF(COUNTIF(preencher!#ref!,preencher!#ref!)=0,CONCATENATE(preencher!#ref!,#REF!),preencher!#ref!))","v":{"$error":"#NAME?"}},{"$f":"IF(preencher!#ref!=\"\",\"\",IF(COUNTIF(preencher!#ref!,preencher!#ref!)=0,CONCATENATE(preencher!#ref!,#REF!),preencher!#ref!))","v":{"$error":"#NAME?"}},{"$f":"IF(preencher!#ref!=\"\",\"\",IF(COUNTIF(preencher!#ref!,preencher!#ref!)=0,CONCATENATE(preencher!#ref!,#REF!),preencher!#ref!))","v":{"$error":"#NAME?"}},{"$f":"IF(preencher!#ref!=\"\",\"\",IF(COUNTIF(preencher!#ref!,preencher!#ref!)=0,CONCATENATE(preencher!#ref!,#REF!),preencher!#ref!))","v":{"$error":"#NAME?"}},{"$f":"IF(ISERROR(ROUND(AVERAGE(E31:N31),2)),\"\",ROUND(AVERAGE(E31:N31),2))","v":""},{"$f":"IF(ISERROR(ROUND(O31*D31,2)),\"\",ROUND(O31*D31,2))","v":""},null,null,{"$f":"IF(ISERROR(MEDIAN(E31:N31)),\"\",MEDIAN(E31:N31))","v":""},{"$f":"IF(ISERROR(STDEV(E31:N31)),\"\",STDEV(E31:N31))","v":""},{"$f":"IF(ISERROR(T31/O31),\"\",T31/O31)","v":""}]
[{"$f":"IF(preencher!#ref!=\"\",\"\",preencher!#ref!)","v":{"$error":"#NAME?"}},{"$f":"IF(preencher!#ref!=\"\",\"\",preencher!#ref!)","v":{"$error":"#NAME?"}},{"$f":"IF(preencher!#ref!=\"\",\"\",preencher!#ref!)","v":{"$error":"#NAME?"}},{"$f":"IF(preencher!#ref!=\"\",\"\",preencher!#ref!)","v":{"$error":"#NAME?"}},{"$f":"IF(preencher!#ref!=\"\",\"\",IF(COUNTIF(preencher!#ref!,preencher!#ref!)=0,CONCATENATE(preencher!#ref!,#REF!),preencher!#ref!))","v":{"$error":"#NAME?"}},{"$f":"IF(preencher!#ref!=\"\",\"\",IF(COUNTIF(preencher!#ref!,preencher!#ref!)=0,CONCATENATE(preencher!#ref!,#REF!),preencher!#ref!))","v":{"$error":"#NAME?"}},{"$f":"IF(preencher!#ref!=\"\",\"\",IF(COUNTIF(preencher!#ref!,preencher!#ref!)=0,CONCATENATE(preencher!#ref!,#REF!),preencher!#ref!))","v":{"$error":"#NAME?"}},{"$f":"IF(preencher!#ref!=\"\",\"\",IF(COUNTIF(preencher!#ref!,preencher!#ref!)=0,CONCATENATE(preencher!#ref!,#REF!),preencher!#ref!))","v":{"$error":"#NAME?"}},{"$f":"IF(preencher!#ref!=\"\",\"\",IF(COUNTIF(preencher!#ref!,preencher!#ref!)=0,CONCATENATE(preencher!#ref!,#REF!),preencher!#ref!))","v":{"$error":"#NAME?"}},{"$f":"IF(preencher!#ref!=\"\",\"\",IF(COUNTIF(preencher!#ref!,preencher!#ref!)=0,CONCATENATE(preencher!#ref!,#REF!),preencher!#ref!))","v":{"$error":"#NAME?"}},{"$f":"IF(preencher!#ref!=\"\",\"\",IF(COUNTIF(preencher!#ref!,preencher!#ref!)=0,CONCATENATE(preencher!#ref!,#REF!),preencher!#ref!))","v":{"$error":"#NAME?"}},{"$f":"IF(preencher!#ref!=\"\",\"\",IF(COUNTIF(preencher!#ref!,preencher!#ref!)=0,CONCATENATE(preencher!#ref!,#REF!),preencher!#ref!))","v":{"$error":"#NAME?"}},{"$f":"IF(preencher!#ref!=\"\",\"\",IF(COUNTIF(preencher!#ref!,preencher!#ref!)=0,CONCATENATE(preencher!#ref!,#REF!),preencher!#ref!))","v":{"$error":"#NAME?"}},{"$f":"IF(preencher!#ref!=\"\",\"\",IF(COUNTIF(preencher!#ref!,preencher!#ref!)=0,CONCATENATE(preencher!#ref!,#REF!),preencher!#ref!))","v":{"$error":"#NAME?"}},{"$f":"IF(ISERROR(ROUND(AVERAGE(E32:N32),2)),\"\",ROUND(AVERAGE(E32:N32),2))","v":""},{"$f":"IF(ISERROR(ROUND(O32*D32,2)),\"\",ROUND(O32*D32,2))","v":""},null,null,{"$f":"IF(ISERROR(MEDIAN(E32:N32)),\"\",MEDIAN(E32:N32))","v":""},{"$f":"IF(ISERROR(STDEV(E32:N32)),\"\",STDEV(E32:N32))","v":""},{"$f":"IF(ISERROR(T32/O32),\"\",T32/O32)","v":""}]
[{"$f":"IF(preencher!#ref!=\"\",\"\",preencher!#ref!)","v":{"$error":"#NAME?"}},{"$f":"IF(preencher!#ref!=\"\",\"\",preencher!#ref!)","v":{"$error":"#NAME?"}},{"$f":"IF(preencher!#ref!=\"\",\"\",preencher!#ref!)","v":{"$error":"#NAME?"}},{"$f":"IF(preencher!#ref!=\"\",\"\",preencher!#ref!)","v":{"$error":"#NAME?"}},{"$f":"IF(preencher!#ref!=\"\",\"\",IF(COUNTIF(preencher!#ref!,preencher!#ref!)=0,CONCATENATE(preencher!#ref!,#REF!),preencher!#ref!))","v":{"$error":"#NAME?"}},{"$f":"IF(preencher!#ref!=\"\",\"\",IF(COUNTIF(preencher!#ref!,preencher!#ref!)=0,CONCATENATE(preencher!#ref!,#REF!),preencher!#ref!))","v":{"$error":"#NAME?"}},{"$f":"IF(preencher!#ref!=\"\",\"\",IF(COUNTIF(preencher!#ref!,preencher!#ref!)=0,CONCATENATE(preencher!#ref!,#REF!),preencher!#ref!))","v":{"$error":"#NAME?"}},{"$f":"IF(preencher!#ref!=\"\",\"\",IF(COUNTIF(preencher!#ref!,preencher!#ref!)=0,CONCATENATE(preencher!#ref!,#REF!),preencher!#ref!))","v":{"$error":"#NAME?"}},{"$f":"IF(preencher!#ref!=\"\",\"\",IF(COUNTIF(preencher!#ref!,preencher!#ref!)=0,CONCATENATE(preencher!#ref!,#REF!),preencher!#ref!))","v":{"$error":"#NAME?"}},{"$f":"IF(preencher!#ref!=\"\",\"\",IF(COUNTIF(preencher!#ref!,preencher!#ref!)=0,CONCATENATE(preencher!#ref!,#REF!),preencher!#ref!))","v":{"$error":"#NAME?"}},{"$f":"IF(preencher!#ref!=\"\",\"\",IF(COUNTIF(preencher!#ref!,preencher!#ref!)=0,CONCATENATE(preencher!#ref!,#REF!),preencher!#ref!))","v":{"$error":"#NAME?"}},{"$f":"IF(preencher!#ref!=\"\",\"\",IF(COUNTIF(preencher!#ref!,preencher!#ref!)=0,CONCATENATE(preencher!#ref!,#REF!),preencher!#ref!))","v":{"$error":"#NAME?"}},{"$f":"IF(preencher!#ref!=\"\",\"\",IF(COUNTIF(preencher!#ref!,preencher!#ref!)=0,CONCATENATE(preencher!#ref!,#REF!),preencher!#ref!))","v":{"$error":"#NAME?"}},{"$f":"IF(preencher!#ref!=\"\",\"\",IF(COUNTIF(preencher!#ref!,preencher!#ref!)=0,CONCATENATE(preencher!#ref!,#REF!),preencher!#ref!))","v":{"$error":"#NAME?"}},{"$f":"IF(ISERROR(ROUND(AVERAGE(E33:N33),2)),\"\",ROUND(AVERAGE(E33:N33),2))","v":""},{"$f":"IF(ISERROR(ROUND(O33*D33,2)),\"\",ROUND(O33*D33,2))","v":""},null,null,{"$f":"IF(ISERROR(MEDIAN(E33:N33)),\"\",MEDIAN(E33:N33))","v":""},{"$f":"IF(ISERROR(STDEV(E33:N33)),\"\",STDEV(E33:N33))","v":""},{"$f":"IF(ISERROR(T33/O33),\"\",T33/O33)","v":""}]
[{"$f":"IF(preencher!#ref!=\"\",\"\",preencher!#ref!)","v":{"$error":"#NAME?"}},{"$f":"IF(preencher!#ref!=\"\",\"\",preencher!#ref!)","v":{"$error":"#NAME?"}},{"$f":"IF(preencher!#ref!=\"\",\"\",preencher!#ref!)","v":{"$error":"#NAME?"}},{"$f":"IF(preencher!#ref!=\"\",\"\",preencher!#ref!)","v":{"$error":"#NAME?"}},{"$f":"IF(preencher!#ref!=\"\",\"\",IF(COUNTIF(preencher!#ref!,preencher!#ref!)=0,CONCATENATE(preencher!#ref!,#REF!),preencher!#ref!))","v":{"$error":"#NAME?"}},{"$f":"IF(preencher!#ref!=\"\",\"\",IF(COUNTIF(preencher!#ref!,preencher!#ref!)=0,CONCATENATE(preencher!#ref!,#REF!),preencher!#ref!))","v":{"$error":"#NAME?"}},{"$f":"IF(preencher!#ref!=\"\",\"\",IF(COUNTIF(preencher!#ref!,preencher!#ref!)=0,CONCATENATE(preencher!#ref!,#REF!),preencher!#ref!))","v":{"$error":"#NAME?"}},{"$f":"IF(preencher!#ref!=\"\",\"\",IF(COUNTIF(preencher!#ref!,preencher!#ref!)=0,CONCATENATE(preencher!#ref!,#REF!),preencher!#ref!))","v":{"$error":"#NAME?"}},{"$f":"IF(preencher!#ref!=\"\",\"\",IF(COUNTIF(preencher!#ref!,preencher!#ref!)=0,CONCATENATE(preencher!#ref!,#REF!),preencher!#ref!))","v":{"$error":"#NAME?"}},{"$f":"IF(preencher!#ref!=\"\",\"\",IF(COUNTIF(preencher!#ref!,preencher!#ref!)=0,CONCATENATE(preencher!#ref!,#REF!),preencher!#ref!))","v":{"$error":"#NAME?"}},{"$f":"IF(preencher!#ref!=\"\",\"\",IF(COUNTIF(preencher!#ref!,preencher!#ref!)=0,CONCATENATE(preencher!#ref!,#REF!),preencher!#ref!))","v":{"$error":"#NAME?"}},{"$f":"IF(preencher!#ref!=\"\",\"\",IF(COUNTIF(preencher!#ref!,preencher!#ref!)=0,CONCATENATE(preencher!#ref!,#REF!),preencher!#ref!))","v":{"$error":"#NAME?"}},{"$f":"IF(preencher!#ref!=\"\",\"\",IF(COUNTIF(preencher!#ref!,preencher!#ref!)=0,CONCATENATE(preencher!#ref!,#REF!),preencher!#ref!))","v":{"$error":"#NAME?"}},{"$f":"IF(preencher!#ref!=\"\",\"\",IF(COUNTIF(preencher!#ref!,preencher!#ref!)=0,CONCATENATE(preencher!#ref!,#REF!),preencher!#ref!))","v":{"$error":"#NAME?"}},{"$f":"IF(ISERROR(ROUND(AVERAGE(E34:N34),2)),\"\",ROUND(AVERAGE(E34:N34),2))","v":""},{"$f":"IF(ISERROR(ROUND(O34*D34,2)),\"\",ROUND(O34*D34,2))","v":""},null,null,{"$f":"IF(ISERROR(MEDIAN(E34:N34)),\"\",MEDIAN(E34:N34))","v":""},{"$f":"IF(ISERROR(STDEV(E34:N34)),\"\",STDEV(E34:N34))","v":""},{"$f":"IF(ISERROR(T34/O34),\"\",T34/O34)","v":""}]
[{"$f":"IF(preencher!#ref!=\"\",\"\",preencher!#ref!)","v":{"$error":"#NAME?"}},{"$f":"IF(preencher!#ref!=\"\",\"\",preencher!#ref!)","v":{"$error":"#NAME?"}},{"$f":"IF(preencher!#ref!=\"\",\"\",preencher!#ref!)","v":{"$error":"#NAME?"}},{"$f":"IF(preencher!#ref!=\"\",\"\",preencher!#ref!)","v":{"$error":"#NAME?"}},{"$f":"IF(preencher!#ref!=\"\",\"\",IF(COUNTIF(preencher!#ref!,preencher!#ref!)=0,CONCATENATE(preencher!#ref!,#REF!),preencher!#ref!))","v":{"$error":"#NAME?"}},{"$f":"IF(preencher!#ref!=\"\",\"\",IF(COUNTIF(preencher!#ref!,preencher!#ref!)=0,CONCATENATE(preencher!#ref!,#REF!),preencher!#ref!))","v":{"$error":"#NAME?"}},{"$f":"IF(preencher!#ref!=\"\",\"\",IF(COUNTIF(preencher!#ref!,preencher!#ref!)=0,CONCATENATE(preencher!#ref!,#REF!),preencher!#ref!))","v":{"$error":"#NAME?"}},{"$f":"IF(preencher!#ref!=\"\",\"\",IF(COUNTIF(preencher!#ref!,preencher!#ref!)=0,CONCATENATE(preencher!#ref!,#REF!),preencher!#ref!))","v":{"$error":"#NAME?"}},{"$f":"IF(preencher!#ref!=\"\",\"\",IF(COUNTIF(preencher!#ref!,preencher!#ref!)=0,CONCATENATE(preencher!#ref!,#REF!),preencher!#ref!))","v":{"$error":"#NAME?"}},{"$f":"IF(preencher!#ref!=\"\",\"\",IF(COUNTIF(preencher!#ref!,preencher!#ref!)=0,CONCATENATE(preencher!#ref!,#REF!),preencher!#ref!))","v":{"$error":"#NAME?"}},{"$f":"IF(preencher!#ref!=\"\",\"\",IF(COUNTIF(preencher!#ref!,preencher!#ref!)=0,CONCATENATE(preencher!#ref!,#REF!),preencher!#ref!))","v":{"$error":"#NAME?"}},{"$f":"IF(preencher!#ref!=\"\",\"\",IF(COUNTIF(preencher!#ref!,preencher!#ref!)=0,CONCATENATE(preencher!#ref!,#REF!),preencher!#ref!))","v":{"$error":"#NAME?"}},{"$f":"IF(preencher!#ref!=\"\",\"\",IF(COUNTIF(preencher!#ref!,preencher!#ref!)=0,CONCATENATE(preencher!#ref!,#REF!),preencher!#ref!))","v":{"$error":"#NAME?"}},{"$f":"IF(preencher!#ref!=\"\",\"\",IF(COUNTIF(preencher!#ref!,preencher!#ref!)=0,CONCATENATE(preencher!#ref!,#REF!),preencher!#ref!))","v":{"$error":"#NAME?"}},{"$f":"IF(ISERROR(ROUND(AVERAGE(E35:N35),2)),\"\",ROUND(AVERAGE(E35:N35),2))","v":""},{"$f":"IF(ISERROR(ROUND(O35*D35,2)),\"\",ROUND(O35*D35,2))","v":""},null,null,{"$f":"IF(ISERROR(MEDIAN(E35:N35)),\"\",MEDIAN(E35:N35))","v":""},{"$f":"IF(ISERROR(STDEV(E35:N35)),\"\",STDEV(E35:N35))","v":""},{"$f":"IF(ISERROR(T35/O35),\"\",T35/O35)","v":""}]
[{"$f":"IF(preencher!#ref!=\"\",\"\",preencher!#ref!)","v":{"$error":"#NAME?"}},{"$f":"IF(preencher!#ref!=\"\",\"\",preencher!#ref!)","v":{"$error":"#NAME?"}},{"$f":"IF(preencher!#ref!=\"\",\"\",preencher!#ref!)","v":{"$error":"#NAME?"}},{"$f":"IF(preencher!#ref!=\"\",\"\",preencher!#ref!)","v":{"$error":"#NAME?"}},{"$f":"IF(preencher!#ref!=\"\",\"\",IF(COUNTIF(preencher!#ref!,preencher!#ref!)=0,CONCATENATE(preencher!#ref!,#REF!),preencher!#ref!))","v":{"$error":"#NAME?"}},{"$f":"IF(preencher!#ref!=\"\",\"\",IF(COUNTIF(preencher!#ref!,preencher!#ref!)=0,CONCATENATE(preencher!#ref!,#REF!),preencher!#ref!))","v":{"$error":"#NAME?"}},{"$f":"IF(preencher!#ref!=\"\",\"\",IF(COUNTIF(preencher!#ref!,preencher!#ref!)=0,CONCATENATE(preencher!#ref!,#REF!),preencher!#ref!))","v":{"$error":"#NAME?"}},{"$f":"IF(preencher!#ref!=\"\",\"\",IF(COUNTIF(preencher!#ref!,preencher!#ref!)=0,CONCATENATE(preencher!#ref!,#REF!),preencher!#ref!))","v":{"$error":"#NAME?"}},{"$f":"IF(preencher!#ref!=\"\",\"\",IF(COUNTIF(preencher!#ref!,preencher!#ref!)=0,CONCATENATE(preencher!#ref!,#REF!),preencher!#ref!))","v":{"$error":"#NAME?"}},{"$f":"IF(preencher!#ref!=\"\",\"\",IF(COUNTIF(preencher!#ref!,preencher!#ref!)=0,CONCATENATE(preencher!#ref!,#REF!),preencher!#ref!))","v":{"$error":"#NAME?"}},{"$f":"IF(preencher!#ref!=\"\",\"\",IF(COUNTIF(preencher!#ref!,preencher!#ref!)=0,CONCATENATE(preencher!#ref!,#REF!),preencher!#ref!))","v":{"$error":"#NAME?"}},{"$f":"IF(preencher!#ref!=\"\",\"\",IF(COUNTIF(preencher!#ref!,preencher!#ref!)=0,CONCATENATE(preencher!#ref!,#REF!),preencher!#ref!))","v":{"$error":"#NAME?"}},{"$f":"IF(preencher!#ref!=\"\",\"\",IF(COUNTIF(preencher!#ref!,preencher!#ref!)=0,CONCATENATE(preencher!#ref!,#REF!),preencher!#ref!))","v":{"$error":"#NAME?"}},{"$f":"IF(preencher!#ref!=\"\",\"\",IF(COUNTIF(preencher!#ref!,preencher!#ref!)=0,CONCATENATE(preencher!#ref!,#REF!),preencher!#ref!))","v":{"$error":"#NAME?"}},{"$f":"IF(ISERROR(ROUND(AVERAGE(E36:N36),2)),\"\",ROUND(AVERAGE(E36:N36),2))","v":""},{"$f":"IF(ISERROR(ROUND(O36*D36,2)),\"\",ROUND(O36*D36,2))","v":""},null,null,{"$f":"IF(ISERROR(MEDIAN(E36:N36)),\"\",MEDIAN(E36:N36))","v":""},{"$f":"IF(ISERROR(STDEV(E36:N36)),\"\",STDEV(E36:N36))","v":""},{"$f":"IF(ISERROR(T36/O36),\"\",T36/O36)","v":""}]
[{"$f":"IF(preencher!#ref!=\"\",\"\",preencher!#ref!)","v":{"$error":"#NAME?"}},{"$f":"IF(preencher!#ref!=\"\",\"\",preencher!#ref!)","v":{"$error":"#NAME?"}},{"$f":"IF(preencher!#ref!=\"\",\"\",preencher!#ref!)","v":{"$error":"#NAME?"}},{"$f":"IF(preencher!#ref!=\"\",\"\",preencher!#ref!)","v":{"$error":"#NAME?"}},{"$f":"IF(preencher!#ref!=\"\",\"\",IF(COUNTIF(preencher!#ref!,preencher!#ref!)=0,CONCATENATE(preencher!#ref!,#REF!),preencher!#ref!))","v":{"$error":"#NAME?"}},{"$f":"IF(preencher!#ref!=\"\",\"\",IF(COUNTIF(preencher!#ref!,preencher!#ref!)=0,CONCATENATE(preencher!#ref!,#REF!),preencher!#ref!))","v":{"$error":"#NAME?"}},{"$f":"IF(preencher!#ref!=\"\",\"\",IF(COUNTIF(preencher!#ref!,preencher!#ref!)=0,CONCATENATE(preencher!#ref!,#REF!),preencher!#ref!))","v":{"$error":"#NAME?"}},{"$f":"IF(preencher!#ref!=\"\",\"\",IF(COUNTIF(preencher!#ref!,preencher!#ref!)=0,CONCATENATE(preencher!#ref!,#REF!),preencher!#ref!))","v":{"$error":"#NAME?"}},{"$f":"IF(preencher!#ref!=\"\",\"\",IF(COUNTIF(preencher!#ref!,preencher!#ref!)=0,CONCATENATE(preencher!#ref!,#REF!),preencher!#ref!))","v":{"$error":"#NAME?"}},{"$f":"IF(preencher!#ref!=\"\",\"\",IF(COUNTIF(preencher!#ref!,preencher!#ref!)=0,CONCATENATE(preencher!#ref!,#REF!),preencher!#ref!))","v":{"$error":"#NAME?"}},{"$f":"IF(preencher!#ref!=\"\",\"\",IF(COUNTIF(preencher!#ref!,preencher!#ref!)=0,CONCATENATE(preencher!#ref!,#REF!),preencher!#ref!))","v":{"$error":"#NAME?"}},{"$f":"IF(preencher!#ref!=\"\",\"\",IF(COUNTIF(preencher!#ref!,preencher!#ref!)=0,CONCATENATE(preencher!#ref!,#REF!),preencher!#ref!))","v":{"$error":"#NAME?"}},{"$f":"IF(preencher!#ref!=\"\",\"\",IF(COUNTIF(preencher!#ref!,preencher!#ref!)=0,CONCATENATE(preencher!#ref!,#REF!),preencher!#ref!))","v":{"$error":"#NAME?"}},{"$f":"IF(preencher!#ref!=\"\",\"\",IF(COUNTIF(preencher!#ref!,preencher!#ref!)=0,CONCATENATE(preencher!#ref!,#REF!),preencher!#ref!))","v":{"$error":"#NAME?"}},{"$f":"IF(ISERROR(ROUND(AVERAGE(E37:N37),2)),\"\",ROUND(AVERAGE(E37:N37),2))","v":""},{"$f":"IF(ISERROR(ROUND(O37*D37,2)),\"\",ROUND(O37*D37,2))","v":""},null,null,{"$f":"IF(ISERROR(MEDIAN(E37:N37)),\"\",MEDIAN(E37:N37))","v":""},{"$f":"IF(ISERROR(STDEV(E37:N37)),\"\",STDEV(E37:N37))","v":""},{"$f":"IF(ISERROR(T37/O37),\"\",T37/O37)","v":""}]
[{"$f":"IF(preencher!#ref!=\"\",\"\",preencher!#ref!)","v":{"$error":"#NAME?"}},{"$f":"IF(preencher!#ref!=\"\",\"\",preencher!#ref!)","v":{"$error":"#NAME?"}},{"$f":"IF(preencher!#ref!=\"\",\"\",preencher!#ref!)","v":{"$error":"#NAME?"}},{"$f":"IF(preencher!#ref!=\"\",\"\",preencher!#ref!)","v":{"$error":"#NAME?"}},{"$f":"IF(preencher!#ref!=\"\",\"\",IF(COUNTIF(preencher!#ref!,preencher!#ref!)=0,CONCATENATE(preencher!#ref!,#REF!),preencher!#ref!))","v":{"$error":"#NAME?"}},{"$f":"IF(preencher!#ref!=\"\",\"\",IF(COUNTIF(preencher!#ref!,preencher!#ref!)=0,CONCATENATE(preencher!#ref!,#REF!),preencher!#ref!))","v":{"$error":"#NAME?"}},{"$f":"IF(preencher!#ref!=\"\",\"\",IF(COUNTIF(preencher!#ref!,preencher!#ref!)=0,CONCATENATE(preencher!#ref!,#REF!),preencher!#ref!))","v":{"$error":"#NAME?"}},{"$f":"IF(preencher!#ref!=\"\",\"\",IF(COUNTIF(preencher!#ref!,preencher!#ref!)=0,CONCATENATE(preencher!#ref!,#REF!),preencher!#ref!))","v":{"$error":"#NAME?"}},{"$f":"IF(preencher!#ref!=\"\",\"\",IF(COUNTIF(preencher!#ref!,preencher!#ref!)=0,CONCATENATE(preencher!#ref!,#REF!),preencher!#ref!))","v":{"$error":"#NAME?"}},{"$f":"IF(preencher!#ref!=\"\",\"\",IF(COUNTIF(preencher!#ref!,preencher!#ref!)=0,CONCATENATE(preencher!#ref!,#REF!),preencher!#ref!))","v":{"$error":"#NAME?"}},{"$f":"IF(preencher!#ref!=\"\",\"\",IF(COUNTIF(preencher!#ref!,preencher!#ref!)=0,CONCATENATE(preencher!#ref!,#REF!),preencher!#ref!))","v":{"$error":"#NAME?"}},{"$f":"IF(preencher!#ref!=\"\",\"\",IF(COUNTIF(preencher!#ref!,preencher!#ref!)=0,CONCATENATE(preencher!#ref!,#REF!),preencher!#ref!))","v":{"$error":"#NAME?"}},{"$f":"IF(preencher!#ref!=\"\",\"\",IF(COUNTIF(preencher!#ref!,preencher!#ref!)=0,CONCATENATE(preencher!#ref!,#REF!),preencher!#ref!))","v":{"$error":"#NAME?"}},{"$f":"IF(preencher!#ref!=\"\",\"\",IF(COUNTIF(preencher!#ref!,preencher!#ref!)=0,CONCATENATE(preencher!#ref!,#REF!),preencher!#ref!))","v":{"$error":"#NAME?"}},{"$f":"IF(ISERROR(ROUND(AVERAGE(E38:N38),2)),\"\",ROUND(AVERAGE(E38:N38),2))","v":""},{"$f":"IF(ISERROR(ROUND(O38*D38,2)),\"\",ROUND(O38*D38,2))","v":""},null,null,{"$f":"IF(ISERROR(MEDIAN(E38:N38)),\"\",MEDIAN(E38:N38))","v":""},{"$f":"IF(ISERROR(STDEV(E38:N38)),\"\",STDEV(E38:N38))","v":""},{"$f":"IF(ISERROR(T38/O38),\"\",T38/O38)","v":""}]
[{"$f":"IF(preencher!#ref!=\"\",\"\",preencher!#ref!)","v":{"$error":"#NAME?"}},{"$f":"IF(preencher!#ref!=\"\",\"\",preencher!#ref!)","v":{"$error":"#NAME?"}},{"$f":"IF(preencher!#ref!=\"\",\"\",preencher!#ref!)","v":{"$error":"#NAME?"}},{"$f":"IF(preencher!#ref!=\"\",\"\",preencher!#ref!)","v":{"$error":"#NAME?"}},{"$f":"IF(preencher!#ref!=\"\",\"\",IF(COUNTIF(preencher!#ref!,preencher!#ref!)=0,CONCATENATE(preencher!#ref!,#REF!),preencher!#ref!))","v":{"$error":"#NAME?"}},{"$f":"IF(preencher!#ref!=\"\",\"\",IF(COUNTIF(preencher!#ref!,preencher!#ref!)=0,CONCATENATE(preencher!#ref!,#REF!),preencher!#ref!))","v":{"$error":"#NAME?"}},{"$f":"IF(preencher!#ref!=\"\",\"\",IF(COUNTIF(preencher!#ref!,preencher!#ref!)=0,CONCATENATE(preencher!#ref!,#REF!),preencher!#ref!))","v":{"$error":"#NAME?"}},{"$f":"IF(preencher!#ref!=\"\",\"\",IF(COUNTIF(preencher!#ref!,preencher!#ref!)=0,CONCATENATE(preencher!#ref!,#REF!),preencher!#ref!))","v":{"$error":"#NAME?"}},{"$f":"IF(preencher!#ref!=\"\",\"\",IF(COUNTIF(preencher!#ref!,preencher!#ref!)=0,CONCATENATE(preencher!#ref!,#REF!),preencher!#ref!))","v":{"$error":"#NAME?"}},{"$f":"IF(preencher!#ref!=\"\",\"\",IF(COUNTIF(preencher!#ref!,preencher!#ref!)=0,CONCATENATE(preencher!#ref!,#REF!),preencher!#ref!))","v":{"$error":"#NAME?"}},{"$f":"IF(preencher!#ref!=\"\",\"\",IF(COUNTIF(preencher!#ref!,preencher!#ref!)=0,CONCATENATE(preencher!#ref!,#REF!),preencher!#ref!))","v":{"$error":"#NAME?"}},{"$f":"IF(preencher!#ref!=\"\",\"\",IF(COUNTIF(preencher!#ref!,preencher!#ref!)=0,CONCATENATE(preencher!#ref!,#REF!),preencher!#ref!))","v":{"$error":"#NAME?"}},{"$f":"IF(preencher!#ref!=\"\",\"\",IF(COUNTIF(preencher!#ref!,preencher!#ref!)=0,CONCATENATE(preencher!#ref!,#REF!),preencher!#ref!))","v":{"$error":"#NAME?"}},{"$f":"IF(preencher!#ref!=\"\",\"\",IF(COUNTIF(preencher!#ref!,preencher!#ref!)=0,CONCATENATE(preencher!#ref!,#REF!),preencher!#ref!))","v":{"$error":"#NAME?"}},{"$f":"IF(ISERROR(ROUND(AVERAGE(E39:N39),2)),\"\",ROUND(AVERAGE(E39:N39),2))","v":""},{"$f":"IF(ISERROR(ROUND(O39*D39,2)),\"\",ROUND(O39*D39,2))","v":""},null,null,{"$f":"IF(ISERROR(MEDIAN(E39:N39)),\"\",MEDIAN(E39:N39))","v":""},{"$f":"IF(ISERROR(STDEV(E39:N39)),\"\",STDEV(E39:N39))","v":""},{"$f":"IF(ISERROR(T39/O39),\"\",T39/O39)","v":""}]
[{"$f":"IF(preencher!#ref!=\"\",\"\",preencher!#ref!)","v":{"$error":"#NAME?"}},{"$f":"IF(preencher!#ref!=\"\",\"\",preencher!#ref!)","v":{"$error":"#NAME?"}},{"$f":"IF(preencher!#ref!=\"\",\"\",preencher!#ref!)","v":{"$error":"#NAME?"}},{"$f":"IF(preencher!#ref!=\"\",\"\",preencher!#ref!)","v":{"$error":"#NAME?"}},{"$f":"IF(preencher!#ref!=\"\",\"\",IF(COUNTIF(preencher!#ref!,preencher!#ref!)=0,CONCATENATE(preencher!#ref!,#REF!),preencher!#ref!))","v":{"$error":"#NAME?"}},{"$f":"IF(preencher!#ref!=\"\",\"\",IF(COUNTIF(preencher!#ref!,preencher!#ref!)=0,CONCATENATE(preencher!#ref!,#REF!),preencher!#ref!))","v":{"$error":"#NAME?"}},{"$f":"IF(preencher!#ref!=\"\",\"\",IF(COUNTIF(preencher!#ref!,preencher!#ref!)=0,CONCATENATE(preencher!#ref!,#REF!),preencher!#ref!))","v":{"$error":"#NAME?"}},{"$f":"IF(preencher!#ref!=\"\",\"\",IF(COUNTIF(preencher!#ref!,preencher!#ref!)=0,CONCATENATE(preencher!#ref!,#REF!),preencher!#ref!))","v":{"$error":"#NAME?"}},{"$f":"IF(preencher!#ref!=\"\",\"\",IF(COUNTIF(preencher!#ref!,preencher!#ref!)=0,CONCATENATE(preencher!#ref!,#REF!),preencher!#ref!))","v":{"$error":"#NAME?"}},{"$f":"IF(preencher!#ref!=\"\",\"\",IF(COUNTIF(preencher!#ref!,preencher!#ref!)=0,CONCATENATE(preencher!#ref!,#REF!),preencher!#ref!))","v":{"$error":"#NAME?"}},{"$f":"IF(preencher!#ref!=\"\",\"\",IF(COUNTIF(preencher!#ref!,preencher!#ref!)=0,CONCATENATE(preencher!#ref!,#REF!),preencher!#ref!))","v":{"$error":"#NAME?"}},{"$f":"IF(preencher!#ref!=\"\",\"\",IF(COUNTIF(preencher!#ref!,preencher!#ref!)=0,CONCATENATE(preencher!#ref!,#REF!),preencher!#ref!))","v":{"$error":"#NAME?"}},{"$f":"IF(preencher!#ref!=\"\",\"\",IF(COUNTIF(preencher!#ref!,preencher!#ref!)=0,CONCATENATE(preencher!#ref!,#REF!),preencher!#ref!))","v":{"$error":"#NAME?"}},{"$f":"IF(preencher!#ref!=\"\",\"\",IF(COUNTIF(preencher!#ref!,preencher!#ref!)=0,CONCATENATE(preencher!#ref!,#REF!),preencher!#ref!))","v":{"$error":"#NAME?"}},{"$f":"IF(ISERROR(ROUND(AVERAGE(E40:N40),2)),\"\",ROUND(AVERAGE(E40:N40),2))","v":""},{"$f":"IF(ISERROR(ROUND(O40*D40,2)),\"\",ROUND(O40*D40,2))","v":""},null,null,{"$f":"IF(ISERROR(MEDIAN(E40:N40)),\"\",MEDIAN(E40:N40))","v":""},{"$f":"IF(ISERROR(STDEV(E40:N40)),\"\",STDEV(E40:N40))","v":""},{"$f":"IF(ISERROR(T40/O40),\"\",T40/O40)","v":""}]
[{"$f":"IF(preencher!#ref!=\"\",\"\",preencher!#ref!)","v":{"$error":"#NAME?"}},{"$f":"IF(preencher!#ref!=\"\",\"\",preencher!#ref!)","v":{"$error":"#NAME?"}},{"$f":"IF(preencher!#ref!=\"\",\"\",preencher!#ref!)","v":{"$error":"#NAME?"}},{"$f":"IF(preencher!#ref!=\"\",\"\",preencher!#ref!)","v":{"$error":"#NAME?"}},{"$f":"IF(preencher!#ref!=\"\",\"\",IF(COUNTIF(preencher!#ref!,preencher!#ref!)=0,CONCATENATE(preencher!#ref!,#REF!),preencher!#ref!))","v":{"$error":"#NAME?"}},{"$f":"IF(preencher!#ref!=\"\",\"\",IF(COUNTIF(preencher!#ref!,preencher!#ref!)=0,CONCATENATE(preencher!#ref!,#REF!),preencher!#ref!))","v":{"$error":"#NAME?"}},{"$f":"IF(preencher!#ref!=\"\",\"\",IF(COUNTIF(preencher!#ref!,preencher!#ref!)=0,CONCATENATE(preencher!#ref!,#REF!),preencher!#ref!))","v":{"$error":"#NAME?"}},{"$f":"IF(preencher!#ref!=\"\",\"\",IF(COUNTIF(preencher!#ref!,preencher!#ref!)=0,CONCATENATE(preencher!#ref!,#REF!),preencher!#ref!))","v":{"$error":"#NAME?"}},{"$f":"IF(preencher!#ref!=\"\",\"\",IF(COUNTIF(preencher!#ref!,preencher!#ref!)=0,CONCATENATE(preencher!#ref!,#REF!),preencher!#ref!))","v":{"$error":"#NAME?"}},{"$f":"IF(preencher!#ref!=\"\",\"\",IF(COUNTIF(preencher!#ref!,preencher!#ref!)=0,CONCATENATE(preencher!#ref!,#REF!),preencher!#ref!))","v":{"$error":"#NAME?"}},{"$f":"IF(preencher!#ref!=\"\",\"\",IF(COUNTIF(preencher!#ref!,preencher!#ref!)=0,CONCATENATE(preencher!#ref!,#REF!),preencher!#ref!))","v":{"$error":"#NAME?"}},{"$f":"IF(preencher!#ref!=\"\",\"\",IF(COUNTIF(preencher!#ref!,preencher!#ref!)=0,CONCATENATE(preencher!#ref!,#REF!),preencher!#ref!))","v":{"$error":"#NAME?"}},{"$f":"IF(preencher!#ref!=\"\",\"\",IF(COUNTIF(preencher!#ref!,preencher!#ref!)=0,CONCATENATE(preencher!#ref!,#REF!),preencher!#ref!))","v":{"$error":"#NAME?"}},{"$f":"IF(preencher!#ref!=\"\",\"\",IF(COUNTIF(preencher!#ref!,preencher!#ref!)=0,CONCATENATE(preencher!#ref!,#REF!),preencher!#ref!))","v":{"$error":"#NAME?"}},{"$f":"IF(ISERROR(ROUND(AVERAGE(E41:N41),2)),\"\",ROUND(AVERAGE(E41:N41),2))","v":""},{"$f":"IF(ISERROR(ROUND(O41*D41,2)),\"\",ROUND(O41*D41,2))","v":""},null,null,{"$f":"IF(ISERROR(MEDIAN(E41:N41)),\"\",MEDIAN(E41:N41))","v":""},{"$f":"IF(ISERROR(STDEV(E41:N41)),\"\",STDEV(E41:N41))","v":""},{"$f":"IF(ISERROR(T41/O41),\"\",T41/O41)","v":""}]
[{"$f":"IF(preencher!#ref!=\"\",\"\",preencher!#ref!)","v":{"$error":"#NAME?"}},{"$f":"IF(preencher!#ref!=\"\",\"\",preencher!#ref!)","v":{"$error":"#NAME?"}},{"$f":"IF(preencher!#ref!=\"\",\"\",preencher!#ref!)","v":{"$error":"#NAME?"}},{"$f":"IF(preencher!#ref!=\"\",\"\",preencher!#ref!)","v":{"$error":"#NAME?"}},{"$f":"IF(preencher!#ref!=\"\",\"\",IF(COUNTIF(preencher!#ref!,preencher!#ref!)=0,CONCATENATE(preencher!#ref!,#REF!),preencher!#ref!))","v":{"$error":"#NAME?"}},{"$f":"IF(preencher!#ref!=\"\",\"\",IF(COUNTIF(preencher!#ref!,preencher!#ref!)=0,CONCATENATE(preencher!#ref!,#REF!),preencher!#ref!))","v":{"$error":"#NAME?"}},{"$f":"IF(preencher!#ref!=\"\",\"\",IF(COUNTIF(preencher!#ref!,preencher!#ref!)=0,CONCATENATE(preencher!#ref!,#REF!),preencher!#ref!))","v":{"$error":"#NAME?"}},{"$f":"IF(preencher!#ref!=\"\",\"\",IF(COUNTIF(preencher!#ref!,preencher!#ref!)=0,CONCATENATE(preencher!#ref!,#REF!),preencher!#ref!))","v":{"$error":"#NAME?"}},{"$f":"IF(preencher!#ref!=\"\",\"\",IF(COUNTIF(preencher!#ref!,preencher!#ref!)=0,CONCATENATE(preencher!#ref!,#REF!),preencher!#ref!))","v":{"$error":"#NAME?"}},{"$f":"IF(preencher!#ref!=\"\",\"\",IF(COUNTIF(preencher!#ref!,preencher!#ref!)=0,CONCATENATE(preencher!#ref!,#REF!),preencher!#ref!))","v":{"$error":"#NAME?"}},{"$f":"IF(preencher!#ref!=\"\",\"\",IF(COUNTIF(preencher!#ref!,preencher!#ref!)=0,CONCATENATE(preencher!#ref!,#REF!),preencher!#ref!))","v":{"$error":"#NAME?"}},{"$f":"IF(preencher!#ref!=\"\",\"\",IF(COUNTIF(preencher!#ref!,preencher!#ref!)=0,CONCATENATE(preencher!#ref!,#REF!),preencher!#ref!))","v":{"$error":"#NAME?"}},{"$f":"IF(preencher!#ref!=\"\",\"\",IF(COUNTIF(preencher!#ref!,preencher!#ref!)=0,CONCATENATE(preencher!#ref!,#REF!),preencher!#ref!))","v":{"$error":"#NAME?"}},{"$f":"IF(preencher!#ref!=\"\",\"\",IF(COUNTIF(preencher!#ref!,preencher!#ref!)=0,CONCATENATE(preencher!#ref!,#REF!),preencher!#ref!))","v":{"$error":"#NAME?"}},{"$f":"IF(ISERROR(ROUND(AVERAGE(E42:N42),2)),\"\",ROUND(AVERAGE(E42:N42),2))","v":""},{"$f":"IF(ISERROR(ROUND(O42*D42,2)),\"\",ROUND(O42*D42,2))","v":""},null,null,{"$f":"IF(ISERROR(MEDIAN(E42:N42)),\"\",MEDIAN(E42:N42))","v":""},{"$f":"IF(ISERROR(STDEV(E42:N42)),\"\",STDEV(E42:N42))","v":""},{"$f":"IF(ISERROR(T42/O42),\"\",T42/O42)","v":""}]
[{"$f":"IF(preencher!#ref!=\"\",\"\",preencher!#ref!)","v":{"$error":"#NAME?"}},{"$f":"IF(preencher!#ref!=\"\",\"\",preencher!#ref!)","v":{"$error":"#NAME?"}},{"$f":"IF(preencher!#ref!=\"\",\"\",preencher!#ref!)","v":{"$error":"#NAME?"}},{"$f":"IF(preencher!#ref!=\"\",\"\",preencher!#ref!)","v":{"$error":"#NAME?"}},{"$f":"IF(preencher!#ref!=\"\",\"\",IF(COUNTIF(preencher!#ref!,preencher!#ref!)=0,CONCATENATE(preencher!#ref!,#REF!),preencher!#ref!))","v":{"$error":"#NAME?"}},{"$f":"IF(preencher!#ref!=\"\",\"\",IF(COUNTIF(preencher!#ref!,preencher!#ref!)=0,CONCATENATE(preencher!#ref!,#REF!),preencher!#ref!))","v":{"$error":"#NAME?"}},{"$f":"IF(preencher!#ref!=\"\",\"\",IF(COUNTIF(preencher!#ref!,preencher!#ref!)=0,CONCATENATE(preencher!#ref!,#REF!),preencher!#ref!))","v":{"$error":"#NAME?"}},{"$f":"IF(preencher!#ref!=\"\",\"\",IF(COUNTIF(preencher!#ref!,preencher!#ref!)=0,CONCATENATE(preencher!#ref!,#REF!),preencher!#ref!))","v":{"$error":"#NAME?"}},{"$f":"IF(preencher!#ref!=\"\",\"\",IF(COUNTIF(preencher!#ref!,preencher!#ref!)=0,CONCATENATE(preencher!#ref!,#REF!),preencher!#ref!))","v":{"$error":"#NAME?"}},{"$f":"IF(preencher!#ref!=\"\",\"\",IF(COUNTIF(preencher!#ref!,preencher!#ref!)=0,CONCATENATE(preencher!#ref!,#REF!),preencher!#ref!))","v":{"$error":"#NAME?"}},{"$f":"IF(preencher!#ref!=\"\",\"\",IF(COUNTIF(preencher!#ref!,preencher!#ref!)=0,CONCATENATE(preencher!#ref!,#REF!),preencher!#ref!))","v":{"$error":"#NAME?"}},{"$f":"IF(preencher!#ref!=\"\",\"\",IF(COUNTIF(preencher!#ref!,preencher!#ref!)=0,CONCATENATE(preencher!#ref!,#REF!),preencher!#ref!))","v":{"$error":"#NAME?"}},{"$f":"IF(preencher!#ref!=\"\",\"\",IF(COUNTIF(preencher!#ref!,preencher!#ref!)=0,CONCATENATE(preencher!#ref!,#REF!),preencher!#ref!))","v":{"$error":"#NAME?"}},{"$f":"IF(preencher!#ref!=\"\",\"\",IF(COUNTIF(preencher!#ref!,preencher!#ref!)=0,CONCATENATE(preencher!#ref!,#REF!),preencher!#ref!))","v":{"$error":"#NAME?"}},{"$f":"IF(ISERROR(ROUND(AVERAGE(E43:N43),2)),\"\",ROUND(AVERAGE(E43:N43),2))","v":""},{"$f":"IF(ISERROR(ROUND(O43*D43,2)),\"\",ROUND(O43*D43,2))","v":""},null,null,{"$f":"IF(ISERROR(MEDIAN(E43:N43)),\"\",MEDIAN(E43:N43))","v":""},{"$f":"IF(ISERROR(STDEV(E43:N43)),\"\",STDEV(E43:N43))","v":""},{"$f":"IF(ISERROR(T43/O43),\"\",T43/O43)","v":""}]
[{"$f":"IF(preencher!#ref!=\"\",\"\",preencher!#ref!)","v":{"$error":"#NAME?"}},{"$f":"IF(preencher!#ref!=\"\",\"\",preencher!#ref!)","v":{"$error":"#NAME?"}},{"$f":"IF(preencher!#ref!=\"\",\"\",preencher!#ref!)","v":{"$error":"#NAME?"}},{"$f":"IF(preencher!#ref!=\"\",\"\",preencher!#ref!)","v":{"$error":"#NAME?"}},{"$f":"IF(preencher!#ref!=\"\",\"\",IF(COUNTIF(preencher!#ref!,preencher!#ref!)=0,CONCATENATE(preencher!#ref!,#REF!),preencher!#ref!))","v":{"$error":"#NAME?"}},{"$f":"IF(preencher!#ref!=\"\",\"\",IF(COUNTIF(preencher!#ref!,preencher!#ref!)=0,CONCATENATE(preencher!#ref!,#REF!),preencher!#ref!))","v":{"$error":"#NAME?"}},{"$f":"IF(preencher!#ref!=\"\",\"\",IF(COUNTIF(preencher!#ref!,preencher!#ref!)=0,CONCATENATE(preencher!#ref!,#REF!),preencher!#ref!))","v":{"$error":"#NAME?"}},{"$f":"IF(preencher!#ref!=\"\",\"\",IF(COUNTIF(preencher!#ref!,preencher!#ref!)=0,CONCATENATE(preencher!#ref!,#REF!),preencher!#ref!))","v":{"$error":"#NAME?"}},{"$f":"IF(preencher!#ref!=\"\",\"\",IF(COUNTIF(preencher!#ref!,preencher!#ref!)=0,CONCATENATE(preencher!#ref!,#REF!),preencher!#ref!))","v":{"$error":"#NAME?"}},{"$f":"IF(preencher!#ref!=\"\",\"\",IF(COUNTIF(preencher!#ref!,preencher!#ref!)=0,CONCATENATE(preencher!#ref!,#REF!),preencher!#ref!))","v":{"$error":"#NAME?"}},{"$f":"IF(preencher!#ref!=\"\",\"\",IF(COUNTIF(preencher!#ref!,preencher!#ref!)=0,CONCATENATE(preencher!#ref!,#REF!),preencher!#ref!))","v":{"$error":"#NAME?"}},{"$f":"IF(preencher!#ref!=\"\",\"\",IF(COUNTIF(preencher!#ref!,preencher!#ref!)=0,CONCATENATE(preencher!#ref!,#REF!),preencher!#ref!))","v":{"$error":"#NAME?"}},{"$f":"IF(preencher!#ref!=\"\",\"\",IF(COUNTIF(preencher!#ref!,preencher!#ref!)=0,CONCATENATE(preencher!#ref!,#REF!),preencher!#ref!))","v":{"$error":"#NAME?"}},{"$f":"IF(preencher!#ref!=\"\",\"\",IF(COUNTIF(preencher!#ref!,preencher!#ref!)=0,CONCATENATE(preencher!#ref!,#REF!),preencher!#ref!))","v":{"$error":"#NAME?"}},{"$f":"IF(ISERROR(ROUND(AVERAGE(E44:N44),2)),\"\",ROUND(AVERAGE(E44:N44),2))","v":""},{"$f":"IF(ISERROR(ROUND(O44*D44,2)),\"\",ROUND(O44*D44,2))","v":""},null,null,{"$f":"IF(ISERROR(MEDIAN(E44:N44)),\"\",MEDIAN(E44:N44))","v":""},{"$f":"IF(ISERROR(STDEV(E44:N44)),\"\",STDEV(E44:N44))","v":""},{"$f":"IF(ISERROR(T44/O44),\"\",T44/O44)","v":""}]
[{"$f":"IF(preencher!#ref!=\"\",\"\",preencher!#ref!)","v":{"$error":"#NAME?"}},{"$f":"IF(preencher!#ref!=\"\",\"\",preencher!#ref!)","v":{"$error":"#NAME?"}},{"$f":"IF(preencher!#ref!=\"\",\"\",preencher!#ref!)","v":{"$error":"#NAME?"}},{"$f":"IF(preencher!#ref!=\"\",\"\",preencher!#ref!)","v":{"$error":"#NAME?"}},{"$f":"IF(preencher!#ref!=\"\",\"\",IF(COUNTIF(preencher!#ref!,preencher!#ref!)=0,CONCATENATE(preencher!#ref!,#REF!),preencher!#ref!))","v":{"$error":"#NAME?"}},{"$f":"IF(preencher!#ref!=\"\",\"\",IF(COUNTIF(preencher!#ref!,preencher!#ref!)=0,CONCATENATE(preencher!#ref!,#REF!),preencher!#ref!))","v":{"$error":"#NAME?"}},{"$f":"IF(preencher!#ref!=\"\",\"\",IF(COUNTIF(preencher!#ref!,preencher!#ref!)=0,CONCATENATE(preencher!#ref!,#REF!),preencher!#ref!))","v":{"$error":"#NAME?"}},{"$f":"IF(preencher!#ref!=\"\",\"\",IF(COUNTIF(preencher!#ref!,preencher!#ref!)=0,CONCATENATE(preencher!#ref!,#REF!),preencher!#ref!))","v":{"$error":"#NAME?"}},{"$f":"IF(preencher!#ref!=\"\",\"\",IF(COUNTIF(preencher!#ref!,preencher!#ref!)=0,CONCATENATE(preencher!#ref!,#REF!),preencher!#ref!))","v":{"$error":"#NAME?"}},{"$f":"IF(preencher!#ref!=\"\",\"\",IF(COUNTIF(preencher!#ref!,preencher!#ref!)=0,CONCATENATE(preencher!#ref!,#REF!),preencher!#ref!))","v":{"$error":"#NAME?"}},{"$f":"IF(preencher!#ref!=\"\",\"\",IF(COUNTIF(preencher!#ref!,preencher!#ref!)=0,CONCATENATE(preencher!#ref!,#REF!),preencher!#ref!))","v":{"$error":"#NAME?"}},{"$f":"IF(preencher!#ref!=\"\",\"\",IF(COUNTIF(preencher!#ref!,preencher!#ref!)=0,CONCATENATE(preencher!#ref!,#REF!),preencher!#ref!))","v":{"$error":"#NAME?"}},{"$f":"IF(preencher!#ref!=\"\",\"\",IF(COUNTIF(preencher!#ref!,preencher!#ref!)=0,CONCATENATE(preencher!#ref!,#REF!),preencher!#ref!))","v":{"$error":"#NAME?"}},{"$f":"IF(preencher!#ref!=\"\",\"\",IF(COUNTIF(preencher!#ref!,preencher!#ref!)=0,CONCATENATE(preencher!#ref!,#REF!),preencher!#ref!))","v":{"$error":"#NAME?"}},{"$f":"IF(ISERROR(ROUND(AVERAGE(E45:N45),2)),\"\",ROUND(AVERAGE(E45:N45),2))","v":""},{"$f":"IF(ISERROR(ROUND(O45*D45,2)),\"\",ROUND(O45*D45,2))","v":""},null,null,{"$f":"IF(ISERROR(MEDIAN(E45:N45)),\"\",MEDIAN(E45:N45))","v":""},{"$f":"IF(ISERROR(STDEV(E45:N45)),\"\",STDEV(E45:N45))","v":""},{"$f":"IF(ISERROR(T45/O45),\"\",T45/O45)","v":""}]
[{"$f":"IF(preencher!#ref!=\"\",\"\",preencher!#ref!)","v":{"$error":"#NAME?"}},{"$f":"IF(preencher!#ref!=\"\",\"\",preencher!#ref!)","v":{"$error":"#NAME?"}},{"$f":"IF(preencher!#ref!=\"\",\"\",preencher!#ref!)","v":{"$error":"#NAME?"}},{"$f":"IF(preencher!#ref!=\"\",\"\",preencher!#ref!)","v":{"$error":"#NAME?"}},{"$f":"IF(preencher!#ref!=\"\",\"\",IF(COUNTIF(preencher!#ref!,preencher!#ref!)=0,CONCATENATE(preencher!#ref!,#REF!),preencher!#ref!))","v":{"$error":"#NAME?"}},{"$f":"IF(preencher!#ref!=\"\",\"\",IF(COUNTIF(preencher!#ref!,preencher!#ref!)=0,CONCATENATE(preencher!#ref!,#REF!),preencher!#ref!))","v":{"$error":"#NAME?"}},{"$f":"IF(preencher!#ref!=\"\",\"\",IF(COUNTIF(preencher!#ref!,preencher!#ref!)=0,CONCATENATE(preencher!#ref!,#REF!),preencher!#ref!))","v":{"$error":"#NAME?"}},{"$f":"IF(preencher!#ref!=\"\",\"\",IF(COUNTIF(preencher!#ref!,preencher!#ref!)=0,CONCATENATE(preencher!#ref!,#REF!),preencher!#ref!))","v":{"$error":"#NAME?"}},{"$f":"IF(preencher!#ref!=\"\",\"\",IF(COUNTIF(preencher!#ref!,preencher!#ref!)=0,CONCATENATE(preencher!#ref!,#REF!),preencher!#ref!))","v":{"$error":"#NAME?"}},{"$f":"IF(preencher!#ref!=\"\",\"\",IF(COUNTIF(preencher!#ref!,preencher!#ref!)=0,CONCATENATE(preencher!#ref!,#REF!),preencher!#ref!))","v":{"$error":"#NAME?"}},{"$f":"IF(preencher!#ref!=\"\",\"\",IF(COUNTIF(preencher!#ref!,preencher!#ref!)=0,CONCATENATE(preencher!#ref!,#REF!),preencher!#ref!))","v":{"$error":"#NAME?"}},{"$f":"IF(preencher!#ref!=\"\",\"\",IF(COUNTIF(preencher!#ref!,preencher!#ref!)=0,CONCATENATE(preencher!#ref!,#REF!),preencher!#ref!))","v":{"$error":"#NAME?"}},{"$f":"IF(preencher!#ref!=\"\",\"\",IF(COUNTIF(preencher!#ref!,preencher!#ref!)=0,CONCATENATE(preencher!#ref!,#REF!),preencher!#ref!))","v":{"$error":"#NAME?"}},{"$f":"IF(preencher!#ref!=\"\",\"\",IF(COUNTIF(preencher!#ref!,preencher!#ref!)=0,CONCATENATE(preencher!#ref!,#REF!),preencher!#ref!))","v":{"$error":"#NAME?"}},{"$f":"IF(ISERROR(ROUND(AVERAGE(E46:N46),2)),\"\",ROUND(AVERAGE(E46:N46),2))","v":""},{"$f":"IF(ISERROR(ROUND(O46*D46,2)),\"\",ROUND(O46*D46,2))","v":""},null,null,{"$f":"IF(ISERROR(MEDIAN(E46:N46)),\"\",MEDIAN(E46:N46))","v":""},{"$f":"IF(ISERROR(STDEV(E46:N46)),\"\",STDEV(E46:N46))","v":""},{"$f":"IF(ISERROR(T46/O46),\"\",T46/O46)","v":""}]
[{"$f":"IF(preencher!#ref!=\"\",\"\",preencher!#ref!)","v":{"$error":"#NAME?"}},{"$f":"IF(preencher!#ref!=\"\",\"\",preencher!#ref!)","v":{"$error":"#NAME?"}},{"$f":"IF(preencher!#ref!=\"\",\"\",preencher!#ref!)","v":{"$error":"#NAME?"}},{"$f":"IF(preencher!#ref!=\"\",\"\",preencher!#ref!)","v":{"$error":"#NAME?"}},{"$f":"IF(preencher!#ref!=\"\",\"\",IF(COUNTIF(preencher!#ref!,preencher!#ref!)=0,CONCATENATE(preencher!#ref!,#REF!),preencher!#ref!))","v":{"$error":"#NAME?"}},{"$f":"IF(preencher!#ref!=\"\",\"\",IF(COUNTIF(preencher!#ref!,preencher!#ref!)=0,CONCATENATE(preencher!#ref!,#REF!),preencher!#ref!))","v":{"$error":"#NAME?"}},{"$f":"IF(preencher!#ref!=\"\",\"\",IF(COUNTIF(preencher!#ref!,preencher!#ref!)=0,CONCATENATE(preencher!#ref!,#REF!),preencher!#ref!))","v":{"$error":"#NAME?"}},{"$f":"IF(preencher!#ref!=\"\",\"\",IF(COUNTIF(preencher!#ref!,preencher!#ref!)=0,CONCATENATE(preencher!#ref!,#REF!),preencher!#ref!))","v":{"$error":"#NAME?"}},{"$f":"IF(preencher!#ref!=\"\",\"\",IF(COUNTIF(preencher!#ref!,preencher!#ref!)=0,CONCATENATE(preencher!#ref!,#REF!),preencher!#ref!))","v":{"$error":"#NAME?"}},{"$f":"IF(preencher!#ref!=\"\",\"\",IF(COUNTIF(preencher!#ref!,preencher!#ref!)=0,CONCATENATE(preencher!#ref!,#REF!),preencher!#ref!))","v":{"$error":"#NAME?"}},{"$f":"IF(preencher!#ref!=\"\",\"\",IF(COUNTIF(preencher!#ref!,preencher!#ref!)=0,CONCATENATE(preencher!#ref!,#REF!),preencher!#ref!))","v":{"$error":"#NAME?"}},{"$f":"IF(preencher!#ref!=\"\",\"\",IF(COUNTIF(preencher!#ref!,preencher!#ref!)=0,CONCATENATE(preencher!#ref!,#REF!),preencher!#ref!))","v":{"$error":"#NAME?"}},{"$f":"IF(preencher!#ref!=\"\",\"\",IF(COUNTIF(preencher!#ref!,preencher!#ref!)=0,CONCATENATE(preencher!#ref!,#REF!),preencher!#ref!))","v":{"$error":"#NAME?"}},{"$f":"IF(preencher!#ref!=\"\",\"\",IF(COUNTIF(preencher!#ref!,preencher!#ref!)=0,CONCATENATE(preencher!#ref!,#REF!),preencher!#ref!))","v":{"$error":"#NAME?"}},{"$f":"IF(ISERROR(ROUND(AVERAGE(E47:N47),2)),\"\",ROUND(AVERAGE(E47:N47),2))","v":""},{"$f":"IF(ISERROR(ROUND(O47*D47,2)),\"\",ROUND(O47*D47,2))","v":""},null,null,{"$f":"IF(ISERROR(MEDIAN(E47:N47)),\"\",MEDIAN(E47:N47))","v":""},{"$f":"IF(ISERROR(STDEV(E47:N47)),\"\",STDEV(E47:N47))","v":""},{"$f":"IF(ISERROR(T47/O47),\"\",T47/O47)","v":""}]
[{"$f":"IF(preencher!#ref!=\"\",\"\",preencher!#ref!)","v":{"$error":"#NAME?"}},{"$f":"IF(preencher!#ref!=\"\",\"\",preencher!#ref!)","v":{"$error":"#NAME?"}},{"$f":"IF(preencher!#ref!=\"\",\"\",preencher!#ref!)","v":{"$error":"#NAME?"}},{"$f":"IF(preencher!#ref!=\"\",\"\",preencher!#ref!)","v":{"$error":"#NAME?"}},{"$f":"IF(preencher!#ref!=\"\",\"\",IF(COUNTIF(preencher!#ref!,preencher!#ref!)=0,CONCATENATE(preencher!#ref!,#REF!),preencher!#ref!))","v":{"$error":"#NAME?"}},{"$f":"IF(preencher!#ref!=\"\",\"\",IF(COUNTIF(preencher!#ref!,preencher!#ref!)=0,CONCATENATE(preencher!#ref!,#REF!),preencher!#ref!))","v":{"$error":"#NAME?"}},{"$f":"IF(preencher!#ref!=\"\",\"\",IF(COUNTIF(preencher!#ref!,preencher!#ref!)=0,CONCATENATE(preencher!#ref!,#REF!),preencher!#ref!))","v":{"$error":"#NAME?"}},{"$f":"IF(preencher!#ref!=\"\",\"\",IF(COUNTIF(preencher!#ref!,preencher!#ref!)=0,CONCATENATE(preencher!#ref!,#REF!),preencher!#ref!))","v":{"$error":"#NAME?"}},{"$f":"IF(preencher!#ref!=\"\",\"\",IF(COUNTIF(preencher!#ref!,preencher!#ref!)=0,CONCATENATE(preencher!#ref!,#REF!),preencher!#ref!))","v":{"$error":"#NAME?"}},{"$f":"IF(preencher!#ref!=\"\",\"\",IF(COUNTIF(preencher!#ref!,preencher!#ref!)=0,CONCATENATE(preencher!#ref!,#REF!),preencher!#ref!))","v":{"$error":"#NAME?"}},{"$f":"IF(preencher!#ref!=\"\",\"\",IF(COUNTIF(preencher!#ref!,preencher!#ref!)=0,CONCATENATE(preencher!#ref!,#REF!),preencher!#ref!))","v":{"$error":"#NAME?"}},{"$f":"IF(preencher!#ref!=\"\",\"\",IF(COUNTIF(preencher!#ref!,preencher!#ref!)=0,CONCATENATE(preencher!#ref!,#REF!),preencher!#ref!))","v":{"$error":"#NAME?"}},{"$f":"IF(preencher!#ref!=\"\",\"\",IF(COUNTIF(preencher!#ref!,preencher!#ref!)=0,CONCATENATE(preencher!#ref!,#REF!),preencher!#ref!))","v":{"$error":"#NAME?"}},{"$f":"IF(preencher!#ref!=\"\",\"\",IF(COUNTIF(preencher!#ref!,preencher!#ref!)=0,CONCATENATE(preencher!#ref!,#REF!),preencher!#ref!))","v":{"$error":"#NAME?"}},{"$f":"IF(ISERROR(ROUND(AVERAGE(E48:N48),2)),\"\",ROUND(AVERAGE(E48:N48),2))","v":""},{"$f":"IF(ISERROR(ROUND(O48*D48,2)),\"\",ROUND(O48*D48,2))","v":""},null,null,{"$f":"IF(ISERROR(MEDIAN(E48:N48)),\"\",MEDIAN(E48:N48))","v":""},{"$f":"IF(ISERROR(STDEV(E48:N48)),\"\",STDEV(E48:N48))","v":""},{"$f":"IF(ISERROR(T48/O48),\"\",T48/O48)","v":""}]
[{"$f":"IF(preencher!#ref!=\"\",\"\",preencher!#ref!)","v":{"$error":"#NAME?"}},{"$f":"IF(preencher!#ref!=\"\",\"\",preencher!#ref!)","v":{"$error":"#NAME?"}},{"$f":"IF(preencher!#ref!=\"\",\"\",preencher!#ref!)","v":{"$error":"#NAME?"}},{"$f":"IF(preencher!#ref!=\"\",\"\",preencher!#ref!)","v":{"$error":"#NAME?"}},{"$f":"IF(preencher!#ref!=\"\",\"\",IF(COUNTIF(preencher!#ref!,preencher!#ref!)=0,CONCATENATE(preencher!#ref!,#REF!),preencher!#ref!))","v":{"$error":"#NAME?"}},{"$f":"IF(preencher!#ref!=\"\",\"\",IF(COUNTIF(preencher!#ref!,preencher!#ref!)=0,CONCATENATE(preencher!#ref!,#REF!),preencher!#ref!))","v":{"$error":"#NAME?"}},{"$f":"IF(preencher!#ref!=\"\",\"\",IF(COUNTIF(preencher!#ref!,preencher!#ref!)=0,CONCATENATE(preencher!#ref!,#REF!),preencher!#ref!))","v":{"$error":"#NAME?"}},{"$f":"IF(preencher!#ref!=\"\",\"\",IF(COUNTIF(preencher!#ref!,preencher!#ref!)=0,CONCATENATE(preencher!#ref!,#REF!),preencher!#ref!))","v":{"$error":"#NAME?"}},{"$f":"IF(preencher!#ref!=\"\",\"\",IF(COUNTIF(preencher!#ref!,preencher!#ref!)=0,CONCATENATE(preencher!#ref!,#REF!),preencher!#ref!))","v":{"$error":"#NAME?"}},{"$f":"IF(preencher!#ref!=\"\",\"\",IF(COUNTIF(preencher!#ref!,preencher!#ref!)=0,CONCATENATE(preencher!#ref!,#REF!),preencher!#ref!))","v":{"$error":"#NAME?"}},{"$f":"IF(preencher!#ref!=\"\",\"\",IF(COUNTIF(preencher!#ref!,preencher!#ref!)=0,CONCATENATE(preencher!#ref!,#REF!),preencher!#ref!))","v":{"$error":"#NAME?"}},{"$f":"IF(preencher!#ref!=\"\",\"\",IF(COUNTIF(preencher!#ref!,preencher!#ref!)=0,CONCATENATE(preencher!#ref!,#REF!),preencher!#ref!))","v":{"$error":"#NAME?"}},{"$f":"IF(preencher!#ref!=\"\",\"\",IF(COUNTIF(preencher!#ref!,preencher!#ref!)=0,CONCATENATE(preencher!#ref!,#REF!),preencher!#ref!))","v":{"$error":"#NAME?"}},{"$f":"IF(preencher!#ref!=\"\",\"\",IF(COUNTIF(preencher!#ref!,preencher!#ref!)=0,CONCATENATE(preencher!#ref!,#REF!),preencher!#ref!))","v":{"$error":"#NAME?"}},{"$f":"IF(ISERROR(ROUND(AVERAGE(E49:N49),2)),\"\",ROUND(AVERAGE(E49:N49),2))","v":""},{"$f":"IF(ISERROR(ROUND(O49*D49,2)),\"\",ROUND(O49*D49,2))","v":""},null,null,{"$f":"IF(ISERROR(MEDIAN(E49:N49)),\"\",MEDIAN(E49:N49))","v":""},{"$f":"IF(ISERROR(STDEV(E49:N49)),\"\",STDEV(E49:N49))","v":""},{"$f":"IF(ISERROR(T49/O49),\"\",T49/O49)","v":""}]
[{"$f":"IF(preencher!#ref!=\"\",\"\",preencher!#ref!)","v":{"$error":"#NAME?"}},{"$f":"IF(preencher!#ref!=\"\",\"\",preencher!#ref!)","v":{"$error":"#NAME?"}},{"$f":"IF(preencher!#ref!=\"\",\"\",preencher!#ref!)","v":{"$error":"#NAME?"}},{"$f":"IF(preencher!#ref!=\"\",\"\",preencher!#ref!)","v":{"$error":"#NAME?"}},{"$f":"IF(preencher!#ref!=\"\",\"\",IF(COUNTIF(preencher!#ref!,preencher!#ref!)=0,CONCATENATE(preencher!#ref!,#REF!),preencher!#ref!))","v":{"$error":"#NAME?"}},{"$f":"IF(preencher!#ref!=\"\",\"\",IF(COUNTIF(preencher!#ref!,preencher!#ref!)=0,CONCATENATE(preencher!#ref!,#REF!),preencher!#ref!))","v":{"$error":"#NAME?"}},{"$f":"IF(preencher!#ref!=\"\",\"\",IF(COUNTIF(preencher!#ref!,preencher!#ref!)=0,CONCATENATE(preencher!#ref!,#REF!),preencher!#ref!))","v":{"$error":"#NAME?"}},{"$f":"IF(preencher!#ref!=\"\",\"\",IF(COUNTIF(preencher!#ref!,preencher!#ref!)=0,CONCATENATE(preencher!#ref!,#REF!),preencher!#ref!))","v":{"$error":"#NAME?"}},{"$f":"IF(preencher!#ref!=\"\",\"\",IF(COUNTIF(preencher!#ref!,preencher!#ref!)=0,CONCATENATE(preencher!#ref!,#REF!),preencher!#ref!))","v":{"$error":"#NAME?"}},{"$f":"IF(preencher!#ref!=\"\",\"\",IF(COUNTIF(preencher!#ref!,preencher!#ref!)=0,CONCATENATE(preencher!#ref!,#REF!),preencher!#ref!))","v":{"$error":"#NAME?"}},{"$f":"IF(preencher!#ref!=\"\",\"\",IF(COUNTIF(preencher!#ref!,preencher!#ref!)=0,CONCATENATE(preencher!#ref!,#REF!),preencher!#ref!))","v":{"$error":"#NAME?"}},{"$f":"IF(preencher!#ref!=\"\",\"\",IF(COUNTIF(preencher!#ref!,preencher!#ref!)=0,CONCATENATE(preencher!#ref!,#REF!),preencher!#ref!))","v":{"$error":"#NAME?"}},{"$f":"IF(preencher!#ref!=\"\",\"\",IF(COUNTIF(preencher!#ref!,preencher!#ref!)=0,CONCATENATE(preencher!#ref!,#REF!),preencher!#ref!))","v":{"$error":"#NAME?"}},{"$f":"IF(preencher!#ref!=\"\",\"\",IF(COUNTIF(preencher!#ref!,preencher!#ref!)=0,CONCATENATE(preencher!#ref!,#REF!),preencher!#ref!))","v":{"$error":"#NAME?"}},{"$f":"IF(ISERROR(ROUND(AVERAGE(E50:N50),2)),\"\",ROUND(AVERAGE(E50:N50),2))","v":""},{"$f":"IF(ISERROR(ROUND(O50*D50,2)),\"\",ROUND(O50*D50,2))","v":""},null,null,{"$f":"IF(ISERROR(MEDIAN(E50:N50)),\"\",MEDIAN(E50:N50))","v":""},{"$f":"IF(ISERROR(STDEV(E50:N50)),\"\",STDEV(E50:N50))","v":""},{"$f":"IF(ISERROR(T50/O50),\"\",T50/O50)","v":""}]
[{"$f":"IF(preencher!#ref!=\"\",\"\",preencher!#ref!)","v":{"$error":"#NAME?"}},{"$f":"IF(preencher!#ref!=\"\",\"\",preencher!#ref!)","v":{"$error":"#NAME?"}},{"$f":"IF(preencher!#ref!=\"\",\"\",preencher!#ref!)","v":{"$error":"#NAME?"}},{"$f":"IF(preencher!#ref!=\"\",\"\",preencher!#ref!)","v":{"$error":"#NAME?"}},{"$f":"IF(preencher!#ref!=\"\",\"\",IF(COUNTIF(preencher!#ref!,preencher!#ref!)=0,CONCATENATE(preencher!#ref!,#REF!),preencher!#ref!))","v":{"$error":"#NAME?"}},{"$f":"IF(preencher!#ref!=\"\",\"\",IF(COUNTIF(preencher!#ref!,preencher!#ref!)=0,CONCATENATE(preencher!#ref!,#REF!),preencher!#ref!))","v":{"$error":"#NAME?"}},{"$f":"IF(preencher!#ref!=\"\",\"\",IF(COUNTIF(preencher!#ref!,preencher!#ref!)=0,CONCATENATE(preencher!#ref!,#REF!),preencher!#ref!))","v":{"$error":"#NAME?"}},{"$f":"IF(preencher!#ref!=\"\",\"\",IF(COUNTIF(preencher!#ref!,preencher!#ref!)=0,CONCATENATE(preencher!#ref!,#REF!),preencher!#ref!))","v":{"$error":"#NAME?"}},{"$f":"IF(preencher!#ref!=\"\",\"\",IF(COUNTIF(preencher!#ref!,preencher!#ref!)=0,CONCATENATE(preencher!#ref!,#REF!),preencher!#ref!))","v":{"$error":"#NAME?"}},{"$f":"IF(preencher!#ref!=\"\",\"\",IF(COUNTIF(preencher!#ref!,preencher!#ref!)=0,CONCATENATE(preencher!#ref!,#REF!),preencher!#ref!))","v":{"$error":"#NAME?"}},{"$f":"IF(preencher!#ref!=\"\",\"\",IF(COUNTIF(preencher!#ref!,preencher!#ref!)=0,CONCATENATE(preencher!#ref!,#REF!),preencher!#ref!))","v":{"$error":"#NAME?"}},{"$f":"IF(preencher!#ref!=\"\",\"\",IF(COUNTIF(preencher!#ref!,preencher!#ref!)=0,CONCATENATE(preencher!#ref!,#REF!),preencher!#ref!))","v":{"$error":"#NAME?"}},{"$f":"IF(preencher!#ref!=\"\",\"\",IF(COUNTIF(preencher!#ref!,preencher!#ref!)=0,CONCATENATE(preencher!#ref!,#REF!),preencher!#ref!))","v":{"$error":"#NAME?"}},{"$f":"IF(preencher!#ref!=\"\",\"\",IF(COUNTIF(preencher!#ref!,preencher!#ref!)=0,CONCATENATE(preencher!#ref!,#REF!),preencher!#ref!))","v":{"$error":"#NAME?"}},{"$f":"IF(ISERROR(ROUND(AVERAGE(E51:N51),2)),\"\",ROUND(AVERAGE(E51:N51),2))","v":""},{"$f":"IF(ISERROR(ROUND(O51*D51,2)),\"\",ROUND(O51*D51,2))","v":""},null,null,{"$f":"IF(ISERROR(MEDIAN(E51:N51)),\"\",MEDIAN(E51:N51))","v":""},{"$f":"IF(ISERROR(STDEV(E51:N51)),\"\",STDEV(E51:N51))","v":""},{"$f":"IF(ISERROR(T51/O51),\"\",T51/O51)","v":""}]
[{"$f":"IF(preencher!#ref!=\"\",\"\",preencher!#ref!)","v":{"$error":"#NAME?"}},{"$f":"IF(preencher!#ref!=\"\",\"\",preencher!#ref!)","v":{"$error":"#NAME?"}},{"$f":"IF(preencher!#ref!=\"\",\"\",preencher!#ref!)","v":{"$error":"#NAME?"}},{"$f":"IF(preencher!#ref!=\"\",\"\",preencher!#ref!)","v":{"$error":"#NAME?"}},{"$f":"IF(preencher!#ref!=\"\",\"\",IF(COUNTIF(preencher!#ref!,preencher!#ref!)=0,CONCATENATE(preencher!#ref!,#REF!),preencher!#ref!))","v":{"$error":"#NAME?"}},{"$f":"IF(preencher!#ref!=\"\",\"\",IF(COUNTIF(preencher!#ref!,preencher!#ref!)=0,CONCATENATE(preencher!#ref!,#REF!),preencher!#ref!))","v":{"$error":"#NAME?"}},{"$f":"IF(preencher!#ref!=\"\",\"\",IF(COUNTIF(preencher!#ref!,preencher!#ref!)=0,CONCATENATE(preencher!#ref!,#REF!),preencher!#ref!))","v":{"$error":"#NAME?"}},{"$f":"IF(preencher!#ref!=\"\",\"\",IF(COUNTIF(preencher!#ref!,preencher!#ref!)=0,CONCATENATE(preencher!#ref!,#REF!),preencher!#ref!))","v":{"$error":"#NAME?"}},{"$f":"IF(preencher!#ref!=\"\",\"\",IF(COUNTIF(preencher!#ref!,preencher!#ref!)=0,CONCATENATE(preencher!#ref!,#REF!),preencher!#ref!))","v":{"$error":"#NAME?"}},{"$f":"IF(preencher!#ref!=\"\",\"\",IF(COUNTIF(preencher!#ref!,preencher!#ref!)=0,CONCATENATE(preencher!#ref!,#REF!),preencher!#ref!))","v":{"$error":"#NAME?"}},{"$f":"IF(preencher!#ref!=\"\",\"\",IF(COUNTIF(preencher!#ref!,preencher!#ref!)=0,CONCATENATE(preencher!#ref!,#REF!),preencher!#ref!))","v":{"$error":"#NAME?"}},{"$f":"IF(preencher!#ref!=\"\",\"\",IF(COUNTIF(preencher!#ref!,preencher!#ref!)=0,CONCATENATE(preencher!#ref!,#REF!),preencher!#ref!))","v":{"$error":"#NAME?"}},{"$f":"IF(preencher!#ref!=\"\",\"\",IF(COUNTIF(preencher!#ref!,preencher!#ref!)=0,CONCATENATE(preencher!#ref!,#REF!),preencher!#ref!))","v":{"$error":"#NAME?"}},{"$f":"IF(preencher!#ref!=\"\",\"\",IF(COUNTIF(preencher!#ref!,preencher!#ref!)=0,CONCATENATE(preencher!#ref!,#REF!),preencher!#ref!))","v":{"$error":"#NAME?"}},{"$f":"IF(ISERROR(ROUND(AVERAGE(E52:N52),2)),\"\",ROUND(AVERAGE(E52:N52),2))","v":""},{"$f":"IF(ISERROR(ROUND(O52*D52,2)),\"\",ROUND(O52*D52,2))","v":""},null,null,{"$f":"IF(ISERROR(MEDIAN(E52:N52)),\"\",MEDIAN(E52:N52))","v":""},{"$f":"IF(ISERROR(STDEV(E52:N52)),\"\",STDEV(E52:N52))","v":""},{"$f":"IF(ISERROR(T52/O52),\"\",T52/O52)","v":""}]
[{"$f":"IF(preencher!#ref!=\"\",\"\",preencher!#ref!)","v":{"$error":"#NAME?"}},{"$f":"IF(preencher!#ref!=\"\",\"\",preencher!#ref!)","v":{"$error":"#NAME?"}},{"$f":"IF(preencher!#ref!=\"\",\"\",preencher!#ref!)","v":{"$error":"#NAME?"}},{"$f":"IF(preencher!#ref!=\"\",\"\",preencher!#ref!)","v":{"$error":"#NAME?"}},{"$f":"IF(preencher!#ref!=\"\",\"\",IF(COUNTIF(preencher!#ref!,preencher!#ref!)=0,CONCATENATE(preencher!#ref!,#REF!),preencher!#ref!))","v":{"$error":"#NAME?"}},{"$f":"IF(preencher!#ref!=\"\",\"\",IF(COUNTIF(preencher!#ref!,preencher!#ref!)=0,CONCATENATE(preencher!#ref!,#REF!),preencher!#ref!))","v":{"$error":"#NAME?"}},{"$f":"IF(preencher!#ref!=\"\",\"\",IF(COUNTIF(preencher!#ref!,preencher!#ref!)=0,CONCATENATE(preencher!#ref!,#REF!),preencher!#ref!))","v":{"$error":"#NAME?"}},{"$f":"IF(preencher!#ref!=\"\",\"\",IF(COUNTIF(preencher!#ref!,preencher!#ref!)=0,CONCATENATE(preencher!#ref!,#REF!),preencher!#ref!))","v":{"$error":"#NAME?"}},{"$f":"IF(preencher!#ref!=\"\",\"\",IF(COUNTIF(preencher!#ref!,preencher!#ref!)=0,CONCATENATE(preencher!#ref!,#REF!),preencher!#ref!))","v":{"$error":"#NAME?"}},{"$f":"IF(preencher!#ref!=\"\",\"\",IF(COUNTIF(preencher!#ref!,preencher!#ref!)=0,CONCATENATE(preencher!#ref!,#REF!),preencher!#ref!))","v":{"$error":"#NAME?"}},{"$f":"IF(preencher!#ref!=\"\",\"\",IF(COUNTIF(preencher!#ref!,preencher!#ref!)=0,CONCATENATE(preencher!#ref!,#REF!),preencher!#ref!))","v":{"$error":"#NAME?"}},{"$f":"IF(preencher!#ref!=\"\",\"\",IF(COUNTIF(preencher!#ref!,preencher!#ref!)=0,CONCATENATE(preencher!#ref!,#REF!),preencher!#ref!))","v":{"$error":"#NAME?"}},{"$f":"IF(preencher!#ref!=\"\",\"\",IF(COUNTIF(preencher!#ref!,preencher!#ref!)=0,CONCATENATE(preencher!#ref!,#REF!),preencher!#ref!))","v":{"$error":"#NAME?"}},{"$f":"IF(preencher!#ref!=\"\",\"\",IF(COUNTIF(preencher!#ref!,preencher!#ref!)=0,CONCATENATE(preencher!#ref!,#REF!),preencher!#ref!))","v":{"$error":"#NAME?"}},{"$f":"IF(ISERROR(ROUND(AVERAGE(E53:N53),2)),\"\",ROUND(AVERAGE(E53:N53),2))","v":""},{"$f":"IF(ISERROR(ROUND(O53*D53,2)),\"\",ROUND(O53*D53,2))","v":""},null,null,{"$f":"IF(ISERROR(MEDIAN(E53:N53)),\"\",MEDIAN(E53:N53))","v":""},{"$f":"IF(ISERROR(STDEV(E53:N53)),\"\",STDEV(E53:N53))","v":""},{"$f":"IF(ISERROR(T53/O53),\"\",T53/O53)","v":""}]
[{"$f":"IF(preencher!#ref!=\"\",\"\",preencher!#ref!)","v":{"$error":"#NAME?"}},{"$f":"IF(preencher!#ref!=\"\",\"\",preencher!#ref!)","v":{"$error":"#NAME?"}},{"$f":"IF(preencher!#ref!=\"\",\"\",preencher!#ref!)","v":{"$error":"#NAME?"}},{"$f":"IF(preencher!#ref!=\"\",\"\",preencher!#ref!)","v":{"$error":"#NAME?"}},{"$f":"IF(preencher!#ref!=\"\",\"\",IF(COUNTIF(preencher!#ref!,preencher!#ref!)=0,CONCATENATE(preencher!#ref!,#REF!),preencher!#ref!))","v":{"$error":"#NAME?"}},{"$f":"IF(preencher!#ref!=\"\",\"\",IF(COUNTIF(preencher!#ref!,preencher!#ref!)=0,CONCATENATE(preencher!#ref!,#REF!),preencher!#ref!))","v":{"$error":"#NAME?"}},{"$f":"IF(preencher!#ref!=\"\",\"\",IF(COUNTIF(preencher!#ref!,preencher!#ref!)=0,CONCATENATE(preencher!#ref!,#REF!),preencher!#ref!))","v":{"$error":"#NAME?"}},{"$f":"IF(preencher!#ref!=\"\",\"\",IF(COUNTIF(preencher!#ref!,preencher!#ref!)=0,CONCATENATE(preencher!#ref!,#REF!),preencher!#ref!))","v":{"$error":"#NAME?"}},{"$f":"IF(preencher!#ref!=\"\",\"\",IF(COUNTIF(preencher!#ref!,preencher!#ref!)=0,CONCATENATE(preencher!#ref!,#REF!),preencher!#ref!))","v":{"$error":"#NAME?"}},{"$f":"IF(preencher!#ref!=\"\",\"\",IF(COUNTIF(preencher!#ref!,preencher!#ref!)=0,CONCATENATE(preencher!#ref!,#REF!),preencher!#ref!))","v":{"$error":"#NAME?"}},{"$f":"IF(preencher!#ref!=\"\",\"\",IF(COUNTIF(preencher!#ref!,preencher!#ref!)=0,CONCATENATE(preencher!#ref!,#REF!),preencher!#ref!))","v":{"$error":"#NAME?"}},{"$f":"IF(preencher!#ref!=\"\",\"\",IF(COUNTIF(preencher!#ref!,preencher!#ref!)=0,CONCATENATE(preencher!#ref!,#REF!),preencher!#ref!))","v":{"$error":"#NAME?"}},{"$f":"IF(preencher!#ref!=\"\",\"\",IF(COUNTIF(preencher!#ref!,preencher!#ref!)=0,CONCATENATE(preencher!#ref!,#REF!),preencher!#ref!))","v":{"$error":"#NAME?"}},{"$f":"IF(preencher!#ref!=\"\",\"\",IF(COUNTIF(preencher!#ref!,preencher!#ref!)=0,CONCATENATE(preencher!#ref!,#REF!),preencher!#ref!))","v":{"$error":"#NAME?"}},{"$f":"IF(ISERROR(ROUND(AVERAGE(E54:N54),2)),\"\",ROUND(AVERAGE(E54:N54),2))","v":""},{"$f":"IF(ISERROR(ROUND(O54*D54,2)),\"\",ROUND(O54*D54,2))","v":""},null,null,{"$f":"IF(ISERROR(MEDIAN(E54:N54)),\"\",MEDIAN(E54:N54))","v":""},{"$f":"IF(ISERROR(STDEV(E54:N54)),\"\",STDEV(E54:N54))","v":""},{"$f":"IF(ISERROR(T54/O54),\"\",T54/O54)","v":""}]
[{"$f":"IF(preencher!#ref!=\"\",\"\",preencher!#ref!)","v":{"$error":"#NAME?"}},{"$f":"IF(preencher!#ref!=\"\",\"\",preencher!#ref!)","v":{"$error":"#NAME?"}},{"$f":"IF(preencher!#ref!=\"\",\"\",preencher!#ref!)","v":{"$error":"#NAME?"}},{"$f":"IF(preencher!#ref!=\"\",\"\",preencher!#ref!)","v":{"$error":"#NAME?"}},{"$f":"IF(preencher!#ref!=\"\",\"\",IF(COUNTIF(preencher!#ref!,preencher!#ref!)=0,CONCATENATE(preencher!#ref!,#REF!),preencher!#ref!))","v":{"$error":"#NAME?"}},{"$f":"IF(preencher!#ref!=\"\",\"\",IF(COUNTIF(preencher!#ref!,preencher!#ref!)=0,CONCATENATE(preencher!#ref!,#REF!),preencher!#ref!))","v":{"$error":"#NAME?"}},{"$f":"IF(preencher!#ref!=\"\",\"\",IF(COUNTIF(preencher!#ref!,preencher!#ref!)=0,CONCATENATE(preencher!#ref!,#REF!),preencher!#ref!))","v":{"$error":"#NAME?"}},{"$f":"IF(preencher!#ref!=\"\",\"\",IF(COUNTIF(preencher!#ref!,preencher!#ref!)=0,CONCATENATE(preencher!#ref!,#REF!),preencher!#ref!))","v":{"$error":"#NAME?"}},{"$f":"IF(preencher!#ref!=\"\",\"\",IF(COUNTIF(preencher!#ref!,preencher!#ref!)=0,CONCATENATE(preencher!#ref!,#REF!),preencher!#ref!))","v":{"$error":"#NAME?"}},{"$f":"IF(preencher!#ref!=\"\",\"\",IF(COUNTIF(preencher!#ref!,preencher!#ref!)=0,CONCATENATE(preencher!#ref!,#REF!),preencher!#ref!))","v":{"$error":"#NAME?"}},{"$f":"IF(preencher!#ref!=\"\",\"\",IF(COUNTIF(preencher!#ref!,preencher!#ref!)=0,CONCATENATE(preencher!#ref!,#REF!),preencher!#ref!))","v":{"$error":"#NAME?"}},{"$f":"IF(preencher!#ref!=\"\",\"\",IF(COUNTIF(preencher!#ref!,preencher!#ref!)=0,CONCATENATE(preencher!#ref!,#REF!),preencher!#ref!))","v":{"$error":"#NAME?"}},{"$f":"IF(preencher!#ref!=\"\",\"\",IF(COUNTIF(preencher!#ref!,preencher!#ref!)=0,CONCATENATE(preencher!#ref!,#REF!),preencher!#ref!))","v":{"$error":"#NAME?"}},{"$f":"IF(preencher!#ref!=\"\",\"\",IF(COUNTIF(preencher!#ref!,preencher!#ref!)=0,CONCATENATE(preencher!#ref!,#REF!),preencher!#ref!))","v":{"$error":"#NAME?"}},{"$f":"IF(ISERROR(ROUND(AVERAGE(E55:N55),2)),\"\",ROUND(AVERAGE(E55:N55),2))","v":""},{"$f":"IF(ISERROR(ROUND(O55*D55,2)),\"\",ROUND(O55*D55,2))","v":""},null,null,{"$f":"IF(ISERROR(MEDIAN(E55:N55)),\"\",MEDIAN(E55:N55))","v":""},{"$f":"IF(ISERROR(STDEV(E55:N55)),\"\",STDEV(E55:N55))","v":""},{"$f":"IF(ISERROR(T55/O55),\"\",T55/O55)","v":""}]
[{"$f":"IF(preencher!#ref!=\"\",\"\",preencher!#ref!)","v":{"$error":"#NAME?"}},{"$f":"IF(preencher!#ref!=\"\",\"\",preencher!#ref!)","v":{"$error":"#NAME?"}},{"$f":"IF(preencher!#ref!=\"\",\"\",preencher!#ref!)","v":{"$error":"#NAME?"}},{"$f":"IF(preencher!#ref!=\"\",\"\",preencher!#ref!)","v":{"$error":"#NAME?"}},{"$f":"IF(preencher!#ref!=\"\",\"\",IF(COUNTIF(preencher!#ref!,preencher!#ref!)=0,CONCATENATE(preencher!#ref!,#REF!),preencher!#ref!))","v":{"$error":"#NAME?"}},{"$f":"IF(preencher!#ref!=\"\",\"\",IF(COUNTIF(preencher!#ref!,preencher!#ref!)=0,CONCATENATE(preencher!#ref!,#REF!),preencher!#ref!))","v":{"$error":"#NAME?"}},{"$f":"IF(preencher!#ref!=\"\",\"\",IF(COUNTIF(preencher!#ref!,preencher!#ref!)=0,CONCATENATE(preencher!#ref!,#REF!),preencher!#ref!))","v":{"$error":"#NAME?"}},{"$f":"IF(preencher!#ref!=\"\",\"\",IF(COUNTIF(preencher!#ref!,preencher!#ref!)=0,CONCATENATE(preencher!#ref!,#REF!),preencher!#ref!))","v":{"$error":"#NAME?"}},{"$f":"IF(preencher!#ref!=\"\",\"\",IF(COUNTIF(preencher!#ref!,preencher!#ref!)=0,CONCATENATE(preencher!#ref!,#REF!),preencher!#ref!))","v":{"$error":"#NAME?"}},{"$f":"IF(preencher!#ref!=\"\",\"\",IF(COUNTIF(preencher!#ref!,preencher!#ref!)=0,CONCATENATE(preencher!#ref!,#REF!),preencher!#ref!))","v":{"$error":"#NAME?"}},{"$f":"IF(preencher!#ref!=\"\",\"\",IF(COUNTIF(preencher!#ref!,preencher!#ref!)=0,CONCATENATE(preencher!#ref!,#REF!),preencher!#ref!))","v":{"$error":"#NAME?"}},{"$f":"IF(preencher!#ref!=\"\",\"\",IF(COUNTIF(preencher!#ref!,preencher!#ref!)=0,CONCATENATE(preencher!#ref!,#REF!),preencher!#ref!))","v":{"$error":"#NAME?"}},{"$f":"IF(preencher!#ref!=\"\",\"\",IF(COUNTIF(preencher!#ref!,preencher!#ref!)=0,CONCATENATE(preencher!#ref!,#REF!),preencher!#ref!))","v":{"$error":"#NAME?"}},{"$f":"IF(preencher!#ref!=\"\",\"\",IF(COUNTIF(preencher!#ref!,preencher!#ref!)=0,CONCATENATE(preencher!#ref!,#REF!),preencher!#ref!))","v":{"$error":"#NAME?"}},{"$f":"IF(ISERROR(ROUND(AVERAGE(E56:N56),2)),\"\",ROUND(AVERAGE(E56:N56),2))","v":""},{"$f":"IF(ISERROR(ROUND(O56*D56,2)),\"\",ROUND(O56*D56,2))","v":""},null,null,{"$f":"IF(ISERROR(MEDIAN(E56:N56)),\"\",MEDIAN(E56:N56))","v":""},{"$f":"IF(ISERROR(STDEV(E56:N56)),\"\",STDEV(E56:N56))","v":""},{"$f":"IF(ISERROR(T56/O56),\"\",T56/O56)","v":""}]
[{"$f":"IF(preencher!#ref!=\"\",\"\",preencher!#ref!)","v":{"$error":"#NAME?"}},{"$f":"IF(preencher!#ref!=\"\",\"\",preencher!#ref!)","v":{"$error":"#NAME?"}},{"$f":"IF(preencher!#ref!=\"\",\"\",preencher!#ref!)","v":{"$error":"#NAME?"}},{"$f":"IF(preencher!#ref!=\"\",\"\",preencher!#ref!)","v":{"$error":"#NAME?"}},{"$f":"IF(preencher!#ref!=\"\",\"\",IF(COUNTIF(preencher!#ref!,preencher!#ref!)=0,CONCATENATE(preencher!#ref!,#REF!),preencher!#ref!))","v":{"$error":"#NAME?"}},{"$f":"IF(preencher!#ref!=\"\",\"\",IF(COUNTIF(preencher!#ref!,preencher!#ref!)=0,CONCATENATE(preencher!#ref!,#REF!),preencher!#ref!))","v":{"$error":"#NAME?"}},{"$f":"IF(preencher!#ref!=\"\",\"\",IF(COUNTIF(preencher!#ref!,preencher!#ref!)=0,CONCATENATE(preencher!#ref!,#REF!),preencher!#ref!))","v":{"$error":"#NAME?"}},{"$f":"IF(preencher!#ref!=\"\",\"\",IF(COUNTIF(preencher!#ref!,preencher!#ref!)=0,CONCATENATE(preencher!#ref!,#REF!),preencher!#ref!))","v":{"$error":"#NAME?"}},{"$f":"IF(preencher!#ref!=\"\",\"\",IF(COUNTIF(preencher!#ref!,preencher!#ref!)=0,CONCATENATE(preencher!#ref!,#REF!),preencher!#ref!))","v":{"$error":"#NAME?"}},{"$f":"IF(preencher!#ref!=\"\",\"\",IF(COUNTIF(preencher!#ref!,preencher!#ref!)=0,CONCATENATE(preencher!#ref!,#REF!),preencher!#ref!))","v":{"$error":"#NAME?"}},{"$f":"IF(preencher!#ref!=\"\",\"\",IF(COUNTIF(preencher!#ref!,preencher!#ref!)=0,CONCATENATE(preencher!#ref!,#REF!),preencher!#ref!))","v":{"$error":"#NAME?"}},{"$f":"IF(preencher!#ref!=\"\",\"\",IF(COUNTIF(preencher!#ref!,preencher!#ref!)=0,CONCATENATE(preencher!#ref!,#REF!),preencher!#ref!))","v":{"$error":"#NAME?"}},{"$f":"IF(preencher!#ref!=\"\",\"\",IF(COUNTIF(preencher!#ref!,preencher!#ref!)=0,CONCATENATE(preencher!#ref!,#REF!),preencher!#ref!))","v":{"$error":"#NAME?"}},{"$f":"IF(preencher!#ref!=\"\",\"\",IF(COUNTIF(preencher!#ref!,preencher!#ref!)=0,CONCATENATE(preencher!#ref!,#REF!),preencher!#ref!))","v":{"$error":"#NAME?"}},{"$f":"IF(ISERROR(ROUND(AVERAGE(E57:N57),2)),\"\",ROUND(AVERAGE(E57:N57),2))","v":""},{"$f":"IF(ISERROR(ROUND(O57*D57,2)),\"\",ROUND(O57*D57,2))","v":""},null,null,{"$f":"IF(ISERROR(MEDIAN(E57:N57)),\"\",MEDIAN(E57:N57))","v":""},{"$f":"IF(ISERROR(STDEV(E57:N57)),\"\",STDEV(E57:N57))","v":""},{"$f":"IF(ISERROR(T57/O57),\"\",T57/O57)","v":""}]
[{"$f":"IF(preencher!#ref!=\"\",\"\",preencher!#ref!)","v":{"$error":"#NAME?"}},{"$f":"IF(preencher!#ref!=\"\",\"\",preencher!#ref!)","v":{"$error":"#NAME?"}},{"$f":"IF(preencher!#ref!=\"\",\"\",preencher!#ref!)","v":{"$error":"#NAME?"}},{"$f":"IF(preencher!#ref!=\"\",\"\",preencher!#ref!)","v":{"$error":"#NAME?"}},{"$f":"IF(preencher!#ref!=\"\",\"\",IF(COUNTIF(preencher!#ref!,preencher!#ref!)=0,CONCATENATE(preencher!#ref!,#REF!),preencher!#ref!))","v":{"$error":"#NAME?"}},{"$f":"IF(preencher!#ref!=\"\",\"\",IF(COUNTIF(preencher!#ref!,preencher!#ref!)=0,CONCATENATE(preencher!#ref!,#REF!),preencher!#ref!))","v":{"$error":"#NAME?"}},{"$f":"IF(preencher!#ref!=\"\",\"\",IF(COUNTIF(preencher!#ref!,preencher!#ref!)=0,CONCATENATE(preencher!#ref!,#REF!),preencher!#ref!))","v":{"$error":"#NAME?"}},{"$f":"IF(preencher!#ref!=\"\",\"\",IF(COUNTIF(preencher!#ref!,preencher!#ref!)=0,CONCATENATE(preencher!#ref!,#REF!),preencher!#ref!))","v":{"$error":"#NAME?"}},{"$f":"IF(preencher!#ref!=\"\",\"\",IF(COUNTIF(preencher!#ref!,preencher!#ref!)=0,CONCATENATE(preencher!#ref!,#REF!),preencher!#ref!))","v":{"$error":"#NAME?"}},{"$f":"IF(preencher!#ref!=\"\",\"\",IF(COUNTIF(preencher!#ref!,preencher!#ref!)=0,CONCATENATE(preencher!#ref!,#REF!),preencher!#ref!))","v":{"$error":"#NAME?"}},{"$f":"IF(preencher!#ref!=\"\",\"\",IF(COUNTIF(preencher!#ref!,preencher!#ref!)=0,CONCATENATE(preencher!#ref!,#REF!),preencher!#ref!))","v":{"$error":"#NAME?"}},{"$f":"IF(preencher!#ref!=\"\",\"\",IF(COUNTIF(preencher!#ref!,preencher!#ref!)=0,CONCATENATE(preencher!#ref!,#REF!),preencher!#ref!))","v":{"$error":"#NAME?"}},{"$f":"IF(preencher!#ref!=\"\",\"\",IF(COUNTIF(preencher!#ref!,preencher!#ref!)=0,CONCATENATE(preencher!#ref!,#REF!),preencher!#ref!))","v":{"$error":"#NAME?"}},{"$f":"IF(preencher!#ref!=\"\",\"\",IF(COUNTIF(preencher!#ref!,preencher!#ref!)=0,CONCATENATE(preencher!#ref!,#REF!),preencher!#ref!))","v":{"$error":"#NAME?"}},{"$f":"IF(ISERROR(ROUND(AVERAGE(E58:N58),2)),\"\",ROUND(AVERAGE(E58:N58),2))","v":""},{"$f":"IF(ISERROR(ROUND(O58*D58,2)),\"\",ROUND(O58*D58,2))","v":""},null,null,{"$f":"IF(ISERROR(MEDIAN(E58:N58)),\"\",MEDIAN(E58:N58))","v":""},{"$f":"IF(ISERROR(STDEV(E58:N58)),\"\",STDEV(E58:N58))","v":""},{"$f":"IF(ISERROR(T58/O58),\"\",T58/O58)","v":""}]
[{"$f":"IF(preencher!#ref!=\"\",\"\",preencher!#ref!)","v":{"$error":"#NAME?"}},{"$f":"IF(preencher!#ref!=\"\",\"\",preencher!#ref!)","v":{"$error":"#NAME?"}},{"$f":"IF(preencher!#ref!=\"\",\"\",preencher!#ref!)","v":{"$error":"#NAME?"}},{"$f":"IF(preencher!#ref!=\"\",\"\",preencher!#ref!)","v":{"$error":"#NAME?"}},{"$f":"IF(preencher!#ref!=\"\",\"\",IF(COUNTIF(preencher!#ref!,preencher!#ref!)=0,CONCATENATE(preencher!#ref!,#REF!),preencher!#ref!))","v":{"$error":"#NAME?"}},{"$f":"IF(preencher!#ref!=\"\",\"\",IF(COUNTIF(preencher!#ref!,preencher!#ref!)=0,CONCATENATE(preencher!#ref!,#REF!),preencher!#ref!))","v":{"$error":"#NAME?"}},{"$f":"IF(preencher!#ref!=\"\",\"\",IF(COUNTIF(preencher!#ref!,preencher!#ref!)=0,CONCATENATE(preencher!#ref!,#REF!),preencher!#ref!))","v":{"$error":"#NAME?"}},{"$f":"IF(preencher!#ref!=\"\",\"\",IF(COUNTIF(preencher!#ref!,preencher!#ref!)=0,CONCATENATE(preencher!#ref!,#REF!),preencher!#ref!))","v":{"$error":"#NAME?"}},{"$f":"IF(preencher!#ref!=\"\",\"\",IF(COUNTIF(preencher!#ref!,preencher!#ref!)=0,CONCATENATE(preencher!#ref!,#REF!),preencher!#ref!))","v":{"$error":"#NAME?"}},{"$f":"IF(preencher!#ref!=\"\",\"\",IF(COUNTIF(preencher!#ref!,preencher!#ref!)=0,CONCATENATE(preencher!#ref!,#REF!),preencher!#ref!))","v":{"$error":"#NAME?"}},{"$f":"IF(preencher!#ref!=\"\",\"\",IF(COUNTIF(preencher!#ref!,preencher!#ref!)=0,CONCATENATE(preencher!#ref!,#REF!),preencher!#ref!))","v":{"$error":"#NAME?"}},{"$f":"IF(preencher!#ref!=\"\",\"\",IF(COUNTIF(preencher!#ref!,preencher!#ref!)=0,CONCATENATE(preencher!#ref!,#REF!),preencher!#ref!))","v":{"$error":"#NAME?"}},{"$f":"IF(preencher!#ref!=\"\",\"\",IF(COUNTIF(preencher!#ref!,preencher!#ref!)=0,CONCATENATE(preencher!#ref!,#REF!),preencher!#ref!))","v":{"$error":"#NAME?"}},{"$f":"IF(preencher!#ref!=\"\",\"\",IF(COUNTIF(preencher!#ref!,preencher!#ref!)=0,CONCATENATE(preencher!#ref!,#REF!),preencher!#ref!))","v":{"$error":"#NAME?"}},{"$f":"IF(ISERROR(ROUND(AVERAGE(E59:N59),2)),\"\",ROUND(AVERAGE(E59:N59),2))","v":""},{"$f":"IF(ISERROR(ROUND(O59*D59,2)),\"\",ROUND(O59*D59,2))","v":""},null,null,{"$f":"IF(ISERROR(MEDIAN(E59:N59)),\"\",MEDIAN(E59:N59))","v":""},{"$f":"IF(ISERROR(STDEV(E59:N59)),\"\",STDEV(E59:N59))","v":""},{"$f":"IF(ISERROR(T59/O59),\"\",T59/O59)","v":""}]
[{"$f":"IF(preencher!#ref!=\"\",\"\",preencher!#ref!)","v":{"$error":"#NAME?"}},{"$f":"IF(preencher!#ref!=\"\",\"\",preencher!#ref!)","v":{"$error":"#NAME?"}},{"$f":"IF(preencher!#ref!=\"\",\"\",preencher!#ref!)","v":{"$error":"#NAME?"}},{"$f":"IF(preencher!#ref!=\"\",\"\",preencher!#ref!)","v":{"$error":"#NAME?"}},{"$f":"IF(preencher!#ref!=\"\",\"\",IF(COUNTIF(preencher!#ref!,preencher!#ref!)=0,CONCATENATE(preencher!#ref!,#REF!),preencher!#ref!))","v":{"$error":"#NAME?"}},{"$f":"IF(preencher!#ref!=\"\",\"\",IF(COUNTIF(preencher!#ref!,preencher!#ref!)=0,CONCATENATE(preencher!#ref!,#REF!),preencher!#ref!))","v":{"$error":"#NAME?"}},{"$f":"IF(preencher!#ref!=\"\",\"\",IF(COUNTIF(preencher!#ref!,preencher!#ref!)=0,CONCATENATE(preencher!#ref!,#REF!),preencher!#ref!))","v":{"$error":"#NAME?"}},{"$f":"IF(preencher!#ref!=\"\",\"\",IF(COUNTIF(preencher!#ref!,preencher!#ref!)=0,CONCATENATE(preencher!#ref!,#REF!),preencher!#ref!))","v":{"$error":"#NAME?"}},{"$f":"IF(preencher!#ref!=\"\",\"\",IF(COUNTIF(preencher!#ref!,preencher!#ref!)=0,CONCATENATE(preencher!#ref!,#REF!),preencher!#ref!))","v":{"$error":"#NAME?"}},{"$f":"IF(preencher!#ref!=\"\",\"\",IF(COUNTIF(preencher!#ref!,preencher!#ref!)=0,CONCATENATE(preencher!#ref!,#REF!),preencher!#ref!))","v":{"$error":"#NAME?"}},{"$f":"IF(preencher!#ref!=\"\",\"\",IF(COUNTIF(preencher!#ref!,preencher!#ref!)=0,CONCATENATE(preencher!#ref!,#REF!),preencher!#ref!))","v":{"$error":"#NAME?"}},{"$f":"IF(preencher!#ref!=\"\",\"\",IF(COUNTIF(preencher!#ref!,preencher!#ref!)=0,CONCATENATE(preencher!#ref!,#REF!),preencher!#ref!))","v":{"$error":"#NAME?"}},{"$f":"IF(preencher!#ref!=\"\",\"\",IF(COUNTIF(preencher!#ref!,preencher!#ref!)=0,CONCATENATE(preencher!#ref!,#REF!),preencher!#ref!))","v":{"$error":"#NAME?"}},{"$f":"IF(preencher!#ref!=\"\",\"\",IF(COUNTIF(preencher!#ref!,preencher!#ref!)=0,CONCATENATE(preencher!#ref!,#REF!),preencher!#ref!))","v":{"$error":"#NAME?"}},{"$f":"IF(ISERROR(ROUND(AVERAGE(E60:N60),2)),\"\",ROUND(AVERAGE(E60:N60),2))","v":""},{"$f":"IF(ISERROR(ROUND(O60*D60,2)),\"\",ROUND(O60*D60,2))","v":""},null,null,{"$f":"IF(ISERROR(MEDIAN(E60:N60)),\"\",MEDIAN(E60:N60))","v":""},{"$f":"IF(ISERROR(STDEV(E60:N60)),\"\",STDEV(E60:N60))","v":""},{"$f":"IF(ISERROR(T60/O60),\"\",T60/O60)","v":""}]
[{"$f":"IF(preencher!#ref!=\"\",\"\",preencher!#ref!)","v":{"$error":"#NAME?"}},{"$f":"IF(preencher!#ref!=\"\",\"\",preencher!#ref!)","v":{"$error":"#NAME?"}},{"$f":"IF(preencher!#ref!=\"\",\"\",preencher!#ref!)","v":{"$error":"#NAME?"}},{"$f":"IF(preencher!#ref!=\"\",\"\",preencher!#ref!)","v":{"$error":"#NAME?"}},{"$f":"IF(preencher!#ref!=\"\",\"\",IF(COUNTIF(preencher!#ref!,preencher!#ref!)=0,CONCATENATE(preencher!#ref!,#REF!),preencher!#ref!))","v":{"$error":"#NAME?"}},{"$f":"IF(preencher!#ref!=\"\",\"\",IF(COUNTIF(preencher!#ref!,preencher!#ref!)=0,CONCATENATE(preencher!#ref!,#REF!),preencher!#ref!))","v":{"$error":"#NAME?"}},{"$f":"IF(preencher!#ref!=\"\",\"\",IF(COUNTIF(preencher!#ref!,preencher!#ref!)=0,CONCATENATE(preencher!#ref!,#REF!),preencher!#ref!))","v":{"$error":"#NAME?"}},{"$f":"IF(preencher!#ref!=\"\",\"\",IF(COUNTIF(preencher!#ref!,preencher!#ref!)=0,CONCATENATE(preencher!#ref!,#REF!),preencher!#ref!))","v":{"$error":"#NAME?"}},{"$f":"IF(preencher!#ref!=\"\",\"\",IF(COUNTIF(preencher!#ref!,preencher!#ref!)=0,CONCATENATE(preencher!#ref!,#REF!),preencher!#ref!))","v":{"$error":"#NAME?"}},{"$f":"IF(preencher!#ref!=\"\",\"\",IF(COUNTIF(preencher!#ref!,preencher!#ref!)=0,CONCATENATE(preencher!#ref!,#REF!),preencher!#ref!))","v":{"$error":"#NAME?"}},{"$f":"IF(preencher!#ref!=\"\",\"\",IF(COUNTIF(preencher!#ref!,preencher!#ref!)=0,CONCATENATE(preencher!#ref!,#REF!),preencher!#ref!))","v":{"$error":"#NAME?"}},{"$f":"IF(preencher!#ref!=\"\",\"\",IF(COUNTIF(preencher!#ref!,preencher!#ref!)=0,CONCATENATE(preencher!#ref!,#REF!),preencher!#ref!))","v":{"$error":"#NAME?"}},{"$f":"IF(preencher!#ref!=\"\",\"\",IF(COUNTIF(preencher!#ref!,preencher!#ref!)=0,CONCATENATE(preencher!#ref!,#REF!),preencher!#ref!))","v":{"$error":"#NAME?"}},{"$f":"IF(preencher!#ref!=\"\",\"\",IF(COUNTIF(preencher!#ref!,preencher!#ref!)=0,CONCATENATE(preencher!#ref!,#REF!),preencher!#ref!))","v":{"$error":"#NAME?"}},{"$f":"IF(ISERROR(ROUND(AVERAGE(E61:N61),2)),\"\",ROUND(AVERAGE(E61:N61),2))","v":""},{"$f":"IF(ISERROR(ROUND(O61*D61,2)),\"\",ROUND(O61*D61,2))","v":""},null,null,{"$f":"IF(ISERROR(MEDIAN(E61:N61)),\"\",MEDIAN(E61:N61))","v":""},{"$f":"IF(ISERROR(STDEV(E61:N61)),\"\",STDEV(E61:N61))","v":""},{"$f":"IF(ISERROR(T61/O61),\"\",T61/O61)","v":""}]
[{"$f":"IF(preencher!#ref!=\"\",\"\",preencher!#ref!)","v":{"$error":"#NAME?"}},{"$f":"IF(preencher!#ref!=\"\",\"\",preencher!#ref!)","v":{"$error":"#NAME?"}},{"$f":"IF(preencher!#ref!=\"\",\"\",preencher!#ref!)","v":{"$error":"#NAME?"}},{"$f":"IF(preencher!#ref!=\"\",\"\",preencher!#ref!)","v":{"$error":"#NAME?"}},{"$f":"IF(preencher!#ref!=\"\",\"\",IF(COUNTIF(preencher!#ref!,preencher!#ref!)=0,CONCATENATE(preencher!#ref!,#REF!),preencher!#ref!))","v":{"$error":"#NAME?"}},{"$f":"IF(preencher!#ref!=\"\",\"\",IF(COUNTIF(preencher!#ref!,preencher!#ref!)=0,CONCATENATE(preencher!#ref!,#REF!),preencher!#ref!))","v":{"$error":"#NAME?"}},{"$f":"IF(preencher!#ref!=\"\",\"\",IF(COUNTIF(preencher!#ref!,preencher!#ref!)=0,CONCATENATE(preencher!#ref!,#REF!),preencher!#ref!))","v":{"$error":"#NAME?"}},{"$f":"IF(preencher!#ref!=\"\",\"\",IF(COUNTIF(preencher!#ref!,preencher!#ref!)=0,CONCATENATE(preencher!#ref!,#REF!),preencher!#ref!))","v":{"$error":"#NAME?"}},{"$f":"IF(preencher!#ref!=\"\",\"\",IF(COUNTIF(preencher!#ref!,preencher!#ref!)=0,CONCATENATE(preencher!#ref!,#REF!),preencher!#ref!))","v":{"$error":"#NAME?"}},{"$f":"IF(preencher!#ref!=\"\",\"\",IF(COUNTIF(preencher!#ref!,preencher!#ref!)=0,CONCATENATE(preencher!#ref!,#REF!),preencher!#ref!))","v":{"$error":"#NAME?"}},{"$f":"IF(preencher!#ref!=\"\",\"\",IF(COUNTIF(preencher!#ref!,preencher!#ref!)=0,CONCATENATE(preencher!#ref!,#REF!),preencher!#ref!))","v":{"$error":"#NAME?"}},{"$f":"IF(preencher!#ref!=\"\",\"\",IF(COUNTIF(preencher!#ref!,preencher!#ref!)=0,CONCATENATE(preencher!#ref!,#REF!),preencher!#ref!))","v":{"$error":"#NAME?"}},{"$f":"IF(preencher!#ref!=\"\",\"\",IF(COUNTIF(preencher!#ref!,preencher!#ref!)=0,CONCATENATE(preencher!#ref!,#REF!),preencher!#ref!))","v":{"$error":"#NAME?"}},{"$f":"IF(preencher!#ref!=\"\",\"\",IF(COUNTIF(preencher!#ref!,preencher!#ref!)=0,CONCATENATE(preencher!#ref!,#REF!),preencher!#ref!))","v":{"$error":"#NAME?"}},{"$f":"IF(ISERROR(ROUND(AVERAGE(E62:N62),2)),\"\",ROUND(AVERAGE(E62:N62),2))","v":""},{"$f":"IF(ISERROR(ROUND(O62*D62,2)),\"\",ROUND(O62*D62,2))","v":""},null,null,{"$f":"IF(ISERROR(MEDIAN(E62:N62)),\"\",MEDIAN(E62:N62))","v":""},{"$f":"IF(ISERROR(STDEV(E62:N62)),\"\",STDEV(E62:N62))","v":""},{"$f":"IF(ISERROR(T62/O62),\"\",T62/O62)","v":""}]
[{"$f":"IF(preencher!#ref!=\"\",\"\",preencher!#ref!)","v":{"$error":"#NAME?"}},{"$f":"IF(preencher!#ref!=\"\",\"\",preencher!#ref!)","v":{"$error":"#NAME?"}},{"$f":"IF(preencher!#ref!=\"\",\"\",preencher!#ref!)","v":{"$error":"#NAME?"}},{"$f":"IF(preencher!#ref!=\"\",\"\",preencher!#ref!)","v":{"$error":"#NAME?"}},{"$f":"IF(preencher!#ref!=\"\",\"\",IF(COUNTIF(preencher!#ref!,preencher!#ref!)=0,CONCATENATE(preencher!#ref!,#REF!),preencher!#ref!))","v":{"$error":"#NAME?"}},{"$f":"IF(preencher!#ref!=\"\",\"\",IF(COUNTIF(preencher!#ref!,preencher!#ref!)=0,CONCATENATE(preencher!#ref!,#REF!),preencher!#ref!))","v":{"$error":"#NAME?"}},{"$f":"IF(preencher!#ref!=\"\",\"\",IF(COUNTIF(preencher!#ref!,preencher!#ref!)=0,CONCATENATE(preencher!#ref!,#REF!),preencher!#ref!))","v":{"$error":"#NAME?"}},{"$f":"IF(preencher!#ref!=\"\",\"\",IF(COUNTIF(preencher!#ref!,preencher!#ref!)=0,CONCATENATE(preencher!#ref!,#REF!),preencher!#ref!))","v":{"$error":"#NAME?"}},{"$f":"IF(preencher!#ref!=\"\",\"\",IF(COUNTIF(preencher!#ref!,preencher!#ref!)=0,CONCATENATE(preencher!#ref!,#REF!),preencher!#ref!))","v":{"$error":"#NAME?"}},{"$f":"IF(preencher!#ref!=\"\",\"\",IF(COUNTIF(preencher!#ref!,preencher!#ref!)=0,CONCATENATE(preencher!#ref!,#REF!),preencher!#ref!))","v":{"$error":"#NAME?"}},{"$f":"IF(preencher!#ref!=\"\",\"\",IF(COUNTIF(preencher!#ref!,preencher!#ref!)=0,CONCATENATE(preencher!#ref!,#REF!),preencher!#ref!))","v":{"$error":"#NAME?"}},{"$f":"IF(preencher!#ref!=\"\",\"\",IF(COUNTIF(preencher!#ref!,preencher!#ref!)=0,CONCATENATE(preencher!#ref!,#REF!),preencher!#ref!))","v":{"$error":"#NAME?"}},{"$f":"IF(preencher!#ref!=\"\",\"\",IF(COUNTIF(preencher!#ref!,preencher!#ref!)=0,CONCATENATE(preencher!#ref!,#REF!),preencher!#ref!))","v":{"$error":"#NAME?"}},{"$f":"IF(preencher!#ref!=\"\",\"\",IF(COUNTIF(preencher!#ref!,preencher!#ref!)=0,CONCATENATE(preencher!#ref!,#REF!),preencher!#ref!))","v":{"$error":"#NAME?"}},{"$f":"IF(ISERROR(ROUND(AVERAGE(E63:N63),2)),\"\",ROUND(AVERAGE(E63:N63),2))","v":""},{"$f":"IF(ISERROR(ROUND(O63*D63,2)),\"\",ROUND(O63*D63,2))","v":""},null,null,{"$f":"IF(ISERROR(MEDIAN(E63:N63)),\"\",MEDIAN(E63:N63))","v":""},{"$f":"IF(ISERROR(STDEV(E63:N63)),\"\",STDEV(E63:N63))","v":""},{"$f":"IF(ISERROR(T63/O63),\"\",T63/O63)","v":""}]
[{"$f":"IF(preencher!#ref!=\"\",\"\",preencher!#ref!)","v":{"$error":"#NAME?"}},{"$f":"IF(preencher!#ref!=\"\",\"\",preencher!#ref!)","v":{"$error":"#NAME?"}},{"$f":"IF(preencher!#ref!=\"\",\"\",preencher!#ref!)","v":{"$error":"#NAME?"}},{"$f":"IF(preencher!#ref!=\"\",\"\",preencher!#ref!)","v":{"$error":"#NAME?"}},{"$f":"IF(preencher!#ref!=\"\",\"\",IF(COUNTIF(preencher!#ref!,preencher!#ref!)=0,CONCATENATE(preencher!#ref!,#REF!),preencher!#ref!))","v":{"$error":"#NAME?"}},{"$f":"IF(preencher!#ref!=\"\",\"\",IF(COUNTIF(preencher!#ref!,preencher!#ref!)=0,CONCATENATE(preencher!#ref!,#REF!),preencher!#ref!))","v":{"$error":"#NAME?"}},{"$f":"IF(preencher!#ref!=\"\",\"\",IF(COUNTIF(preencher!#ref!,preencher!#ref!)=0,CONCATENATE(preencher!#ref!,#REF!),preencher!#ref!))","v":{"$error":"#NAME?"}},{"$f":"IF(preencher!#ref!=\"\",\"\",IF(COUNTIF(preencher!#ref!,preencher!#ref!)=0,CONCATENATE(preencher!#ref!,#REF!),preencher!#ref!))","v":{"$error":"#NAME?"}},{"$f":"IF(preencher!#ref!=\"\",\"\",IF(COUNTIF(preencher!#ref!,preencher!#ref!)=0,CONCATENATE(preencher!#ref!,#REF!),preencher!#ref!))","v":{"$error":"#NAME?"}},{"$f":"IF(preencher!#ref!=\"\",\"\",IF(COUNTIF(preencher!#ref!,preencher!#ref!)=0,CONCATENATE(preencher!#ref!,#REF!),preencher!#ref!))","v":{"$error":"#NAME?"}},{"$f":"IF(preencher!#ref!=\"\",\"\",IF(COUNTIF(preencher!#ref!,preencher!#ref!)=0,CONCATENATE(preencher!#ref!,#REF!),preencher!#ref!))","v":{"$error":"#NAME?"}},{"$f":"IF(preencher!#ref!=\"\",\"\",IF(COUNTIF(preencher!#ref!,preencher!#ref!)=0,CONCATENATE(preencher!#ref!,#REF!),preencher!#ref!))","v":{"$error":"#NAME?"}},{"$f":"IF(preencher!#ref!=\"\",\"\",IF(COUNTIF(preencher!#ref!,preencher!#ref!)=0,CONCATENATE(preencher!#ref!,#REF!),preencher!#ref!))","v":{"$error":"#NAME?"}},{"$f":"IF(preencher!#ref!=\"\",\"\",IF(COUNTIF(preencher!#ref!,preencher!#ref!)=0,CONCATENATE(preencher!#ref!,#REF!),preencher!#ref!))","v":{"$error":"#NAME?"}},{"$f":"IF(ISERROR(ROUND(AVERAGE(E64:N64),2)),\"\",ROUND(AVERAGE(E64:N64),2))","v":""},{"$f":"IF(ISERROR(ROUND(O64*D64,2)),\"\",ROUND(O64*D64,2))","v":""},null,null,{"$f":"IF(ISERROR(MEDIAN(E64:N64)),\"\",MEDIAN(E64:N64))","v":""},{"$f":"IF(ISERROR(STDEV(E64:N64)),\"\",STDEV(E64:N64))","v":""},{"$f":"IF(ISERROR(T64/O64),\"\",T64/O64)","v":""}]
[{"$f":"IF(preencher!#ref!=\"\",\"\",preencher!#ref!)","v":{"$error":"#NAME?"}},{"$f":"IF(preencher!#ref!=\"\",\"\",preencher!#ref!)","v":{"$error":"#NAME?"}},{"$f":"IF(preencher!#ref!=\"\",\"\",preencher!#ref!)","v":{"$error":"#NAME?"}},{"$f":"IF(preencher!#ref!=\"\",\"\",preencher!#ref!)","v":{"$error":"#NAME?"}},{"$f":"IF(preencher!#ref!=\"\",\"\",IF(COUNTIF(preencher!#ref!,preencher!#ref!)=0,CONCATENATE(preencher!#ref!,#REF!),preencher!#ref!))","v":{"$error":"#NAME?"}},{"$f":"IF(preencher!#ref!=\"\",\"\",IF(COUNTIF(preencher!#ref!,preencher!#ref!)=0,CONCATENATE(preencher!#ref!,#REF!),preencher!#ref!))","v":{"$error":"#NAME?"}},{"$f":"IF(preencher!#ref!=\"\",\"\",IF(COUNTIF(preencher!#ref!,preencher!#ref!)=0,CONCATENATE(preencher!#ref!,#REF!),preencher!#ref!))","v":{"$error":"#NAME?"}},{"$f":"IF(preencher!#ref!=\"\",\"\",IF(COUNTIF(preencher!#ref!,preencher!#ref!)=0,CONCATENATE(preencher!#ref!,#REF!),preencher!#ref!))","v":{"$error":"#NAME?"}},{"$f":"IF(preencher!#ref!=\"\",\"\",IF(COUNTIF(preencher!#ref!,preencher!#ref!)=0,CONCATENATE(preencher!#ref!,#REF!),preencher!#ref!))","v":{"$error":"#NAME?"}},{"$f":"IF(preencher!#ref!=\"\",\"\",IF(COUNTIF(preencher!#ref!,preencher!#ref!)=0,CONCATENATE(preencher!#ref!,#REF!),preencher!#ref!))","v":{"$error":"#NAME?"}},{"$f":"IF(preencher!#ref!=\"\",\"\",IF(COUNTIF(preencher!#ref!,preencher!#ref!)=0,CONCATENATE(preencher!#ref!,#REF!),preencher!#ref!))","v":{"$error":"#NAME?"}},{"$f":"IF(preencher!#ref!=\"\",\"\",IF(COUNTIF(preencher!#ref!,preencher!#ref!)=0,CONCATENATE(preencher!#ref!,#REF!),preencher!#ref!))","v":{"$error":"#NAME?"}},{"$f":"IF(preencher!#ref!=\"\",\"\",IF(COUNTIF(preencher!#ref!,preencher!#ref!)=0,CONCATENATE(preencher!#ref!,#REF!),preencher!#ref!))","v":{"$error":"#NAME?"}},{"$f":"IF(preencher!#ref!=\"\",\"\",IF(COUNTIF(preencher!#ref!,preencher!#ref!)=0,CONCATENATE(preencher!#ref!,#REF!),preencher!#ref!))","v":{"$error":"#NAME?"}},{"$f":"IF(ISERROR(ROUND(AVERAGE(E65:N65),2)),\"\",ROUND(AVERAGE(E65:N65),2))","v":""},{"$f":"IF(ISERROR(ROUND(O65*D65,2)),\"\",ROUND(O65*D65,2))","v":""},null,null,{"$f":"IF(ISERROR(MEDIAN(E65:N65)),\"\",MEDIAN(E65:N65))","v":""},{"$f":"IF(ISERROR(STDEV(E65:N65)),\"\",STDEV(E65:N65))","v":""},{"$f":"IF(ISERROR(T65/O65),\"\",T65/O65)","v":""}]
[{"$f":"IF(preencher!#ref!=\"\",\"\",preencher!#ref!)","v":{"$error":"#NAME?"}},{"$f":"IF(preencher!#ref!=\"\",\"\",preencher!#ref!)","v":{"$error":"#NAME?"}},{"$f":"IF(preencher!#ref!=\"\",\"\",preencher!#ref!)","v":{"$error":"#NAME?"}},{"$f":"IF(preencher!#ref!=\"\",\"\",preencher!#ref!)","v":{"$error":"#NAME?"}},{"$f":"IF(preencher!#ref!=\"\",\"\",IF(COUNTIF(preencher!#ref!,preencher!#ref!)=0,CONCATENATE(preencher!#ref!,#REF!),preencher!#ref!))","v":{"$error":"#NAME?"}},{"$f":"IF(preencher!#ref!=\"\",\"\",IF(COUNTIF(preencher!#ref!,preencher!#ref!)=0,CONCATENATE(preencher!#ref!,#REF!),preencher!#ref!))","v":{"$error":"#NAME?"}},{"$f":"IF(preencher!#ref!=\"\",\"\",IF(COUNTIF(preencher!#ref!,preencher!#ref!)=0,CONCATENATE(preencher!#ref!,#REF!),preencher!#ref!))","v":{"$error":"#NAME?"}},{"$f":"IF(preencher!#ref!=\"\",\"\",IF(COUNTIF(preencher!#ref!,preencher!#ref!)=0,CONCATENATE(preencher!#ref!,#REF!),preencher!#ref!))","v":{"$error":"#NAME?"}},{"$f":"IF(preencher!#ref!=\"\",\"\",IF(COUNTIF(preencher!#ref!,preencher!#ref!)=0,CONCATENATE(preencher!#ref!,#REF!),preencher!#ref!))","v":{"$error":"#NAME?"}},{"$f":"IF(preencher!#ref!=\"\",\"\",IF(COUNTIF(preencher!#ref!,preencher!#ref!)=0,CONCATENATE(preencher!#ref!,#REF!),preencher!#ref!))","v":{"$error":"#NAME?"}},{"$f":"IF(preencher!#ref!=\"\",\"\",IF(COUNTIF(preencher!#ref!,preencher!#ref!)=0,CONCATENATE(preencher!#ref!,#REF!),preencher!#ref!))","v":{"$error":"#NAME?"}},{"$f":"IF(preencher!#ref!=\"\",\"\",IF(COUNTIF(preencher!#ref!,preencher!#ref!)=0,CONCATENATE(preencher!#ref!,#REF!),preencher!#ref!))","v":{"$error":"#NAME?"}},{"$f":"IF(preencher!#ref!=\"\",\"\",IF(COUNTIF(preencher!#ref!,preencher!#ref!)=0,CONCATENATE(preencher!#ref!,#REF!),preencher!#ref!))","v":{"$error":"#NAME?"}},{"$f":"IF(preencher!#ref!=\"\",\"\",IF(COUNTIF(preencher!#ref!,preencher!#ref!)=0,CONCATENATE(preencher!#ref!,#REF!),preencher!#ref!))","v":{"$error":"#NAME?"}},{"$f":"IF(ISERROR(ROUND(AVERAGE(E66:N66),2)),\"\",ROUND(AVERAGE(E66:N66),2))","v":""},{"$f":"IF(ISERROR(ROUND(O66*D66,2)),\"\",ROUND(O66*D66,2))","v":""},null,null,{"$f":"IF(ISERROR(MEDIAN(E66:N66)),\"\",MEDIAN(E66:N66))","v":""},{"$f":"IF(ISERROR(STDEV(E66:N66)),\"\",STDEV(E66:N66))","v":""},{"$f":"IF(ISERROR(T66/O66),\"\",T66/O66)","v":""}]
[{"$f":"IF(preencher!#ref!=\"\",\"\",preencher!#ref!)","v":{"$error":"#NAME?"}},{"$f":"IF(preencher!#ref!=\"\",\"\",preencher!#ref!)","v":{"$error":"#NAME?"}},{"$f":"IF(preencher!#ref!=\"\",\"\",preencher!#ref!)","v":{"$error":"#NAME?"}},{"$f":"IF(preencher!#ref!=\"\",\"\",preencher!#ref!)","v":{"$error":"#NAME?"}},{"$f":"IF(preencher!#ref!=\"\",\"\",IF(COUNTIF(preencher!#ref!,preencher!#ref!)=0,CONCATENATE(preencher!#ref!,#REF!),preencher!#ref!))","v":{"$error":"#NAME?"}},{"$f":"IF(preencher!#ref!=\"\",\"\",IF(COUNTIF(preencher!#ref!,preencher!#ref!)=0,CONCATENATE(preencher!#ref!,#REF!),preencher!#ref!))","v":{"$error":"#NAME?"}},{"$f":"IF(preencher!#ref!=\"\",\"\",IF(COUNTIF(preencher!#ref!,preencher!#ref!)=0,CONCATENATE(preencher!#ref!,#REF!),preencher!#ref!))","v":{"$error":"#NAME?"}},{"$f":"IF(preencher!#ref!=\"\",\"\",IF(COUNTIF(preencher!#ref!,preencher!#ref!)=0,CONCATENATE(preencher!#ref!,#REF!),preencher!#ref!))","v":{"$error":"#NAME?"}},{"$f":"IF(preencher!#ref!=\"\",\"\",IF(COUNTIF(preencher!#ref!,preencher!#ref!)=0,CONCATENATE(preencher!#ref!,#REF!),preencher!#ref!))","v":{"$error":"#NAME?"}},{"$f":"IF(preencher!#ref!=\"\",\"\",IF(COUNTIF(preencher!#ref!,preencher!#ref!)=0,CONCATENATE(preencher!#ref!,#REF!),preencher!#ref!))","v":{"$error":"#NAME?"}},{"$f":"IF(preencher!#ref!=\"\",\"\",IF(COUNTIF(preencher!#ref!,preencher!#ref!)=0,CONCATENATE(preencher!#ref!,#REF!),preencher!#ref!))","v":{"$error":"#NAME?"}},{"$f":"IF(preencher!#ref!=\"\",\"\",IF(COUNTIF(preencher!#ref!,preencher!#ref!)=0,CONCATENATE(preencher!#ref!,#REF!),preencher!#ref!))","v":{"$error":"#NAME?"}},{"$f":"IF(preencher!#ref!=\"\",\"\",IF(COUNTIF(preencher!#ref!,preencher!#ref!)=0,CONCATENATE(preencher!#ref!,#REF!),preencher!#ref!))","v":{"$error":"#NAME?"}},{"$f":"IF(preencher!#ref!=\"\",\"\",IF(COUNTIF(preencher!#ref!,preencher!#ref!)=0,CONCATENATE(preencher!#ref!,#REF!),preencher!#ref!))","v":{"$error":"#NAME?"}},{"$f":"IF(ISERROR(ROUND(AVERAGE(E67:N67),2)),\"\",ROUND(AVERAGE(E67:N67),2))","v":""},{"$f":"IF(ISERROR(ROUND(O67*D67,2)),\"\",ROUND(O67*D67,2))","v":""},null,null,{"$f":"IF(ISERROR(MEDIAN(E67:N67)),\"\",MEDIAN(E67:N67))","v":""},{"$f":"IF(ISERROR(STDEV(E67:N67)),\"\",STDEV(E67:N67))","v":""},{"$f":"IF(ISERROR(T67/O67),\"\",T67/O67)","v":""}]
["VALOR GLOBAL",null,null,null,null,null,null,null,null,null,null,null,null,null,null,{"$f":"IF(SUM(P8:P67)=0,\"\",SUM(P8:P67))","v":""}]

{"sheet":"Média 3º, 4º e 5º","index":3,"n_rows":68,"n_cols":21,"rows_kept":68,"cut":false,"hidden":true,"merged":[[5,18,5,20],[67,0,67,14]]}
[]
[]
[]
[]
[]
[null,null,null,null,null,null,null,null,null,null,null,null,null,null,null,null,null,null,"ANÁLISE ESTATÍSTICA"]
[{"$f":"PREENCHER!A4","v":"ITEM"},{"$f":"PREENCHER!B4","v":"ESPECIFICAÇÃO"},{"$f":"PREENCHER!C4","v":"UN"},{"$f":"PREENCHER!D4","v":"QTDE"},{"$f":"preencher!#ref!","v":{"$error":"#NAME?"}},{"$f":"preencher!#ref!","v":{"$error":"#NAME?"}},{"$f":"PREENCHER!G5","v":"MAGAZINE LUIZA"},{"$f":"preencher!#ref!","v":{"$error":"#NAME?"}},{"$f":"preencher!#ref!","v":{"$error":"#NAME?"}},{"$f":"preencher!#ref!","v":{"$error":"#NAME?"}},{"$f":"preencher!#ref!","v":{"$error":"#NAME?"}},{"$f":"preencher!#ref!","v":{"$error":"#NAME?"}},{"$f":"preencher!#ref!","v":{"$error":"#NAME?"}},{"$f":"preencher!#ref!","v":{"$error":"#NAME?"}},{"$f":"PREENCHER!M5","v":"UNITÁRIO"},{"$f":"PREENCHER!N5","v":"TOTAL"},{"$f":"PREENCHER!Q4","v":"OBSERVAÇÃO"},null,"MEDIANA","DESVIO PADRÃO","COEFICIENTE DE VARIAÇÃO"]
[{"$f":"IF(PREENCHER!A6=\"\",\"\",PREENCHER!A6)","v":1},{"$f":"IF(PREENCHER!B6=\"\",\"\",PREENCHER!B6)","v":"ESCADA PLATAFORMA EM ALUMÍNIO, NR 12, CAPACIDADE MÍNIMA 150 KG, COM BASE FIXA E 2 RODAS TRASEIRAS PARA MOVIMENTAÇÃO. COM CORRIMÃO. "},{"$f":"IF(PREENCHER!C6=\"\",\"\",PREENCHER!C6)","v":"UNIDADE"},{"$f":"IF(PREENCHER!D6=\"\",\"\",PREENCHER!D6)","v":2},{"$f":"IF(preencher!#ref!=\"\",\"\",IF(COUNTIF(PREENCHER!$AF6:$AH6,preencher!#ref!)=0,CONCATENATE(PREENCHER!AO6,#REF!),preencher!#ref!))","v":{"$error":"#NAME?"}},{"$f":"IF(PREENCHER!G6=\"\",\"\",IF(COUNTIF(PREENCHER!$AF6:$AH6,PREENCHER!G6)=0,CONCATENATE(PREENCHER!AP6,#REF!),PREENCHER!G6))","v":{"$error":"#REF!"}},{"$f":"IF(preencher!#ref!=\"\",\"\",IF(COUNTIF(PREENCHER!$AF6:$AH6,preencher!#ref!)=0,CONCATENATE(PREENCHER!AQ6,#REF!),preencher!#ref!))","v":{"$error":"#NAME?"}},{"$f":"IF(preencher!#ref!=\"\",\"\",IF(COUNTIF(PREENCHER!$AF6:$AH6,preencher!#ref!)=0,CONCATENATE(PREENCHER!AR6,#REF!),preencher!#ref!))","v":{"$error":"#NAME?"}},{"$f":"IF(preencher!#ref!=\"\",\"\",IF(COUNTIF(PREENCHER!$AF6:$AH6,preencher!#ref!)=0,CONCATENATE(PREENCHER!AS6,#REF!),preencher!#ref!))","v":{"$error":"#NAME?"}},{"$f":"IF(preencher!#ref!=\"\",\"\",IF(COUNTIF(PREENCHER!$AF6:$AH6,preencher!#ref!)=0,CONCATENATE(PREENCHER!AT6,#REF!),preencher!#ref!))","v":{"$error":"#NAME?"}},{"$f":"IF(preencher!#ref!=\"\",\"\",IF(COUNTIF(PREENCHER!$AF6:$AH6,preencher!#ref!)=0,CONCATENATE(PREENCHER!AU6,#REF!),preencher!#ref!))","v":{"$error":"#NAME?"}},{"$f":"IF(preencher!#ref!=\"\",\"\",IF(COUNTIF(PREENCHER!$AF6:$AH6,preencher!#ref!)=0,CONCATENATE(PREENCHER!AV6,#REF!),preencher!#ref!))","v":{"$error":"#NAME?"}},{"$f":"IF(preencher!#ref!=\"\",\"\",IF(COUNTIF(PREENCHER!$AF6:$AH6,preencher!#ref!)=0,CONCATENATE(PREENCHER!AW6,#REF!),preencher!#ref!))","v":{"$error":"#NAME?"}},{"$f":"IF(preencher!#ref!=\"\",\"\",IF(COUNTIF(PREENCHER!$AF6:$AH6,preencher!#ref!)=0,CONCATENATE(PREENCHER!AX6,#REF!),preencher!#ref!))","v":{"$error":"#NAME?"}},{"$f":"IF(ISERROR(ROUND(AVERAGE(E8:N8),2)),\"\",ROUND(AVERAGE(E8:N8),2))","v":""},{"$f":"IF(ISERROR(ROUND(O8*D8,2)),\"\",ROUND(O8*D8,2))","v":""},null,null,{"$f":"IF(ISERROR(MEDIAN(E8:N8)),\"\",MEDIAN(E8:N8))","v":""},{"$f":"IF(ISERROR(STDEV(E8:N8)),\"\",STDEV(E8:N8))","v":""},{"$f":"IF(ISERROR(T8/O8),\"\",T8/O8)","v":""}]
[{"$f":"IF(PREENCHER!A7=\"\",\"\",PREENCHER!A7)","v":2},{"$f":"IF(PREENCHER!B7=\"\",\"\",PREENCHER!B7)","v":""},{"$f":"IF(PREENCHER!C7=\"\",\"\",PREENCHER!C7)","v":"GRAMAS"},{"$f":"IF(PREENCHER!D7=\"\",\"\",PREENCHER!D7)","v":0},{"$f":"IF(preencher!#ref!=\"\",\"\",IF(COUNTIF(PREENCHER!$AF7:$AH7,preencher!#ref!)=0,CONCATENATE(PREENCHER!AO7,#REF!),preencher!#ref!))","v":{"$error":"#NAME?"}},{"$f":"IF(PREENCHER!G7=\"\",\"\",IF(COUNTIF(PREENCHER!$AF7:$AH7,PREENCHER!G7)=0,CONCATENATE(PREENCHER!AP7,#REF!),PREENCHER!G7))","v":""},{"$f":"IF(preencher!#ref!=\"\",\"\",IF(COUNTIF(PREENCHER!$AF7:$AH7,preencher!#ref!)=0,CONCATENATE(PREENCHER!AQ7,#REF!),preencher!#ref!))","v":{"$error":"#NAME?"}},{"$f":"IF(preencher!#ref!=\"\",\"\",IF(COUNTIF(PREENCHER!$AF7:$AH7,preencher!#ref!)=0,CONCATENATE(PREENCHER!AR7,#REF!),preencher!#ref!))","v":{"$error":"#NAME?"}},{"$f":"IF(preencher!#ref!=\"\",\"\",IF(COUNTIF(PREENCHER!$AF7:$AH7,preencher!#ref!)=0,CONCATENATE(PREENCHER!AS7,#REF!),preencher!#ref!))","v":{"$error":"#NAME?"}},{"$f":"IF(preencher!#ref!=\"\",\"\",IF(COUNTIF(PREENCHER!$AF7:$AH7,preencher!#ref!)=0,CONCATENATE(PREENCHER!AT7,#REF!),preencher!#ref!))","v":{"$error":"#NAME?"}},{"$f":"IF(preencher!#ref!=\"\",\"\",IF(COUNTIF(PREENCHER!$AF7:$AH7,preencher!#ref!)=0,CONCATENATE(PREENCHER!AU7,#REF!),preencher!#ref!))","v":{"$error":"#NAME?"}},{"$f":"IF(preencher!#ref!=\"\",\"\",IF(COUNTIF(PREENCHER!$AF7:$AH7,preencher!#ref!)=0,CONCATENATE(PREENCHER!AV7,#REF!),preencher!#ref!))","v":{"$error":"#NAME?"}},{"$f":"IF(preencher!#ref!=\"\",\"\",IF(COUNTIF(PREENCHER!$AF7:$AH7,preencher!#ref!)=0,CONCATENATE(PREENCHER!AW7,#REF!),preencher!#ref!))","v":{"$error":"#NAME?"}},{"$f":"IF(preencher!#ref!=\"\",\"\",IF(COUNTIF(PREENCHER!$AF7:$AH7,preencher!#ref!)=0,CONCATENATE(PREENCHER!AX7,#REF!),preencher!#ref!))","v":{"$error":"#NAME?"}},{"$f":"IF(ISERROR(ROUND(AVERAGE(E9:N9),2)),\"\",ROUND(AVERAGE(E9:N9),2))","v":""},{"$f":"IF(ISERROR(ROUND(O9*D9,2)),\"\",ROUND(O9*D9,2))","v":""},null,null,{"$f":"IF(ISERROR(MEDIAN(E9:N9)),\"\",MEDIAN(E9:N9))","v":""},{"$f":"IF(ISERROR(STDEV(E9:N9)),\"\",STDEV(E9:N9))","v":""},{"$f":"IF(ISERROR(T9/O9),\"\",T9/O9)","v":""}]
[{"$f":"IF(PREENCHER!A8=\"\",\"\",PREENCHER!A8)","v":3},{"$f":"IF(PREENCHER!B8=\"\",\"\",PREENCHER!B8)","v":""},{"$f":"IF(PREENCHER!C8=\"\",\"\",PREENCHER!C8)","v":"GRAMAS"},{"$f":"IF(PREENCHER!D8=\"\",\"\",PREENCHER!D8)","v":0},{"$f":"IF(preencher!#ref!=\"\",\"\",IF(COUNTIF(PREENCHER!$AF8:$AH8,preencher!#ref!)=0,CONCATENATE(PREENCHER!AO8,#REF!),preencher!#ref!))","v":{"$error":"#NAME?"}},{"$f":"IF(PREENCHER!G8=\"\",\"\",IF(COUNTIF(PREENCHER!$AF8:$AH8,PREENCHER!G8)=0,CONCATENATE(PREENCHER!AP8,#REF!),PREENCHER!G8))","v":""},{"$f":"IF(preencher!#ref!=\"\",\"\",IF(COUNTIF(PREENCHER!$AF8:$AH8,preencher!#ref!)=0,CONCATENATE(PREENCHER!AQ8,#REF!),preencher!#ref!))","v":{"$error":"#NAME?"}},{"$f":"IF(preencher!#ref!=\"\",\"\",IF(COUNTIF(PREENCHER!$AF8:$AH8,preencher!#ref!)=0,CONCATENATE(PREENCHER!AR8,#REF!),preencher!#ref!))","v":{"$error":"#NAME?"}},{"$f":"IF(preencher!#ref!=\"\",\"\",IF(COUNTIF(PREENCHER!$AF8:$AH8,preencher!#ref!)=0,CONCATENATE(PREENCHER!AS8,#REF!),preencher!#ref!))","v":{"$error":"#NAME?"}},{"$f":"IF(preencher!#ref!=\"\",\"\",IF(COUNTIF(PREENCHER!$AF8:$AH8,preencher!#ref!)=0,CONCATENATE(PREENCHER!AT8,#REF!),preencher!#ref!))","v":{"$error":"#NAME?"}},{"$f":"IF(preencher!#ref!=\"\",\"\",IF(COUNTIF(PREENCHER!$AF8:$AH8,preencher!#ref!)=0,CONCATENATE(PREENCHER!AU8,#REF!),preencher!#ref!))","v":{"$error":"#NAME?"}},{"$f":"IF(preencher!#ref!=\"\",\"\",IF(COUNTIF(PREENCHER!$AF8:$AH8,preencher!#ref!)=0,CONCATENATE(PREENCHER!AV8,#REF!),preencher!#ref!))","v":{"$error":"#NAME?"}},{"$f":"IF(preencher!#ref!=\"\",\"\",IF(COUNTIF(PREENCHER!$AF8:$AH8,preencher!#ref!)=0,CONCATENATE(PREENCHER!AW8,#REF!),preencher!#ref!))","v":{"$error":"#NAME?"}},{"$f":"IF(preencher!#ref!=\"\",\"\",IF(COUNTIF(PREENCHER!$AF8:$AH8,preencher!#ref!)=0,CONCATENATE(PREENCHER!AX8,#REF!),preencher!#ref!))","v":{"$error":"#NAME?"}},{"$f":"IF(ISERROR(ROUND(AVERAGE(E10:N10),2)),\"\",ROUND(AVERAGE(E10:N10),2))","v":""},{"$f":"IF(ISERROR(ROUND(O10*D10,2)),\"\",ROUND(O10*D10,2))","v":""},null,null,{"$f":"IF(ISERROR(MEDIAN(E10:N10)),\"\",MEDIAN(E10:N10))","v":""},{"$f":"IF(ISERROR(STDEV(E10:N10)),\"\",STDEV(E10:N10))","v":""},{"$f":"IF(ISERROR(T10/O10),\"\",T10/O10)","v":""}]
[{"$f":"IF(preencher!#ref!=\"\",\"\",preencher!#ref!)","v":{"$error":"#NAME?"}},{"$f":"IF(preencher!#ref!=\"\",\"\",preencher!#ref!)","v":{"$error":"#NAME?"}},{"$f":"IF(preencher!#ref!=\"\",\"\",preencher!#ref!)","v":{"$error":"#NAME?"}},{"$f":"IF(preencher!#ref!=\"\",\"\",preencher!#ref!)","v":{"$error":"#NAME?"}},{"$f":"IF(preencher!#ref!=\"\",\"\",IF(COUNTIF(preencher!#ref!,preencher!#ref!)=0,CONCATENATE(preencher!#ref!,#REF!),preencher!#ref!))","v":{"$error":"#NAME?"}},{"$f":"IF(preencher!#ref!=\"\",\"\",IF(COUNTIF(preencher!#ref!,preencher!#ref!)=0,CONCATENATE(preencher!#ref!,#REF!),preencher!#ref!))","v":{"$error":"#NAME?"}},{"$f":"IF(preencher!#ref!=\"\",\"\",IF(COUNTIF(preencher!#ref!,preencher!#ref!)=0,CONCATENATE(preencher!#ref!,#REF!),preencher!#ref!))","v":{"$error":"#NAME?"}},{"$f":"IF(preencher!#ref!=\"\",\"\",IF(COUNTIF(preencher!#ref!,preencher!#ref!)=0,CONCATENATE(preencher!#ref!,#REF!),preencher!#ref!))","v":{"$error":"#NAME?"}},{"$f":"IF(preencher!#ref!=\"\",\"\",IF(COUNTIF(preencher!#ref!,preencher!#ref!)=0,CONCATENATE(preencher!#ref!,#REF!),preencher!#ref!))","v":{"$error":"#NAME?"}},{"$f":"IF(preencher!#ref!=\"\",\"\",IF(COUNTIF(preencher!#ref!,preencher!#ref!)=0,CONCATENATE(preencher!#ref!,#REF!),preencher!#ref!))","v":{"$error":"#NAME?"}},{"$f":"IF(preencher!#ref!=\"\",\"\",IF(COUNTIF(preencher!#ref!,preencher!#ref!)=0,CONCATENATE(preencher!#ref!,#REF!),preencher!#ref!))","v":{"$error":"#NAME?"}},{"$f":"IF(preencher!#ref!=\"\",\"\",IF(COUNTIF(preencher!#ref!,preencher!#ref!)=0,CONCATENATE(preencher!#ref!,#REF!),preencher!#ref!))","v":{"$error":"#NAME?"}},{"$f":"IF(preencher!#ref!=\"\",\"\",IF(COUNTIF(preencher!#ref!,preencher!#ref!)=0,CONCATENATE(preencher!#ref!,#REF!),preencher!#ref!))","v":{"$error":"#NAME?"}},{"$f":"IF(preencher!#ref!=\"\",\"\",IF(COUNTIF(preencher!#ref!,preencher!#ref!)=0,CONCATENATE(preencher!#ref!,#REF!),preencher!#ref!))","v":{"$error":"#NAME?"}},{"$f":"IF(ISERROR(ROUND(AVERAGE(E11:N11),2)),\"\",ROUND(AVERAGE(E11:N11),2))","v":""},{"$f":"IF(ISERROR(ROUND(O11*D11,2)),\"\",ROUND(O11*D11,2))","v":""},null,null,{"$f":"IF(ISERROR(MEDIAN(E11:N11)),\"\",MEDIAN(E11:N11))","v":""},{"$f":"IF(ISERROR(STDEV(E11:N11)),\"\",STDEV(E11:N11))","v":""},{"$f":"IF(ISERROR(T11/O11),\"\",T11/O11)","v":""}]
[{"$f":"IF(preencher!#ref!=\"\",\"\",preencher!#ref!)","v":{"$error":"#NAME?"}},{"$f":"IF(preencher!#ref!=\"\",\"\",preencher!#ref!)","v":{"$error":"#NAME?"}},{"$f":"IF(preencher!#ref!=\"\",\"\",preencher!#ref!)","v":{"$error":"#NAME?"}},{"$f":"IF(preencher!#ref!=\"\",\"\",preencher!#ref!)","v":{"$error":"#NAME?"}},{"$f":"IF(preencher!#ref!=\"\",\"\",IF(COUNTIF(preencher!#ref!,preencher!#ref!)=0,CONCATENATE(preencher!#ref!,#REF!),preencher!#ref!))","v":{"$error":"#NAME?"}},{"$f":"IF(preencher!#ref!=\"\",\"\",IF(COUNTIF(preencher!#ref!,preencher!#ref!)=0,CONCATENATE(preencher!#ref!,#REF!),preencher!#ref!))","v":{"$error":"#NAME?"}},{"$f":"IF(preencher!#ref!=\"\",\"\",IF(COUNTIF(preencher!#ref!,preencher!#ref!)=0,CONCATENATE(preencher!#ref!,#REF!),preencher!#ref!))","v":{"$error":"#NAME?"}},{"$f":"IF(preencher!#ref!=\"\",\"\",IF(COUNTIF(preencher!#ref!,preencher!#ref!)=0,CONCATENATE(preencher!#ref!,#REF!),preencher!#ref!))","v":{"$error":"#NAME?"}},{"$f":"IF(preencher!#ref!=\"\",\"\",IF(COUNTIF(preencher!#ref!,preencher!#ref!)=0,CONCATENATE(preencher!#ref!,#REF!),preencher!#ref!))","v":{"$error":"#NAME?"}},{"$f":"IF(preencher!#ref!=\"\",\"\",IF(COUNTIF(preencher!#ref!,preencher!#ref!)=0,CONCATENATE(preencher!#ref!,#REF!),preencher!#ref!))","v":{"$error":"#NAME?"}},{"$f":"IF(preencher!#ref!=\"\",\"\",IF(COUNTIF(preencher!#ref!,preencher!#ref!)=0,CONCATENATE(preencher!#ref!,#REF!),preencher!#ref!))","v":{"$error":"#NAME?"}},{"$f":"IF(preencher!#ref!=\"\",\"\",IF(COUNTIF(preencher!#ref!,preencher!#ref!)=0,CONCATENATE(preencher!#ref!,#REF!),preencher!#ref!))","v":{"$error":"#NAME?"}},{"$f":"IF(preencher!#ref!=\"\",\"\",IF(COUNTIF(preencher!#ref!,preencher!#ref!)=0,CONCATENATE(preencher!#ref!,#REF!),preencher!#ref!))","v":{"$error":"#NAME?"}},{"$f":"IF(preencher!#ref!=\"\",\"\",IF(COUNTIF(preencher!#ref!,preencher!#ref!)=0,CONCATENATE(preencher!#ref!,#REF!),preencher!#ref!))","v":{"$error":"#NAME?"}},{"$f":"IF(ISERROR(ROUND(AVERAGE(E12:N12),2)),\"\",ROUND(AVERAGE(E12:N12),2))","v":""},{"$f":"IF(ISERROR(ROUND(O12*D12,2)),\"\",ROUND(O12*D12,2))","v":""},null,null,{"$f":"IF(ISERROR(MEDIAN(E12:N12)),\"\",MEDIAN(E12:N12))","v":""},{"$f":"IF(ISERROR(STDEV(E12:N12)),\"\",STDEV(E12:N12))","v":""},{"$f":"IF(ISERROR(T12/O12),\"\",T12/O12)","v":""}]
[{"$f":"IF(preencher!#ref!=\"\",\"\",preencher!#ref!)","v":{"$error":"#NAME?"}},{"$f":"IF(preencher!#ref!=\"\",\"\",preencher!#ref!)","v":{"$error":"#NAME?"}},{"$f":"IF(preencher!#ref!=\"\",\"\",preencher!#ref!)","v":{"$error":"#NAME?"}},{"$f":"IF(preencher!#ref!=\"\",\"\",preencher!#ref!)","v":{"$error":"#NAME?"}},{"$f":"IF(preencher!#ref!=\"\",\"\",IF(COUNTIF(preencher!#ref!,preencher!#ref!)=0,CONCATENATE(preencher!#ref!,#REF!),preencher!#ref!))","v":{"$error":"#NAME?"}},{"$f":"IF(preencher!#ref!=\"\",\"\",IF(COUNTIF(preencher!#ref!,preencher!#ref!)=0,CONCATENATE(preencher!#ref!,#REF!),preencher!#ref!))","v":{"$error":"#NAME?"}},{"$f":"IF(preencher!#ref!=\"\",\"\",IF(COUNTIF(preencher!#ref!,preencher!#ref!)=0,CONCATENATE(preencher!#ref!,#REF!),preencher!#ref!))","v":{"$error":"#NAME?"}},{"$f":"IF(preencher!#ref!=\"\",\"\",IF(COUNTIF(preencher!#ref!,preencher!#ref!)=0,CONCATENATE(preencher!#ref!,#REF!),preencher!#ref!))","v":{"$error":"#NAME?"}},{"$f":"IF(preencher!#ref!=\"\",\"\",IF(COUNTIF(preencher!#ref!,preencher!#ref!)=0,CONCATENATE(preencher!#ref!,#REF!),preencher!#ref!))","v":{"$error":"#NAME?"}},{"$f":"IF(preencher!#ref!=\"\",\"\",IF(COUNTIF(preencher!#ref!,preencher!#ref!)=0,CONCATENATE(preencher!#ref!,#REF!),preencher!#ref!))","v":{"$error":"#NAME?"}},{"$f":"IF(preencher!#ref!=\"\",\"\",IF(COUNTIF(preencher!#ref!,preencher!#ref!)=0,CONCATENATE(preencher!#ref!,#REF!),preencher!#ref!))","v":{"$error":"#NAME?"}},{"$f":"IF(preencher!#ref!=\"\",\"\",IF(COUNTIF(preencher!#ref!,preencher!#ref!)=0,CONCATENATE(preencher!#ref!,#REF!),preencher!#ref!))","v":{"$error":"#NAME?"}},{"$f":"IF(preencher!#ref!=\"\",\"\",IF(COUNTIF(preencher!#ref!,preencher!#ref!)=0,CONCATENATE(preencher!#ref!,#REF!),preencher!#ref!))","v":{"$error":"#NAME?"}},{"$f":"IF(preencher!#ref!=\"\",\"\",IF(COUNTIF(preencher!#ref!,preencher!#ref!)=0,CONCATENATE(preencher!#ref!,#REF!),preencher!#ref!))","v":{"$error":"#NAME?"}},{"$f":"IF(ISERROR(ROUND(AVERAGE(E13:N13),2)),\"\",ROUND(AVERAGE(E13:N13),2))","v":""},{"$f":"IF(ISERROR(ROUND(O13*D13,2)),\"\",ROUND(O13*D13,2))","v":""},null,null,{"$f":"IF(ISERROR(MEDIAN(E13:N13)),\"\",MEDIAN(E13:N13))","v":""},{"$f":"IF(ISERROR(STDEV(E13:N13)),\"\",STDEV(E13:N13))","v":""},{"$f":"IF(ISERROR(T13/O13),\"\",T13/O13)","v":""}]
[{"$f":"IF(preencher!#ref!=\"\",\"\",preencher!#ref!)","v":{"$error":"#NAME?"}},{"$f":"IF(preencher!#ref!=\"\",\"\",preencher!#ref!)","v":{"$error":"#NAME?"}},{"$f":"IF(preencher!#ref!=\"\",\"\",preencher!#ref!)","v":{"$error":"#NAME?"}},{"$f":"IF(preencher!#ref!=\"\",\"\",preencher!#ref!)","v":{"$error":"#NAME?"}},{"$f":"IF(preencher!#ref!=\"\",\"\",IF(COUNTIF(preencher!#ref!,preencher!#ref!)=0,CONCATENATE(preencher!#ref!,#REF!),preencher!#ref!))","v":{"$error":"#NAME?"}},{"$f":"IF(preencher!#ref!=\"\",\"\",IF(COUNTIF(preencher!#ref!,preencher!#ref!)=0,CONCATENATE(preencher!#ref!,#REF!),preencher!#ref!))","v":{"$error":"#NAME?"}},{"$f":"IF(preencher!#ref!=\"\",\"\",IF(COUNTIF(preencher!#ref!,preencher!#ref!)=0,CONCATENATE(preencher!#ref!,#REF!),preencher!#ref!))","v":{"$error":"#NAME?"}},{"$f":"IF(preencher!#ref!=\"\",\"\",IF(COUNTIF(preencher!#ref!,preencher!#ref!)=0,CONCATENATE(preencher!#ref!,#REF!),preencher!#ref!))","v":{"$error":"#NAME?"}},{"$f":"IF(preencher!#ref!=\"\",\"\",IF(COUNTIF(preencher!#ref!,preencher!#ref!)=0,CONCATENATE(preencher!#ref!,#REF!),preencher!#ref!))","v":{"$error":"#NAME?"}},{"$f":"IF(preencher!#ref!=\"\",\"\",IF(COUNTIF(preencher!#ref!,preencher!#ref!)=0,CONCATENATE(preencher!#ref!,#REF!),preencher!#ref!))","v":{"$error":"#NAME?"}},{"$f":"IF(preencher!#ref!=\"\",\"\",IF(COUNTIF(preencher!#ref!,preencher!#ref!)=0,CONCATENATE(preencher!#ref!,#REF!),preencher!#ref!))","v":{"$error":"#NAME?"}},{"$f":"IF(preencher!#ref!=\"\",\"\",IF(COUNTIF(preencher!#ref!,preencher!#ref!)=0,CONCATENATE(preencher!#ref!,#REF!),preencher!#ref!))","v":{"$error":"#NAME?"}},{"$f":"IF(preencher!#ref!=\"\",\"\",IF(COUNTIF(preencher!#ref!,preencher!#ref!)=0,CONCATENATE(preencher!#ref!,#REF!),preencher!#ref!))","v":{"$error":"#NAME?"}},{"$f":"IF(preencher!#ref!=\"\",\"\",IF(COUNTIF(preencher!#ref!,preencher!#ref!)=0,CONCATENATE(preencher!#ref!,#REF!),preencher!#ref!))","v":{"$error":"#NAME?"}},{"$f":"IF(ISERROR(ROUND(AVERAGE(E14:N14),2)),\"\",ROUND(AVERAGE(E14:N14),2))","v":""},{"$f":"IF(ISERROR(ROUND(O14*D14,2)),\"\",ROUND(O14*D14,2))","v":""},null,null,{"$f":"IF(ISERROR(MEDIAN(E14:N14)),\"\",MEDIAN(E14:N14))","v":""},{"$f":"IF(ISERROR(STDEV(E14:N14)),\"\",STDEV(E14:N14))","v":""},{"$f":"IF(ISERROR(T14/O14),\"\",T14/O14)","v":""}]
[{"$f":"IF(preencher!#ref!=\"\",\"\",preencher!#ref!)","v":{"$error":"#NAME?"}},{"$f":"IF(preencher!#ref!=\"\",\"\",preencher!#ref!)","v":{"$error":"#NAME?"}},{"$f":"IF(preencher!#ref!=\"\",\"\",preencher!#ref!)","v":{"$error":"#NAME?"}},{"$f":"IF(preencher!#ref!=\"\",\"\",preencher!#ref!)","v":{"$error":"#NAME?"}},{"$f":"IF(preencher!#ref!=\"\",\"\",IF(COUNTIF(preencher!#ref!,preencher!#ref!)=0,CONCATENATE(preencher!#ref!,#REF!),preencher!#ref!))","v":{"$error":"#NAME?"}},{"$f":"IF(preencher!#ref!=\"\",\"\",IF(COUNTIF(preencher!#ref!,preencher!#ref!)=0,CONCATENATE(preencher!#ref!,#REF!),preencher!#ref!))","v":{"$error":"#NAME?"}},{"$f":"IF(preencher!#ref!=\"\",\"\",IF(COUNTIF(preencher!#ref!,preencher!#ref!)=0,CONCATENATE(preencher!#ref!,#REF!),preencher!#ref!))","v":{"$error":"#NAME?"}},{"$f":"IF(preencher!#ref!=\"\",\"\",IF(COUNTIF(preencher!#ref!,preencher!#ref!)=0,CONCATENATE(preencher!#ref!,#REF!),preencher!#ref!))","v":{"$error":"#NAME?"}},{"$f":"IF(preencher!#ref!=\"\",\"\",IF(COUNTIF(preencher!#ref!,preencher!#ref!)=0,CONCATENATE(preencher!#ref!,#REF!),preencher!#ref!))","v":{"$error":"#NAME?"}},{"$f":"IF(preencher!#ref!=\"\",\"\",IF(COUNTIF(preencher!#ref!,preencher!#ref!)=0,CONCATENATE(preencher!#ref!,#REF!),preencher!#ref!))","v":{"$error":"#NAME?"}},{"$f":"IF(preencher!#ref!=\"\",\"\",IF(COUNTIF(preencher!#ref!,preencher!#ref!)=0,CONCATENATE(preencher!#ref!,#REF!),preencher!#ref!))","v":{"$error":"#NAME?"}},{"$f":"IF(preencher!#ref!=\"\",\"\",IF(COUNTIF(preencher!#ref!,preencher!#ref!)=0,CONCATENATE(preencher!#ref!,#REF!),preencher!#ref!))","v":{"$error":"#NAME?"}},{"$f":"IF(preencher!#ref!=\"\",\"\",IF(COUNTIF(preencher!#ref!,preencher!#ref!)=0,CONCATENATE(preencher!#ref!,#REF!),preencher!#ref!))","v":{"$error":"#NAME?"}},{"$f":"IF(preencher!#ref!=\"\",\"\",IF(COUNTIF(preencher!#ref!,preencher!#ref!)=0,CONCATENATE(preencher!#ref!,#REF!),preencher!#ref!))","v":{"$error":"#NAME?"}},{"$f":"IF(ISERROR(ROUND(AVERAGE(E15:N15),2)),\"\",ROUND(AVERAGE(E15:N15),2))","v":""},{"$f":"IF(ISERROR(ROUND(O15*D15,2)),\"\",ROUND(O15*D15,2))","v":""},null,null,{"$f":"IF(ISERROR(MEDIAN(E15:N15)),\"\",MEDIAN(E15:N15))","v":""},{"$f":"IF(ISERROR(STDEV(E15:N15)),\"\",STDEV(E15:N15))","v":""},{"$f":"IF(ISERROR(T15/O15),\"\",T15/O15)","v":""}]
[{"$f":"IF(preencher!#ref!=\"\",\"\",preencher!#ref!)","v":{"$error":"#NAME?"}},{"$f":"IF(preencher!#ref!=\"\",\"\",preencher!#ref!)","v":{"$error":"#NAME?"}},{"$f":"IF(preencher!#ref!=\"\",\"\",preencher!#ref!)","v":{"$error":"#NAME?"}},{"$f":"IF(preencher!#ref!=\"\",\"\",preencher!#ref!)","v":{"$error":"#NAME?"}},{"$f":"IF(preencher!#ref!=\"\",\"\",IF(COUNTIF(preencher!#ref!,preencher!#ref!)=0,CONCATENATE(preencher!#ref!,#REF!),preencher!#ref!))","v":{"$error":"#NAME?"}},{"$f":"IF(preencher!#ref!=\"\",\"\",IF(COUNTIF(preencher!#ref!,preencher!#ref!)=0,CONCATENATE(preencher!#ref!,#REF!),preencher!#ref!))","v":{"$error":"#NAME?"}},{"$f":"IF(preencher!#ref!=\"\",\"\",IF(COUNTIF(preencher!#ref!,preencher!#ref!)=0,CONCATENATE(preencher!#ref!,#REF!),preencher!#ref!))","v":{"$error":"#NAME?"}},{"$f":"IF(preencher!#ref!=\"\",\"\",IF(COUNTIF(preencher!#ref!,preencher!#ref!)=0,CONCATENATE(preencher!#ref!,#REF!),preencher!#ref!))","v":{"$error":"#NAME?"}},{"$f":"IF(preencher!#ref!=\"\",\"\",IF(COUNTIF(preencher!#ref!,preencher!#ref!)=0,CONCATENATE(preencher!#ref!,#REF!),preencher!#ref!))","v":{"$error":"#NAME?"}},{"$f":"IF(preencher!#ref!=\"\",\"\",IF(COUNTIF(preencher!#ref!,preencher!#ref!)=0,CONCATENATE(preencher!#ref!,#REF!),preencher!#ref!))","v":{"$error":"#NAME?"}},{"$f":"IF(preencher!#ref!=\"\",\"\",IF(COUNTIF(preencher!#ref!,preencher!#ref!)=0,CONCATENATE(preencher!#ref!,#REF!),preencher!#ref!))","v":{"$error":"#NAME?"}},{"$f":"IF(preencher!#ref!=\"\",\"\",IF(COUNTIF(preencher!#ref!,preencher!#ref!)=0,CONCATENATE(preencher!#ref!,#REF!),preencher!#ref!))","v":{"$error":"#NAME?"}},{"$f":"IF(preencher!#ref!=\"\",\"\",IF(COUNTIF(preencher!#ref!,preencher!#ref!)=0,CONCATENATE(preencher!#ref!,#REF!),preencher!#ref!))","v":{"$error":"#NAME?"}},{"$f":"IF(preencher!#ref!=\"\",\"\",IF(COUNTIF(preencher!#ref!,preencher!#ref!)=0,CONCATENATE(preencher!#ref!,#REF!),preencher!#ref!))","v":{"$error":"#NAME?"}},{"$f":"IF(ISERROR(ROUND(AVERAGE(E16:N16),2)),\"\",ROUND(AVERAGE(E16:N16),2))","v":""},{"$f":"IF(ISERROR(ROUND(O16*D16,2)),\"\",ROUND(O16*D16,2))","v":""},null,null,{"$f":"IF(ISERROR(MEDIAN(E16:N16)),\"\",MEDIAN(E16:N16))","v":""},{"$f":"IF(ISERROR(STDEV(E16:N16)),\"\",STDEV(E16:N16))","v":""},{"$f":"IF(ISERROR(T16/O16),\"\",T16/O16)","v":""}]
[{"$f":"IF(preencher!#ref!=\"\",\"\",preencher!#ref!)","v":{"$error":"#NAME?"}},{"$f":"IF(preencher!#ref!=\"\",\"\",preencher!#ref!)","v":{"$error":"#NAME?"}},{"$f":"IF(preencher!#ref!=\"\",\"\",preencher!#ref!)","v":{"$error":"#NAME?"}},{"$f":"IF(preencher!#ref!=\"\",\"\",preencher!#ref!)","v":{"$error":"#NAME?"}},{"$f":"IF(preencher!#ref!=\"\",\"\",IF(COUNTIF(preencher!#ref!,preencher!#ref!)=0,CONCATENATE(preencher!#ref!,#REF!),preencher!#ref!))","v":{"$error":"#NAME?"}},{"$f":"IF(preencher!#ref!=\"\",\"\",IF(COUNTIF(preencher!#ref!,preencher!#ref!)=0,CONCATENATE(preencher!#ref!,#REF!),preencher!#ref!))","v":{"$error":"#NAME?"}},{"$f":"IF(preencher!#ref!=\"\",\"\",IF(COUNTIF(preencher!#ref!,preencher!#ref!)=0,CONCATENATE(preencher!#ref!,#REF!),preencher!#ref!))","v":{"$error":"#NAME?"}},{"$f":"IF(preencher!#ref!=\"\",\"\",IF(COUNTIF(preencher!#ref!,preencher!#ref!)=0,CONCATENATE(preencher!#ref!,#REF!),preencher!#ref!))","v":{"$error":"#NAME?"}},{"$f":"IF(preencher!#ref!=\"\",\"\",IF(COUNTIF(preencher!#ref!,preencher!#ref!)=0,CONCATENATE(preencher!#ref!,#REF!),preencher!#ref!))","v":{"$error":"#NAME?"}},{"$f":"IF(preencher!#ref!=\"\",\"\",IF(COUNTIF(preencher!#ref!,preencher!#ref!)=0,CONCATENATE(preencher!#ref!,#REF!),preencher!#ref!))","v":{"$error":"#NAME?"}},{"$f":"IF(preencher!#ref!=\"\",\"\",IF(COUNTIF(preencher!#ref!,preencher!#ref!)=0,CONCATENATE(preencher!#ref!,#REF!),preencher!#ref!))","v":{"$error":"#NAME?"}},{"$f":"IF(preencher!#ref!=\"\",\"\",IF(COUNTIF(preencher!#ref!,preencher!#ref!)=0,CONCATENATE(preencher!#ref!,#REF!),preencher!#ref!))","v":{"$error":"#NAME?"}},{"$f":"IF(preencher!#ref!=\"\",\"\",IF(COUNTIF(preencher!#ref!,preencher!#ref!)=0,CONCATENATE(preencher!#ref!,#REF!),preencher!#ref!))","v":{"$error":"#NAME?"}},{"$f":"IF(preencher!#ref!=\"\",\"\",IF(COUNTIF(preencher!#ref!,preencher!#ref!)=0,CONCATENATE(preencher!#ref!,#REF!),preencher!#ref!))","v":{"$error":"#NAME?"}},{"$f":"IF(ISERROR(ROUND(AVERAGE(E17:N17),2)),\"\",ROUND(AVERAGE(E17:N17),2))","v":""},{"$f":"IF(ISERROR(ROUND(O17*D17,2)),\"\",ROUND(O17*D17,2))","v":""},null,null,{"$f":"IF(ISERROR(MEDIAN(E17:N17)),\"\",MEDIAN(E17:N17))","v":""},{"$f":"IF(ISERROR(STDEV(E17:N17)),\"\",STDEV(E17:N17))","v":""},{"$f":"IF(ISERROR(T17/O17),\"\",T17/O17)","v":""}]
[{"$f":"IF(preencher!#ref!=\"\",\"\",preencher!#ref!)","v":{"$error":"#NAME?"}},{"$f":"IF(preencher!#ref!=\"\",\"\",preencher!#ref!)","v":{"$error":"#NAME?"}},{"$f":"IF(preencher!#ref!=\"\",\"\",preencher!#ref!)","v":{"$error":"#NAME?"}},{"$f":"IF(preencher!#ref!=\"\",\"\",preencher!#ref!)","v":{"$error":"#NAME?"}},{"$f":"IF(preencher!#ref!=\"\",\"\",IF(COUNTIF(preencher!#ref!,preencher!#ref!)=0,CONCATENATE(preencher!#ref!,#REF!),preencher!#ref!))","v":{"$error":"#NAME?"}},{"$f":"IF(preencher!#ref!=\"\",\"\",IF(COUNTIF(preencher!#ref!,preencher!#ref!)=0,CONCATENATE(preencher!#ref!,#REF!),preencher!#ref!))","v":{"$error":"#NAME?"}},{"$f":"IF(preencher!#ref!=\"\",\"\",IF(COUNTIF(preencher!#ref!,preencher!#ref!)=0,CONCATENATE(preencher!#ref!,#REF!),preencher!#ref!))","v":{"$error":"#NAME?"}},{"$f":"IF(preencher!#ref!=\"\",\"\",IF(COUNTIF(preencher!#ref!,preencher!#ref!)=0,CONCATENATE(preencher!#ref!,#REF!),preencher!#ref!))","v":{"$error":"#NAME?"}},{"$f":"IF(preencher!#ref!=\"\",\"\",IF(COUNTIF(preencher!#ref!,preencher!#ref!)=0,CONCATENATE(preencher!#ref!,#REF!),preencher!#ref!))","v":{"$error":"#NAME?"}},{"$f":"IF(preencher!#ref!=\"\",\"\",IF(COUNTIF(preencher!#ref!,preencher!#ref!)=0,CONCATENATE(preencher!#ref!,#REF!),preencher!#ref!))","v":{"$error":"#NAME?"}},{"$f":"IF(preencher!#ref!=\"\",\"\",IF(COUNTIF(preencher!#ref!,preencher!#ref!)=0,CONCATENATE(preencher!#ref!,#REF!),preencher!#ref!))","v":{"$error":"#NAME?"}},{"$f":"IF(preencher!#ref!=\"\",\"\",IF(COUNTIF(preencher!#ref!,preencher!#ref!)=0,CONCATENATE(preencher!#ref!,#REF!),preencher!#ref!))","v":{"$error":"#NAME?"}},{"$f":"IF(preencher!#ref!=\"\",\"\",IF(COUNTIF(preencher!#ref!,preencher!#ref!)=0,CONCATENATE(preencher!#ref!,#REF!),preencher!#ref!))","v":{"$error":"#NAME?"}},{"$f":"IF(preencher!#ref!=\"\",\"\",IF(COUNTIF(preencher!#ref!,preencher!#ref!)=0,CONCATENATE(preencher!#ref!,#REF!),preencher!#ref!))","v":{"$error":"#NAME?"}},{"$f":"IF(ISERROR(ROUND(AVERAGE(E18:N18),2)),\"\",ROUND(AVERAGE(E18:N18),2))","v":""},{"$f":"IF(ISERROR(ROUND(O18*D18,2)),\"\",ROUND(O18*D18,2))","v":""},null,null,{"$f":"IF(ISERROR(MEDIAN(E18:N18)),\"\",MEDIAN(E18:N18))","v":""},{"$f":"IF(ISERROR(STDEV(E18:N18)),\"\",STDEV(E18:N18))","v":""},{"$f":"IF(ISERROR(T18/O18),\"\",T18/O18)","v":""}]
[{"$f":"IF(preencher!#ref!=\"\",\"\",preencher!#ref!)","v":{"$error":"#NAME?"}},{"$f":"IF(preencher!#ref!=\"\",\"\",preencher!#ref!)","v":{"$error":"#NAME?"}},{"$f":"IF(preencher!#ref!=\"\",\"\",preencher!#ref!)","v":{"$error":"#NAME?"}},{"$f":"IF(preencher!#ref!=\"\",\"\",preencher!#ref!)","v":{"$error":"#NAME?"}},{"$f":"IF(preencher!#ref!=\"\",\"\",IF(COUNTIF(preencher!#ref!,preencher!#ref!)=0,CONCATENATE(preencher!#ref!,#REF!),preencher!#ref!))","v":{"$error":"#NAME?"}},{"$f":"IF(preencher!#ref!=\"\",\"\",IF(COUNTIF(preencher!#ref!,preencher!#ref!)=0,CONCATENATE(preencher!#ref!,#REF!),preencher!#ref!))","v":{"$error":"#NAME?"}},{"$f":"IF(preencher!#ref!=\"\",\"\",IF(COUNTIF(preencher!#ref!,preencher!#ref!)=0,CONCATENATE(preencher!#ref!,#REF!),preencher!#ref!))","v":{"$error":"#NAME?"}},{"$f":"IF(preencher!#ref!=\"\",\"\",IF(COUNTIF(preencher!#ref!,preencher!#ref!)=0,CONCATENATE(preencher!#ref!,#REF!),preencher!#ref!))","v":{"$error":"#NAME?"}},{"$f":"IF(preencher!#ref!=\"\",\"\",IF(COUNTIF(preencher!#ref!,preencher!#ref!)=0,CONCATENATE(preencher!#ref!,#REF!),preencher!#ref!))","v":{"$error":"#NAME?"}},{"$f":"IF(preencher!#ref!=\"\",\"\",IF(COUNTIF(preencher!#ref!,preencher!#ref!)=0,CONCATENATE(preencher!#ref!,#REF!),preencher!#ref!))","v":{"$error":"#NAME?"}},{"$f":"IF(preencher!#ref!=\"\",\"\",IF(COUNTIF(preencher!#ref!,preencher!#ref!)=0,CONCATENATE(preencher!#ref!,#REF!),preencher!#ref!))","v":{"$error":"#NAME?"}},{"$f":"IF(preencher!#ref!=\"\",\"\",IF(COUNTIF(preencher!#ref!,preencher!#ref!)=0,CONCATENATE(preencher!#ref!,#REF!),preencher!#ref!))","v":{"$error":"#NAME?"}},{"$f":"IF(preencher!#ref!=\"\",\"\",IF(COUNTIF(preencher!#ref!,preencher!#ref!)=0,CONCATENATE(preencher!#ref!,#REF!),preencher!#ref!))","v":{"$error":"#NAME?"}},{"$f":"IF(preencher!#ref!=\"\",\"\",IF(COUNTIF(preencher!#ref!,preencher!#ref!)=0,CONCATENATE(preencher!#ref!,#REF!),preencher!#ref!))","v":{"$error":"#NAME?"}},{"$f":"IF(ISERROR(ROUND(AVERAGE(E19:N19),2)),\"\",ROUND(AVERAGE(E19:N19),2))","v":""},{"$f":"IF(ISERROR(ROUND(O19*D19,2)),\"\",ROUND(O19*D19,2))","v":""},null,null,{"$f":"IF(ISERROR(MEDIAN(E19:N19)),\"\",MEDIAN(E19:N19))","v":""},{"$f":"IF(ISERROR(STDEV(E19:N19)),\"\",STDEV(E19:N19))","v":""},{"$f":"IF(ISERROR(T19/O19),\"\",T19/O19)","v":""}]
[{"$f":"IF(preencher!#ref!=\"\",\"\",preencher!#ref!)","v":{"$error":"#NAME?"}},{"$f":"IF(preencher!#ref!=\"\",\"\",preencher!#ref!)","v":{"$error":"#NAME?"}},{"$f":"IF(preencher!#ref!=\"\",\"\",preencher!#ref!)","v":{"$error":"#NAME?"}},{"$f":"IF(preencher!#ref!=\"\",\"\",preencher!#ref!)","v":{"$error":"#NAME?"}},{"$f":"IF(preencher!#ref!=\"\",\"\",IF(COUNTIF(preencher!#ref!,preencher!#ref!)=0,CONCATENATE(preencher!#ref!,#REF!),preencher!#ref!))","v":{"$error":"#NAME?"}},{"$f":"IF(preencher!#ref!=\"\",\"\",IF(COUNTIF(preencher!#ref!,preencher!#ref!)=0,CONCATENATE(preencher!#ref!,#REF!),preencher!#ref!))","v":{"$error":"#NAME?"}},{"$f":"IF(preencher!#ref!=\"\",\"\",IF(COUNTIF(preencher!#ref!,preencher!#ref!)=0,CONCATENATE(preencher!#ref!,#REF!),preencher!#ref!))","v":{"$error":"#NAME?"}},{"$f":"IF(preencher!#ref!=\"\",\"\",IF(COUNTIF(preencher!#ref!,preencher!#ref!)=0,CONCATENATE(preencher!#ref!,#REF!),preencher!#ref!))","v":{"$error":"#NAME?"}},{"$f":"IF(preencher!#ref!=\"\",\"\",IF(COUNTIF(preencher!#ref!,preencher!#ref!)=0,CONCATENATE(preencher!#ref!,#REF!),preencher!#ref!))","v":{"$error":"#NAME?"}},{"$f":"IF(preencher!#ref!=\"\",\"\",IF(COUNTIF(preencher!#ref!,preencher!#ref!)=0,CONCATENATE(preencher!#ref!,#REF!),preencher!#ref!))","v":{"$error":"#NAME?"}},{"$f":"IF(preencher!#ref!=\"\",\"\",IF(COUNTIF(preencher!#ref!,preencher!#ref!)=0,CONCATENATE(preencher!#ref!,#REF!),preencher!#ref!))","v":{"$error":"#NAME?"}},{"$f":"IF(preencher!#ref!=\"\",\"\",IF(COUNTIF(preencher!#ref!,preencher!#ref!)=0,CONCATENATE(preencher!#ref!,#REF!),preencher!#ref!))","v":{"$error":"#NAME?"}},{"$f":"IF(preencher!#ref!=\"\",\"\",IF(COUNTIF(preencher!#ref!,preencher!#ref!)=0,CONCATENATE(preencher!#ref!,#REF!),preencher!#ref!))","v":{"$error":"#NAME?"}},{"$f":"IF(preencher!#ref!=\"\",\"\",IF(COUNTIF(preencher!#ref!,preencher!#ref!)=0,CONCATENATE(preencher!#ref!,#REF!),preencher!#ref!))","v":{"$error":"#NAME?"}},{"$f":"IF(ISERROR(ROUND(AVERAGE(E20:N20),2)),\"\",ROUND(AVERAGE(E20:N20),2))","v":""},{"$f":"IF(ISERROR(ROUND(O20*D20,2)),\"\",ROUND(O20*D20,2))","v":""},null,null,{"$f":"IF(ISERROR(MEDIAN(E20:N20)),\"\",MEDIAN(E20:N20))","v":""},{"$f":"IF(ISERROR(STDEV(E20:N20)),\"\",STDEV(E20:N20))","v":""},{"$f":"IF(ISERROR(T20/O20),\"\",T20/O20)","v":""}]
[{"$f":"IF(preencher!#ref!=\"\",\"\",preencher!#ref!)","v":{"$error":"#NAME?"}},{"$f":"IF(preencher!#ref!=\"\",\"\",preencher!#ref!)","v":{"$error":"#NAME?"}},{"$f":"IF(preencher!#ref!=\"\",\"\",preencher!#ref!)","v":{"$error":"#NAME?"}},{"$f":"IF(preencher!#ref!=\"\",\"\",preencher!#ref!)","v":{"$error":"#NAME?"}},{"$f":"IF(preencher!#ref!=\"\",\"\",IF(COUNTIF(preencher!#ref!,preencher!#ref!)=0,CONCATENATE(preencher!#ref!,#REF!),preencher!#ref!))","v":{"$error":"#NAME?"}},{"$f":"IF(preencher!#ref!=\"\",\"\",IF(COUNTIF(preencher!#ref!,preencher!#ref!)=0,CONCATENATE(preencher!#ref!,#REF!),preencher!#ref!))","v":{"$error":"#NAME?"}},{"$f":"IF(preencher!#ref!=\"\",\"\",IF(COUNTIF(preencher!#ref!,preencher!#ref!)=0,CONCATENATE(preencher!#ref!,#REF!),preencher!#ref!))","v":{"$error":"#NAME?"}},{"$f":"IF(preencher!#ref!=\"\",\"\",IF(COUNTIF(preencher!#ref!,preencher!#ref!)=0,CONCATENATE(preencher!#ref!,#REF!),preencher!#ref!))","v":{"$error":"#NAME?"}},{"$f":"IF(preencher!#ref!=\"\",\"\",IF(COUNTIF(preencher!#ref!,preencher!#ref!)=0,CONCATENATE(preencher!#ref!,#REF!),preencher!#ref!))","v":{"$error":"#NAME?"}},{"$f":"IF(preencher!#ref!=\"\",\"\",IF(COUNTIF(preencher!#ref!,preencher!#ref!)=0,CONCATENATE(preencher!#ref!,#REF!),preencher!#ref!))","v":{"$error":"#NAME?"}},{"$f":"IF(preencher!#ref!=\"\",\"\",IF(COUNTIF(preencher!#ref!,preencher!#ref!)=0,CONCATENATE(preencher!#ref!,#REF!),preencher!#ref!))","v":{"$error":"#NAME?"}},{"$f":"IF(preencher!#ref!=\"\",\"\",IF(COUNTIF(preencher!#ref!,preencher!#ref!)=0,CONCATENATE(preencher!#ref!,#REF!),preencher!#ref!))","v":{"$error":"#NAME?"}},{"$f":"IF(preencher!#ref!=\"\",\"\",IF(COUNTIF(preencher!#ref!,preencher!#ref!)=0,CONCATENATE(preencher!#ref!,#REF!),preencher!#ref!))","v":{"$error":"#NAME?"}},{"$f":"IF(preencher!#ref!=\"\",\"\",IF(COUNTIF(preencher!#ref!,preencher!#ref!)=0,CONCATENATE(preencher!#ref!,#REF!),preencher!#ref!))","v":{"$error":"#NAME?"}},{"$f":"IF(ISERROR(ROUND(AVERAGE(E21:N21),2)),\"\",ROUND(AVERAGE(E21:N21),2))","v":""},{"$f":"IF(ISERROR(ROUND(O21*D21,2)),\"\",ROUND(O21*D21,2))","v":""},null,null,{"$f":"IF(ISERROR(MEDIAN(E21:N21)),\"\",MEDIAN(E21:N21))","v":""},{"$f":"IF(ISERROR(STDEV(E21:N21)),\"\",STDEV(E21:N21))","v":""},{"$f":"IF(ISERROR(T21/O21),\"\",T21/O21)","v":""}]
[{"$f":"IF(preencher!#ref!=\"\",\"\",preencher!#ref!)","v":{"$error":"#NAME?"}},{"$f":"IF(preencher!#ref!=\"\",\"\",preencher!#ref!)","v":{"$error":"#NAME?"}},{"$f":"IF(preencher!#ref!=\"\",\"\",preencher!#ref!)","v":{"$error":"#NAME?"}},{"$f":"IF(preencher!#ref!=\"\",\"\",preencher!#ref!)","v":{"$error":"#NAME?"}},{"$f":"IF(preencher!#ref!=\"\",\"\",IF(COUNTIF(preencher!#ref!,preencher!#ref!)=0,CONCATENATE(preencher!#ref!,#REF!),preencher!#ref!))","v":{"$error":"#NAME?"}},{"$f":"IF(preencher!#ref!=\"\",\"\",IF(COUNTIF(preencher!#ref!,preencher!#ref!)=0,CONCATENATE(preencher!#ref!,#REF!),preencher!#ref!))","v":{"$error":"#NAME?"}},{"$f":"IF(preencher!#ref!=\"\",\"\",IF(COUNTIF(preencher!#ref!,preencher!#ref!)=0,CONCATENATE(preencher!#ref!,#REF!),preencher!#ref!))","v":{"$error":"#NAME?"}},{"$f":"IF(preencher!#ref!=\"\",\"\",IF(COUNTIF(preencher!#ref!,preencher!#ref!)=0,CONCATENATE(preencher!#ref!,#REF!),preencher!#ref!))","v":{"$error":"#NAME?"}},{"$f":"IF(preencher!#ref!=\"\",\"\",IF(COUNTIF(preencher!#ref!,preencher!#ref!)=0,CONCATENATE(preencher!#ref!,#REF!),preencher!#ref!))","v":{"$error":"#NAME?"}},{"$f":"IF(preencher!#ref!=\"\",\"\",IF(COUNTIF(preencher!#ref!,preencher!#ref!)=0,CONCATENATE(preencher!#ref!,#REF!),preencher!#ref!))","v":{"$error":"#NAME?"}},{"$f":"IF(preencher!#ref!=\"\",\"\",IF(COUNTIF(preencher!#ref!,preencher!#ref!)=0,CONCATENATE(preencher!#ref!,#REF!),preencher!#ref!))","v":{"$error":"#NAME?"}},{"$f":"IF(preencher!#ref!=\"\",\"\",IF(COUNTIF(preencher!#ref!,preencher!#ref!)=0,CONCATENATE(preencher!#ref!,#REF!),preencher!#ref!))","v":{"$error":"#NAME?"}},{"$f":"IF(preencher!#ref!=\"\",\"\",IF(COUNTIF(preencher!#ref!,preencher!#ref!)=0,CONCATENATE(preencher!#ref!,#REF!),preencher!#ref!))","v":{"$error":"#NAME?"}},{"$f":"IF(preencher!#ref!=\"\",\"\",IF(COUNTIF(preencher!#ref!,preencher!#ref!)=0,CONCATENATE(preencher!#ref!,#REF!),preencher!#ref!))","v":{"$error":"#NAME?"}},{"$f":"IF(ISERROR(ROUND(AVERAGE(E22:N22),2)),\"\",ROUND(AVERAGE(E22:N22),2))","v":""},{"$f":"IF(ISERROR(ROUND(O22*D22,2)),\"\",ROUND(O22*D22,2))","v":""},null,null,{"$f":"IF(ISERROR(MEDIAN(E22:N22)),\"\",MEDIAN(E22:N22))","v":""},{"$f":"IF(ISERROR(STDEV(E22:N22)),\"\",STDEV(E22:N22))","v":""},{"$f":"IF(ISERROR(T22/O22),\"\",T22/O22)","v":""}]
[{"$f":"IF(preencher!#ref!=\"\",\"\",preencher!#ref!)","v":{"$error":"#NAME?"}},{"$f":"IF(preencher!#ref!=\"\",\"\",preencher!#ref!)","v":{"$error":"#NAME?"}},{"$f":"IF(preencher!#ref!=\"\",\"\",preencher!#ref!)","v":{"$error":"#NAME?"}},{"$f":"IF(preencher!#ref!=\"\",\"\",preencher!#ref!)","v":{"$error":"#NAME?"}},{"$f":"IF(preencher!#ref!=\"\",\"\",IF(COUNTIF(preencher!#ref!,preencher!#ref!)=0,CONCATENATE(preencher!#ref!,#REF!),preencher!#ref!))","v":{"$error":"#NAME?"}},{"$f":"IF(preencher!#ref!=\"\",\"\",IF(COUNTIF(preencher!#ref!,preencher!#ref!)=0,CONCATENATE(preencher!#ref!,#REF!),preencher!#ref!))","v":{"$error":"#NAME?"}},{"$f":"IF(preencher!#ref!=\"\",\"\",IF(COUNTIF(preencher!#ref!,preencher!#ref!)=0,CONCATENATE(preencher!#ref!,#REF!),preencher!#ref!))","v":{"$error":"#NAME?"}},{"$f":"IF(preencher!#ref!=\"\",\"\",IF(COUNTIF(preencher!#ref!,preencher!#ref!)=0,CONCATENATE(preencher!#ref!,#REF!),preencher!#ref!))","v":{"$error":"#NAME?"}},{"$f":"IF(preencher!#ref!=\"\",\"\",IF(COUNTIF(preencher!#ref!,preencher!#ref!)=0,CONCATENATE(preencher!#ref!,#REF!),preencher!#ref!))","v":{"$error":"#NAME?"}},{"$f":"IF(preencher!#ref!=\"\",\"\",IF(COUNTIF(preencher!#ref!,preencher!#ref!)=0,CONCATENATE(preencher!#ref!,#REF!),preencher!#ref!))","v":{"$error":"#NAME?"}},{"$f":"IF(preencher!#ref!=\"\",\"\",IF(COUNTIF(preencher!#ref!,preencher!#ref!)=0,CONCATENATE(preencher!#ref!,#REF!),preencher!#ref!))","v":{"$error":"#NAME?"}},{"$f":"IF(preencher!#ref!=\"\",\"\",IF(COUNTIF(preencher!#ref!,preencher!#ref!)=0,CONCATENATE(preencher!#ref!,#REF!),preencher!#ref!))","v":{"$error":"#NAME?"}},{"$f":"IF(preencher!#ref!=\"\",\"\",IF(COUNTIF(preencher!#ref!,preencher!#ref!)=0,CONCATENATE(preencher!#ref!,#REF!),preencher!#ref!))","v":{"$error":"#NAME?"}},{"$f":"IF(preencher!#ref!=\"\",\"\",IF(COUNTIF(preencher!#ref!,preencher!#ref!)=0,CONCATENATE(preencher!#ref!,#REF!),preencher!#ref!))","v":{"$error":"#NAME?"}},{"$f":"IF(ISERROR(ROUND(AVERAGE(E23:N23),2)),\"\",ROUND(AVERAGE(E23:N23),2))","v":""},{"$f":"IF(ISERROR(ROUND(O23*D23,2)),\"\",ROUND(O23*D23,2))","v":""},null,null,{"$f":"IF(ISERROR(MEDIAN(E23:N23)),\"\",MEDIAN(E23:N23))","v":""},{"$f":"IF(ISERROR(STDEV(E23:N23)),\"\",STDEV(E23:N23))","v":""},{"$f":"IF(ISERROR(T23/O23),\"\",T23/O23)","v":""}]
[{"$f":"IF(preencher!#ref!=\"\",\"\",preencher!#ref!)","v":{"$error":"#NAME?"}},{"$f":"IF(preencher!#ref!=\"\",\"\",preencher!#ref!)","v":{"$error":"#NAME?"}},{"$f":"IF(preencher!#ref!=\"\",\"\",preencher!#ref!)","v":{"$error":"#NAME?"}},{"$f":"IF(preencher!#ref!=\"\",\"\",preencher!#ref!)","v":{"$error":"#NAME?"}},{"$f":"IF(preencher!#ref!=\"\",\"\",IF(COUNTIF(preencher!#ref!,preencher!#ref!)=0,CONCATENATE(preencher!#ref!,#REF!),preencher!#ref!))","v":{"$error":"#NAME?"}},{"$f":"IF(preencher!#ref!=\"\",\"\",IF(COUNTIF(preencher!#ref!,preencher!#ref!)=0,CONCATENATE(preencher!#ref!,#REF!),preencher!#ref!))","v":{"$error":"#NAME?"}},{"$f":"IF(preencher!#ref!=\"\",\"\",IF(COUNTIF(preencher!#ref!,preencher!#ref!)=0,CONCATENATE(preencher!#ref!,#REF!),preencher!#ref!))","v":{"$error":"#NAME?"}},{"$f":"IF(preencher!#ref!=\"\",\"\",IF(COUNTIF(preencher!#ref!,preencher!#ref!)=0,CONCATENATE(preencher!#ref!,#REF!),preencher!#ref!))","v":{"$error":"#NAME?"}},{"$f":"IF(preencher!#ref!=\"\",\"\",IF(COUNTIF(preencher!#ref!,preencher!#ref!)=0,CONCATENATE(preencher!#ref!,#REF!),preencher!#ref!))","v":{"$error":"#NAME?"}},{"$f":"IF(preencher!#ref!=\"\",\"\",IF(COUNTIF(preencher!#ref!,preencher!#ref!)=0,CONCATENATE(preencher!#ref!,#REF!),preencher!#ref!))","v":{"$error":"#NAME?"}},{"$f":"IF(preencher!#ref!=\"\",\"\",IF(COUNTIF(preencher!#ref!,preencher!#ref!)=0,CONCATENATE(preencher!#ref!,#REF!),preencher!#ref!))","v":{"$error":"#NAME?"}},{"$f":"IF(preencher!#ref!=\"\",\"\",IF(COUNTIF(preencher!#ref!,preencher!#ref!)=0,CONCATENATE(preencher!#ref!,#REF!),preencher!#ref!))","v":{"$error":"#NAME?"}},{"$f":"IF(preencher!#ref!=\"\",\"\",IF(COUNTIF(preencher!#ref!,preencher!#ref!)=0,CONCATENATE(preencher!#ref!,#REF!),preencher!#ref!))","v":{"$error":"#NAME?"}},{"$f":"IF(preencher!#ref!=\"\",\"\",IF(COUNTIF(preencher!#ref!,preencher!#ref!)=0,CONCATENATE(preencher!#ref!,#REF!),preencher!#ref!))","v":{"$error":"#NAME?"}},{"$f":"IF(ISERROR(ROUND(AVERAGE(E24:N24),2)),\"\",ROUND(AVERAGE(E24:N24),2))","v":""},{"$f":"IF(ISERROR(ROUND(O24*D24,2)),\"\",ROUND(O24*D24,2))","v":""},null,null,{"$f":"IF(ISERROR(MEDIAN(E24:N24)),\"\",MEDIAN(E24:N24))","v":""},{"$f":"IF(ISERROR(STDEV(E24:N24)),\"\",STDEV(E24:N24))","v":""},{"$f":"IF(ISERROR(T24/O24),\"\",T24/O24)","v":""}]
[{"$f":"IF(preencher!#ref!=\"\",\"\",preencher!#ref!)","v":{"$error":"#NAME?"}},{"$f":"IF(preencher!#ref!=\"\",\"\",preencher!#ref!)","v":{"$error":"#NAME?"}},{"$f":"IF(preencher!#ref!=\"\",\"\",preencher!#ref!)","v":{"$error":"#NAME?"}},{"$f":"IF(preencher!#ref!=\"\",\"\",preencher!#ref!)","v":{"$error":"#NAME?"}},{"$f":"IF(preencher!#ref!=\"\",\"\",IF(COUNTIF(preencher!#ref!,preencher!#ref!)=0,CONCATENATE(preencher!#ref!,#REF!),preencher!#ref!))","v":{"$error":"#NAME?"}},{"$f":"IF(preencher!#ref!=\"\",\"\",IF(COUNTIF(preencher!#ref!,preencher!#ref!)=0,CONCATENATE(preencher!#ref!,#REF!),preencher!#ref!))","v":{"$error":"#NAME?"}},{"$f":"IF(preencher!#ref!=\"\",\"\",IF(COUNTIF(preencher!#ref!,preencher!#ref!)=0,CONCATENATE(preencher!#ref!,#REF!),preencher!#ref!))","v":{"$error":"#NAME?"}},{"$f":"IF(preencher!#ref!=\"\",\"\",IF(COUNTIF(preencher!#ref!,preencher!#ref!)=0,CONCATENATE(preencher!#ref!,#REF!),preencher!#ref!))","v":{"$error":"#NAME?"}},{"$f":"IF(preencher!#ref!=\"\",\"\",IF(COUNTIF(preencher!#ref!,preencher!#ref!)=0,CONCATENATE(preencher!#ref!,#REF!),preencher!#ref!))","v":{"$error":"#NAME?"}},{"$f":"IF(preencher!#ref!=\"\",\"\",IF(COUNTIF(preencher!#ref!,preencher!#ref!)=0,CONCATENATE(preencher!#ref!,#REF!),preencher!#ref!))","v":{"$error":"#NAME?"}},{"$f":"IF(preencher!#ref!=\"\",\"\",IF(COUNTIF(preencher!#ref!,preencher!#ref!)=0,CONCATENATE(preencher!#ref!,#REF!),preencher!#ref!))","v":{"$error":"#NAME?"}},{"$f":"IF(preencher!#ref!=\"\",\"\",IF(COUNTIF(preencher!#ref!,preencher!#ref!)=0,CONCATENATE(preencher!#ref!,#REF!),preencher!#ref!))","v":{"$error":"#NAME?"}},{"$f":"IF(preencher!#ref!=\"\",\"\",IF(COUNTIF(preencher!#ref!,preencher!#ref!)=0,CONCATENATE(preencher!#ref!,#REF!),preencher!#ref!))","v":{"$error":"#NAME?"}},{"$f":"IF(preencher!#ref!=\"\",\"\",IF(COUNTIF(preencher!#ref!,preencher!#ref!)=0,CONCATENATE(preencher!#ref!,#REF!),preencher!#ref!))","v":{"$error":"#NAME?"}},{"$f":"IF(ISERROR(ROUND(AVERAGE(E25:N25),2)),\"\",ROUND(AVERAGE(E25:N25),2))","v":""},{"$f":"IF(ISERROR(ROUND(O25*D25,2)),\"\",ROUND(O25*D25,2))","v":""},null,null,{"$f":"IF(ISERROR(MEDIAN(E25:N25)),\"\",MEDIAN(E25:N25))","v":""},{"$f":"IF(ISERROR(STDEV(E25:N25)),\"\",STDEV(E25:N25))","v":""},{"$f":"IF(ISERROR(T25/O25),\"\",T25/O25)","v":""}]
[{"$f":"IF(preencher!#ref!=\"\",\"\",preencher!#ref!)","v":{"$error":"#NAME?"}},{"$f":"IF(preencher!#ref!=\"\",\"\",preencher!#ref!)","v":{"$error":"#NAME?"}},{"$f":"IF(preencher!#ref!=\"\",\"\",preencher!#ref!)","v":{"$error":"#NAME?"}},{"$f":"IF(preencher!#ref!=\"\",\"\",preencher!#ref!)","v":{"$error":"#NAME?"}},{"$f":"IF(preencher!#ref!=\"\",\"\",IF(COUNTIF(preencher!#ref!,preencher!#ref!)=0,CONCATENATE(preencher!#ref!,#REF!),preencher!#ref!))","v":{"$error":"#NAME?"}},{"$f":"IF(preencher!#ref!=\"\",\"\",IF(COUNTIF(preencher!#ref!,preencher!#ref!)=0,CONCATENATE(preencher!#ref!,#REF!),preencher!#ref!))","v":{"$error":"#NAME?"}},{"$f":"IF(preencher!#ref!=\"\",\"\",IF(COUNTIF(preencher!#ref!,preencher!#ref!)=0,CONCATENATE(preencher!#ref!,#REF!),preencher!#ref!))","v":{"$error":"#NAME?"}},{"$f":"IF(preencher!#ref!=\"\",\"\",IF(COUNTIF(preencher!#ref!,preencher!#ref!)=0,CONCATENATE(preencher!#ref!,#REF!),preencher!#ref!))","v":{"$error":"#NAME?"}},{"$f":"IF(preencher!#ref!=\"\",\"\",IF(COUNTIF(preencher!#ref!,preencher!#ref!)=0,CONCATENATE(preencher!#ref!,#REF!),preencher!#ref!))","v":{"$error":"#NAME?"}},{"$f":"IF(preencher!#ref!=\"\",\"\",IF(COUNTIF(preencher!#ref!,preencher!#ref!)=0,CONCATENATE(preencher!#ref!,#REF!),preencher!#ref!))","v":{"$error":"#NAME?"}},{"$f":"IF(preencher!#ref!=\"\",\"\",IF(COUNTIF(preencher!#ref!,preencher!#ref!)=0,CONCATENATE(preencher!#ref!,#REF!),preencher!#ref!))","v":{"$error":"#NAME?"}},{"$f":"IF(preencher!#ref!=\"\",\"\",IF(COUNTIF(preencher!#ref!,preencher!#ref!)=0,CONCATENATE(preencher!#ref!,#REF!),preencher!#ref!))","v":{"$error":"#NAME?"}},{"$f":"IF(preencher!#ref!=\"\",\"\",IF(COUNTIF(preencher!#ref!,preencher!#ref!)=0,CONCATENATE(preencher!#ref!,#REF!),preencher!#ref!))","v":{"$error":"#NAME?"}},{"$f":"IF(preencher!#ref!=\"\",\"\",IF(COUNTIF(preencher!#ref!,preencher!#ref!)=0,CONCATENATE(preencher!#ref!,#REF!),preencher!#ref!))","v":{"$error":"#NAME?"}},{"$f":"IF(ISERROR(ROUND(AVERAGE(E26:N26),2)),\"\",ROUND(AVERAGE(E26:N26),2))","v":""},{"$f":"IF(ISERROR(ROUND(O26*D26,2)),\"\",ROUND(O26*D26,2))","v":""},null,null,{"$f":"IF(ISERROR(MEDIAN(E26:N26)),\"\",MEDIAN(E26:N26))","v":""},{"$f":"IF(ISERROR(STDEV(E26:N26)),\"\",STDEV(E26:N26))","v":""},{"$f":"IF(ISERROR(T26/O26),\"\",T26/O26)","v":""}]
[{"$f":"IF(preencher!#ref!=\"\",\"\",preencher!#ref!)","v":{"$error":"#NAME?"}},{"$f":"IF(preencher!#ref!=\"\",\"\",preencher!#ref!)","v":{"$error":"#NAME?"}},{"$f":"IF(preencher!#ref!=\"\",\"\",preencher!#ref!)","v":{"$error":"#NAME?"}},{"$f":"IF(preencher!#ref!=\"\",\"\",preencher!#ref!)","v":{"$error":"#NAME?"}},{"$f":"IF(preencher!#ref!=\"\",\"\",IF(COUNTIF(preencher!#ref!,preencher!#ref!)=0,CONCATENATE(preencher!#ref!,#REF!),preencher!#ref!))","v":{"$error":"#NAME?"}},{"$f":"IF(preencher!#ref!=\"\",\"\",IF(COUNTIF(preencher!#ref!,preencher!#ref!)=0,CONCATENATE(preencher!#ref!,#REF!),preencher!#ref!))","v":{"$error":"#NAME?"}},{"$f":"IF(preencher!#ref!=\"\",\"\",IF(COUNTIF(preencher!#ref!,preencher!#ref!)=0,CONCATENATE(preencher!#ref!,#REF!),preencher!#ref!))","v":{"$error":"#NAME?"}},{"$f":"IF(preencher!#ref!=\"\",\"\",IF(COUNTIF(preencher!#ref!,preencher!#ref!)=0,CONCATENATE(preencher!#ref!,#REF!),preencher!#ref!))","v":{"$error":"#NAME?"}},{"$f":"IF(preencher!#ref!=\"\",\"\",IF(COUNTIF(preencher!#ref!,preencher!#ref!)=0,CONCATENATE(preencher!#ref!,#REF!),preencher!#ref!))","v":{"$error":"#NAME?"}},{"$f":"IF(preencher!#ref!=\"\",\"\",IF(COUNTIF(preencher!#ref!,preencher!#ref!)=0,CONCATENATE(preencher!#ref!,#REF!),preencher!#ref!))","v":{"$error":"#NAME?"}},{"$f":"IF(preencher!#ref!=\"\",\"\",IF(COUNTIF(preencher!#ref!,preencher!#ref!)=0,CONCATENATE(preencher!#ref!,#REF!),preencher!#ref!))","v":{"$error":"#NAME?"}},{"$f":"IF(preencher!#ref!=\"\",\"\",IF(COUNTIF(preencher!#ref!,preencher!#ref!)=0,CONCATENATE(preencher!#ref!,#REF!),preencher!#ref!))","v":{"$error":"#NAME?"}},{"$f":"IF(preencher!#ref!=\"\",\"\",IF(COUNTIF(preencher!#ref!,preencher!#ref!)=0,CONCATENATE(preencher!#ref!,#REF!),preencher!#ref!))","v":{"$error":"#NAME?"}},{"$f":"IF(preencher!#ref!=\"\",\"\",IF(COUNTIF(preencher!#ref!,preencher!#ref!)=0,CONCATENATE(preencher!#ref!,#REF!),preencher!#ref!))","v":{"$error":"#NAME?"}},{"$f":"IF(ISERROR(ROUND(AVERAGE(E27:N27),2)),\"\",ROUND(AVERAGE(E27:N27),2))","v":""},{"$f":"IF(ISERROR(ROUND(O27*D27,2)),\"\",ROUND(O27*D27,2))","v":""},null,null,{"$f":"IF(ISERROR(MEDIAN(E27:N27)),\"\",MEDIAN(E27:N27))","v":""},{"$f":"IF(ISERROR(STDEV(E27:N27)),\"\",STDEV(E27:N27))","v":""},{"$f":"IF(ISERROR(T27/O27),\"\",T27/O27)","v":""}]
[{"$f":"IF(preencher!#ref!=\"\",\"\",preencher!#ref!)","v":{"$error":"#NAME?"}},{"$f":"IF(preencher!#ref!=\"\",\"\",preencher!#ref!)","v":{"$error":"#NAME?"}},{"$f":"IF(preencher!#ref!=\"\",\"\",preencher!#ref!)","v":{"$error":"#NAME?"}},{"$f":"IF(preencher!#ref!=\"\",\"\",preencher!#ref!)","v":{"$error":"#NAME?"}},{"$f":"IF(preencher!#ref!=\"\",\"\",IF(COUNTIF(preencher!#ref!,preencher!#ref!)=0,CONCATENATE(preencher!#ref!,#REF!),preencher!#ref!))","v":{"$error":"#NAME?"}},{"$f":"IF(preencher!#ref!=\"\",\"\",IF(COUNTIF(preencher!#ref!,preencher!#ref!)=0,CONCATENATE(preencher!#ref!,#REF!),preencher!#ref!))","v":{"$error":"#NAME?"}},{"$f":"IF(preencher!#ref!=\"\",\"\",IF(COUNTIF(preencher!#ref!,preencher!#ref!)=0,CONCATENATE(preencher!#ref!,#REF!),preencher!#ref!))","v":{"$error":"#NAME?"}},{"$f":"IF(preencher!#ref!=\"\",\"\",IF(COUNTIF(preencher!#ref!,preencher!#ref!)=0,CONCATENATE(preencher!#ref!,#REF!),preencher!#ref!))","v":{"$error":"#NAME?"}},{"$f":"IF(preencher!#ref!=\"\",\"\",IF(COUNTIF(preencher!#ref!,preencher!#ref!)=0,CONCATENATE(preencher!#ref!,#REF!),preencher!#ref!))","v":{"$error":"#NAME?"}},{"$f":"IF(preencher!#ref!=\"\",\"\",IF(COUNTIF(preencher!#ref!,preencher!#ref!)=0,CONCATENATE(preencher!#ref!,#REF!),preencher!#ref!))","v":{"$error":"#NAME?"}},{"$f":"IF(preencher!#ref!=\"\",\"\",IF(COUNTIF(preencher!#ref!,preencher!#ref!)=0,CONCATENATE(preencher!#ref!,#REF!),preencher!#ref!))","v":{"$error":"#NAME?"}},{"$f":"IF(preencher!#ref!=\"\",\"\",IF(COUNTIF(preencher!#ref!,preencher!#ref!)=0,CONCATENATE(preencher!#ref!,#REF!),preencher!#ref!))","v":{"$error":"#NAME?"}},{"$f":"IF(preencher!#ref!=\"\",\"\",IF(COUNTIF(preencher!#ref!,preencher!#ref!)=0,CONCATENATE(preencher!#ref!,#REF!),preencher!#ref!))","v":{"$error":"#NAME?"}},{"$f":"IF(preencher!#ref!=\"\",\"\",IF(COUNTIF(preencher!#ref!,preencher!#ref!)=0,CONCATENATE(preencher!#ref!,#REF!),preencher!#ref!))","v":{"$error":"#NAME?"}},{"$f":"IF(ISERROR(ROUND(AVERAGE(E28:N28),2)),\"\",ROUND(AVERAGE(E28:N28),2))","v":""},{"$f":"IF(ISERROR(ROUND(O28*D28,2)),\"\",ROUND(O28*D28,2))","v":""},null,null,{"$f":"IF(ISERROR(MEDIAN(E28:N28)),\"\",MEDIAN(E28:N28))","v":""},{"$f":"IF(ISERROR(STDEV(E28:N28)),\"\",STDEV(E28:N28))","v":""},{"$f":"IF(ISERROR(T28/O28),\"\",T28/O28)","v":""}]
[{"$f":"IF(preencher!#ref!=\"\",\"\",preencher!#ref!)","v":{"$error":"#NAME?"}},{"$f":"IF(preencher!#ref!=\"\",\"\",preencher!#ref!)","v":{"$error":"#NAME?"}},{"$f":"IF(preencher!#ref!=\"\",\"\",preencher!#ref!)","v":{"$error":"#NAME?"}},{"$f":"IF(preencher!#ref!=\"\",\"\",preencher!#ref!)","v":{"$error":"#NAME?"}},{"$f":"IF(preencher!#ref!=\"\",\"\",IF(COUNTIF(preencher!#ref!,preencher!#ref!)=0,CONCATENATE(preencher!#ref!,#REF!),preencher!#ref!))","v":{"$error":"#NAME?"}},{"$f":"IF(preencher!#ref!=\"\",\"\",IF(COUNTIF(preencher!#ref!,preencher!#ref!)=0,CONCATENATE(preencher!#ref!,#REF!),preencher!#ref!))","v":{"$error":"#NAME?"}},{"$f":"IF(preencher!#ref!=\"\",\"\",IF(COUNTIF(preencher!#ref!,preencher!#ref!)=0,CONCATENATE(preencher!#ref!,#REF!),preencher!#ref!))","v":{"$error":"#NAME?"}},{"$f":"IF(preencher!#ref!=\"\",\"\",IF(COUNTIF(preencher!#ref!,preencher!#ref!)=0,CONCATENATE(preencher!#ref!,#REF!),preencher!#ref!))","v":{"$error":"#NAME?"}},{"$f":"IF(preencher!#ref!=\"\",\"\",IF(COUNTIF(preencher!#ref!,preencher!#ref!)=0,CONCATENATE(preencher!#ref!,#REF!),preencher!#ref!))","v":{"$error":"#NAME?"}},{"$f":"IF(preencher!#ref!=\"\",\"\",IF(COUNTIF(preencher!#ref!,preencher!#ref!)=0,CONCATENATE(preencher!#ref!,#REF!),preencher!#ref!))","v":{"$error":"#NAME?"}},{"$f":"IF(preencher!#ref!=\"\",\"\",IF(COUNTIF(preencher!#ref!,preencher!#ref!)=0,CONCATENATE(preencher!#ref!,#REF!),preencher!#ref!))","v":{"$error":"#NAME?"}},{"$f":"IF(preencher!#ref!=\"\",\"\",IF(COUNTIF(preencher!#ref!,preencher!#ref!)=0,CONCATENATE(preencher!#ref!,#REF!),preencher!#ref!))","v":{"$error":"#NAME?"}},{"$f":"IF(preencher!#ref!=\"\",\"\",IF(COUNTIF(preencher!#ref!,preencher!#ref!)=0,CONCATENATE(preencher!#ref!,#REF!),preencher!#ref!))","v":{"$error":"#NAME?"}},{"$f":"IF(preencher!#ref!=\"\",\"\",IF(COUNTIF(preencher!#ref!,preencher!#ref!)=0,CONCATENATE(preencher!#ref!,#REF!),preencher!#ref!))","v":{"$error":"#NAME?"}},{"$f":"IF(ISERROR(ROUND(AVERAGE(E29:N29),2)),\"\",ROUND(AVERAGE(E29:N29),2))","v":""},{"$f":"IF(ISERROR(ROUND(O29*D29,2)),\"\",ROUND(O29*D29,2))","v":""},null,null,{"$f":"IF(ISERROR(MEDIAN(E29:N29)),\"\",MEDIAN(E29:N29))","v":""},{"$f":"IF(ISERROR(STDEV(E29:N29)),\"\",STDEV(E29:N29))","v":""},{"$f":"IF(ISERROR(T29/O29),\"\",T29/O29)","v":""}]
[{"$f":"IF(preencher!#ref!=\"\",\"\",preencher!#ref!)","v":{"$error":"#NAME?"}},{"$f":"IF(preencher!#ref!=\"\",\"\",preencher!#ref!)","v":{"$error":"#NAME?"}},{"$f":"IF(preencher!#ref!=\"\",\"\",preencher!#ref!)","v":{"$error":"#NAME?"}},{"$f":"IF(preencher!#ref!=\"\",\"\",preencher!#ref!)","v":{"$error":"#NAME?"}},{"$f":"IF(preencher!#ref!=\"\",\"\",IF(COUNTIF(preencher!#ref!,preencher!#ref!)=0,CONCATENATE(preencher!#ref!,#REF!),preencher!#ref!))","v":{"$error":"#NAME?"}},{"$f":"IF(preencher!#ref!=\"\",\"\",IF(COUNTIF(preencher!#ref!,preencher!#ref!)=0,CONCATENATE(preencher!#ref!,#REF!),preencher!#ref!))","v":{"$error":"#NAME?"}},{"$f":"IF(preencher!#ref!=\"\",\"\",IF(COUNTIF(preencher!#ref!,preencher!#ref!)=0,CONCATENATE(preencher!#ref!,#REF!),preencher!#ref!))","v":{"$error":"#NAME?"}},{"$f":"IF(preencher!#ref!=\"\",\"\",IF(COUNTIF(preencher!#ref!,preencher!#ref!)=0,CONCATENATE(preencher!#ref!,#REF!),preencher!#ref!))","v":{"$error":"#NAME?"}},{"$f":"IF(preencher!#ref!=\"\",\"\",IF(COUNTIF(preencher!#ref!,preencher!#ref!)=0,CONCATENATE(preencher!#ref!,#REF!),preencher!#ref!))","v":{"$error":"#NAME?"}},{"$f":"IF(preencher!#ref!=\"\",\"\",IF(COUNTIF(preencher!#ref!,preencher!#ref!)=0,CONCATENATE(preencher!#ref!,#REF!),preencher!#ref!))","v":{"$error":"#NAME?"}},{"$f":"IF(preencher!#ref!=\"\",\"\",IF(COUNTIF(preencher!#ref!,preencher!#ref!)=0,CONCATENATE(preencher!#ref!,#REF!),preencher!#ref!))","v":{"$error":"#NAME?"}},{"$f":"IF(preencher!#ref!=\"\",\"\",IF(COUNTIF(preencher!#ref!,preencher!#ref!)=0,CONCATENATE(preencher!#ref!,#REF!),preencher!#ref!))","v":{"$error":"#NAME?"}},{"$f":"IF(preencher!#ref!=\"\",\"\",IF(COUNTIF(preencher!#ref!,preencher!#ref!)=0,CONCATENATE(preencher!#ref!,#REF!),preencher!#ref!))","v":{"$error":"#NAME?"}},{"$f":"IF(preencher!#ref!=\"\",\"\",IF(COUNTIF(preencher!#ref!,preencher!#ref!)=0,CONCATENATE(preencher!#ref!,#REF!),preencher!#ref!))","v":{"$error":"#NAME?"}},{"$f":"IF(ISERROR(ROUND(AVERAGE(E30:N30),2)),\"\",ROUND(AVERAGE(E30:N30),2))","v":""},{"$f":"IF(ISERROR(ROUND(O30*D30,2)),\"\",ROUND(O30*D30,2))","v":""},null,null,{"$f":"IF(ISERROR(MEDIAN(E30:N30)),\"\",MEDIAN(E30:N30))","v":""},{"$f":"IF(ISERROR(STDEV(E30:N30)),\"\",STDEV(E30:N30))","v":""},{"$f":"IF(ISERROR(T30/O30),\"\",T30/O30)","v":""}]
[{"$f":"IF(preencher!#ref!=\"\",\"\",preencher!#ref!)","v":{"$error":"#NAME?"}},{"$f":"IF(preencher!#ref!=\"\",\"\",preencher!#ref!)","v":{"$error":"#NAME?"}},{"$f":"IF(preencher!#ref!=\"\",\"\",preencher!#ref!)","v":{"$error":"#NAME?"}},{"$f":"IF(preencher!#ref!=\"\",\"\",preencher!#ref!)","v":{"$error":"#NAME?"}},{"$f":"IF(preencher!#ref!=\"\",\"\",IF(COUNTIF(preencher!#ref!,preencher!#ref!)=0,CONCATENATE(preencher!#ref!,#REF!),preencher!#ref!))","v":{"$error":"#NAME?"}},{"$f":"IF(preencher!#ref!=\"\",\"\",IF(COUNTIF(preencher!#ref!,preencher!#ref!)=0,CONCATENATE(preencher!#ref!,#REF!),preencher!#ref!))","v":{"$error":"#NAME?"}},{"$f":"IF(preencher!#ref!=\"\",\"\",IF(COUNTIF(preencher!#ref!,preencher!#ref!)=0,CONCATENATE(preencher!#ref!,#REF!),preencher!#ref!))","v":{"$error":"#NAME?"}},{"$f":"IF(preencher!#ref!=\"\",\"\",IF(COUNTIF(preencher!#ref!,preencher!#ref!)=0,CONCATENATE(preencher!#ref!,#REF!),preencher!#ref!))","v":{"$error":"#NAME?"}},{"$f":"IF(preencher!#ref!=\"\",\"\",IF(COUNTIF(preencher!#ref!,preencher!#ref!)=0,CONCATENATE(preencher!#ref!,#REF!),preencher!#ref!))","v":{"$error":"#NAME?"}},{"$f":"IF(preencher!#ref!=\"\",\"\",IF(COUNTIF(preencher!#ref!,preencher!#ref!)=0,CONCATENATE(preencher!#ref!,#REF!),preencher!#ref!))","v":{"$error":"#NAME?"}},{"$f":"IF(preencher!#ref!=\"\",\"\",IF(COUNTIF(preencher!#ref!,preencher!#ref!)=0,CONCATENATE(preencher!#ref!,#REF!),preencher!#ref!))","v":{"$error":"#NAME?"}},{"$f":"IF(preencher!#ref!=\"\",\"\",IF(COUNTIF(preencher!#ref!,preencher!#ref!)=0,CONCATENATE(preencher!#ref!,#REF!),preencher!#ref!))","v":{"$error":"#NAME?"}},{"$f":"IF(preencher!#ref!=\"\",\"\",IF(COUNTIF(preencher!#ref!,preencher!#ref!)=0,CONCATENATE(preencher!#ref!,#REF!),preencher!#ref!))","v":{"$error":"#NAME?"}},{"$f":"IF(preencher!#ref!=\"\",\"\",IF(COUNTIF(preencher!#ref!,preencher!#ref!)=0,CONCATENATE(preencher!#ref!,#REF!),preencher!#ref!))","v":{"$error":"#NAME?"}},{"$f":"IF(ISERROR(ROUND(AVERAGE(E31:N31),2)),\"\",ROUND(AVERAGE(E31:N31),2))","v":""},{"$f":"IF(ISERROR(ROUND(O31*D31,2)),\"\",ROUND(O31*D31,2))","v":""},null,null,{"$f":"IF(ISERROR(MEDIAN(E31:N31)),\"\",MEDIAN(E31:N31))","v":""},{"$f":"IF(ISERROR(STDEV(E31:N31)),\"\",STDEV(E31:N31))","v":""},{"$f":"IF(ISERROR(T31/O31),\"\",T31/O31)","v":""}]
[{"$f":"IF(preencher!#ref!=\"\",\"\",preencher!#ref!)","v":{"$error":"#NAME?"}},{"$f":"IF(preencher!#ref!=\"\",\"\",preencher!#ref!)","v":{"$error":"#NAME?"}},{"$f":"IF(preencher!#ref!=\"\",\"\",preencher!#ref!)","v":{"$error":"#NAME?"}},{"$f":"IF(preencher!#ref!=\"\",\"\",preencher!#ref!)","v":{"$error":"#NAME?"}},{"$f":"IF(preencher!#ref!=\"\",\"\",IF(COUNTIF(preencher!#ref!,preencher!#ref!)=0,CONCATENATE(preencher!#ref!,#REF!),preencher!#ref!))","v":{"$error":"#NAME?"}},{"$f":"IF(preencher!#ref!=\"\",\"\",IF(COUNTIF(preencher!#ref!,preencher!#ref!)=0,CONCATENATE(preencher!#ref!,#REF!),preencher!#ref!))","v":{"$error":"#NAME?"}},{"$f":"IF(preencher!#ref!=\"\",\"\",IF(COUNTIF(preencher!#ref!,preencher!#ref!)=0,CONCATENATE(preencher!#ref!,#REF!),preencher!#ref!))","v":{"$error":"#NAME?"}},{"$f":"IF(preencher!#ref!=\"\",\"\",IF(COUNTIF(preencher!#ref!,preencher!#ref!)=0,CONCATENATE(preencher!#ref!,#REF!),preencher!#ref!))","v":{"$error":"#NAME?"}},{"$f":"IF(preencher!#ref!=\"\",\"\",IF(COUNTIF(preencher!#ref!,preencher!#ref!)=0,CONCATENATE(preencher!#ref!,#REF!),preencher!#ref!))","v":{"$error":"#NAME?"}},{"$f":"IF(preencher!#ref!=\"\",\"\",IF(COUNTIF(preencher!#ref!,preencher!#ref!)=0,CONCATENATE(preencher!#ref!,#REF!),preencher!#ref!))","v":{"$error":"#NAME?"}},{"$f":"IF(preencher!#ref!=\"\",\"\",IF(COUNTIF(preencher!#ref!,preencher!#ref!)=0,CONCATENATE(preencher!#ref!,#REF!),preencher!#ref!))","v":{"$error":"#NAME?"}},{"$f":"IF(preencher!#ref!=\"\",\"\",IF(COUNTIF(preencher!#ref!,preencher!#ref!)=0,CONCATENATE(preencher!#ref!,#REF!),preencher!#ref!))","v":{"$error":"#NAME?"}},{"$f":"IF(preencher!#ref!=\"\",\"\",IF(COUNTIF(preencher!#ref!,preencher!#ref!)=0,CONCATENATE(preencher!#ref!,#REF!),preencher!#ref!))","v":{"$error":"#NAME?"}},{"$f":"IF(preencher!#ref!=\"\",\"\",IF(COUNTIF(preencher!#ref!,preencher!#ref!)=0,CONCATENATE(preencher!#ref!,#REF!),preencher!#ref!))","v":{"$error":"#NAME?"}},{"$f":"IF(ISERROR(ROUND(AVERAGE(E32:N32),2)),\"\",ROUND(AVERAGE(E32:N32),2))","v":""},{"$f":"IF(ISERROR(ROUND(O32*D32,2)),\"\",ROUND(O32*D32,2))","v":""},null,null,{"$f":"IF(ISERROR(MEDIAN(E32:N32)),\"\",MEDIAN(E32:N32))","v":""},{"$f":"IF(ISERROR(STDEV(E32:N32)),\"\",STDEV(E32:N32))","v":""},{"$f":"IF(ISERROR(T32/O32),\"\",T32/O32)","v":""}]
[{"$f":"IF(preencher!#ref!=\"\",\"\",preencher!#ref!)","v":{"$error":"#NAME?"}},{"$f":"IF(preencher!#ref!=\"\",\"\",preencher!#ref!)","v":{"$error":"#NAME?"}},{"$f":"IF(preencher!#ref!=\"\",\"\",preencher!#ref!)","v":{"$error":"#NAME?"}},{"$f":"IF(preencher!#ref!=\"\",\"\",preencher!#ref!)","v":{"$error":"#NAME?"}},{"$f":"IF(preencher!#ref!=\"\",\"\",IF(COUNTIF(preencher!#ref!,preencher!#ref!)=0,CONCATENATE(preencher!#ref!,#REF!),preencher!#ref!))","v":{"$error":"#NAME?"}},{"$f":"IF(preencher!#ref!=\"\",\"\",IF(COUNTIF(preencher!#ref!,preencher!#ref!)=0,CONCATENATE(preencher!#ref!,#REF!),preencher!#ref!))","v":{"$error":"#NAME?"}},{"$f":"IF(preencher!#ref!=\"\",\"\",IF(COUNTIF(preencher!#ref!,preencher!#ref!)=0,CONCATENATE(preencher!#ref!,#REF!),preencher!#ref!))","v":{"$error":"#NAME?"}},{"$f":"IF(preencher!#ref!=\"\",\"\",IF(COUNTIF(preencher!#ref!,preencher!#ref!)=0,CONCATENATE(preencher!#ref!,#REF!),preencher!#ref!))","v":{"$error":"#NAME?"}},{"$f":"IF(preencher!#ref!=\"\",\"\",IF(COUNTIF(preencher!#ref!,preencher!#ref!)=0,CONCATENATE(preencher!#ref!,#REF!),preencher!#ref!))","v":{"$error":"#NAME?"}},{"$f":"IF(preencher!#ref!=\"\",\"\",IF(COUNTIF(preencher!#ref!,preencher!#ref!)=0,CONCATENATE(preencher!#ref!,#REF!),preencher!#ref!))","v":{"$error":"#NAME?"}},{"$f":"IF(preencher!#ref!=\"\",\"\",IF(COUNTIF(preencher!#ref!,preencher!#ref!)=0,CONCATENATE(preencher!#ref!,#REF!),preencher!#ref!))","v":{"$error":"#NAME?"}},{"$f":"IF(preencher!#ref!=\"\",\"\",IF(COUNTIF(preencher!#ref!,preencher!#ref!)=0,CONCATENATE(preencher!#ref!,#REF!),preencher!#ref!))","v":{"$error":"#NAME?"}},{"$f":"IF(preencher!#ref!=\"\",\"\",IF(COUNTIF(preencher!#ref!,preencher!#ref!)=0,CONCATENATE(preencher!#ref!,#REF!),preencher!#ref!))","v":{"$error":"#NAME?"}},{"$f":"IF(preencher!#ref!=\"\",\"\",IF(COUNTIF(preencher!#ref!,preencher!#ref!)=0,CONCATENATE(preencher!#ref!,#REF!),preencher!#ref!))","v":{"$error":"#NAME?"}},{"$f":"IF(ISERROR(ROUND(AVERAGE(E33:N33),2)),\"\",ROUND(AVERAGE(E33:N33),2))","v":""},{"$f":"IF(ISERROR(ROUND(O33*D33,2)),\"\",ROUND(O33*D33,2))","v":""},null,null,{"$f":"IF(ISERROR(MEDIAN(E33:N33)),\"\",MEDIAN(E33:N33))","v":""},{"$f":"IF(ISERROR(STDEV(E33:N33)),\"\",STDEV(E33:N33))","v":""},{"$f":"IF(ISERROR(T33/O33),\"\",T33/O33)","v":""}]
[{"$f":"IF(preencher!#ref!=\"\",\"\",preencher!#ref!)","v":{"$error":"#NAME?"}},{"$f":"IF(preencher!#ref!=\"\",\"\",preencher!#ref!)","v":{"$error":"#NAME?"}},{"$f":"IF(preencher!#ref!=\"\",\"\",preencher!#ref!)","v":{"$error":"#NAME?"}},{"$f":"IF(preencher!#ref!=\"\",\"\",preencher!#ref!)","v":{"$error":"#NAME?"}},{"$f":"IF(preencher!#ref!=\"\",\"\",IF(COUNTIF(preencher!#ref!,preencher!#ref!)=0,CONCATENATE(preencher!#ref!,#REF!),preencher!#ref!))","v":{"$error":"#NAME?"}},{"$f":"IF(preencher!#ref!=\"\",\"\",IF(COUNTIF(preencher!#ref!,preencher!#ref!)=0,CONCATENATE(preencher!#ref!,#REF!),preencher!#ref!))","v":{"$error":"#NAME?"}},{"$f":"IF(preencher!#ref!=\"\",\"\",IF(COUNTIF(preencher!#ref!,preencher!#ref!)=0,CONCATENATE(preencher!#ref!,#REF!),preencher!#ref!))","v":{"$error":"#NAME?"}},{"$f":"IF(preencher!#ref!=\"\",\"\",IF(COUNTIF(preencher!#ref!,preencher!#ref!)=0,CONCATENATE(preencher!#ref!,#REF!),preencher!#ref!))","v":{"$error":"#NAME?"}},{"$f":"IF(preencher!#ref!=\"\",\"\",IF(COUNTIF(preencher!#ref!,preencher!#ref!)=0,CONCATENATE(preencher!#ref!,#REF!),preencher!#ref!))","v":{"$error":"#NAME?"}},{"$f":"IF(preencher!#ref!=\"\",\"\",IF(COUNTIF(preencher!#ref!,preencher!#ref!)=0,CONCATENATE(preencher!#ref!,#REF!),preencher!#ref!))","v":{"$error":"#NAME?"}},{"$f":"IF(preencher!#ref!=\"\",\"\",IF(COUNTIF(preencher!#ref!,preencher!#ref!)=0,CONCATENATE(preencher!#ref!,#REF!),preencher!#ref!))","v":{"$error":"#NAME?"}},{"$f":"IF(preencher!#ref!=\"\",\"\",IF(COUNTIF(preencher!#ref!,preencher!#ref!)=0,CONCATENATE(preencher!#ref!,#REF!),preencher!#ref!))","v":{"$error":"#NAME?"}},{"$f":"IF(preencher!#ref!=\"\",\"\",IF(COUNTIF(preencher!#ref!,preencher!#ref!)=0,CONCATENATE(preencher!#ref!,#REF!),preencher!#ref!))","v":{"$error":"#NAME?"}},{"$f":"IF(preencher!#ref!=\"\",\"\",IF(COUNTIF(preencher!#ref!,preencher!#ref!)=0,CONCATENATE(preencher!#ref!,#REF!),preencher!#ref!))","v":{"$error":"#NAME?"}},{"$f":"IF(ISERROR(ROUND(AVERAGE(E34:N34),2)),\"\",ROUND(AVERAGE(E34:N34),2))","v":""},{"$f":"IF(ISERROR(ROUND(O34*D34,2)),\"\",ROUND(O34*D34,2))","v":""},null,null,{"$f":"IF(ISERROR(MEDIAN(E34:N34)),\"\",MEDIAN(E34:N34))","v":""},{"$f":"IF(ISERROR(STDEV(E34:N34)),\"\",STDEV(E34:N34))","v":""},{"$f":"IF(ISERROR(T34/O34),\"\",T34/O34)","v":""}]
[{"$f":"IF(preencher!#ref!=\"\",\"\",preencher!#ref!)","v":{"$error":"#NAME?"}},{"$f":"IF(preencher!#ref!=\"\",\"\",preencher!#ref!)","v":{"$error":"#NAME?"}},{"$f":"IF(preencher!#ref!=\"\",\"\",preencher!#ref!)","v":{"$error":"#NAME?"}},{"$f":"IF(preencher!#ref!=\"\",\"\",preencher!#ref!)","v":{"$error":"#NAME?"}},{"$f":"IF(preencher!#ref!=\"\",\"\",IF(COUNTIF(preencher!#ref!,preencher!#ref!)=0,CONCATENATE(preencher!#ref!,#REF!),preencher!#ref!))","v":{"$error":"#NAME?"}},{"$f":"IF(preencher!#ref!=\"\",\"\",IF(COUNTIF(preencher!#ref!,preencher!#ref!)=0,CONCATENATE(preencher!#ref!,#REF!),preencher!#ref!))","v":{"$error":"#NAME?"}},{"$f":"IF(preencher!#ref!=\"\",\"\",IF(COUNTIF(preencher!#ref!,preencher!#ref!)=0,CONCATENATE(preencher!#ref!,#REF!),preencher!#ref!))","v":{"$error":"#NAME?"}},{"$f":"IF(preencher!#ref!=\"\",\"\",IF(COUNTIF(preencher!#ref!,preencher!#ref!)=0,CONCATENATE(preencher!#ref!,#REF!),preencher!#ref!))","v":{"$error":"#NAME?"}},{"$f":"IF(preencher!#ref!=\"\",\"\",IF(COUNTIF(preencher!#ref!,preencher!#ref!)=0,CONCATENATE(preencher!#ref!,#REF!),preencher!#ref!))","v":{"$error":"#NAME?"}},{"$f":"IF(preencher!#ref!=\"\",\"\",IF(COUNTIF(preencher!#ref!,preencher!#ref!)=0,CONCATENATE(preencher!#ref!,#REF!),preencher!#ref!))","v":{"$error":"#NAME?"}},{"$f":"IF(preencher!#ref!=\"\",\"\",IF(COUNTIF(preencher!#ref!,preencher!#ref!)=0,CONCATENATE(preencher!#ref!,#REF!),preencher!#ref!))","v":{"$error":"#NAME?"}},{"$f":"IF(preencher!#ref!=\"\",\"\",IF(COUNTIF(preencher!#ref!,preencher!#ref!)=0,CONCATENATE(preencher!#ref!,#REF!),preencher!#ref!))","v":{"$error":"#NAME?"}},{"$f":"IF(preencher!#ref!=\"\",\"\",IF(COUNTIF(preencher!#ref!,preencher!#ref!)=0,CONCATENATE(preencher!#ref!,#REF!),preencher!#ref!))","v":{"$error":"#NAME?"}},{"$f":"IF(preencher!#ref!=\"\",\"\",IF(COUNTIF(preencher!#ref!,preencher!#ref!)=0,CONCATENATE(preencher!#ref!,#REF!),preencher!#ref!))","v":{"$error":"#NAME?"}},{"$f":"IF(ISERROR(ROUND(AVERAGE(E35:N35),2)),\"\",ROUND(AVERAGE(E35:N35),2))","v":""},{"$f":"IF(ISERROR(ROUND(O35*D35,2)),\"\",ROUND(O35*D35,2))","v":""},null,null,{"$f":"IF(ISERROR(MEDIAN(E35:N35)),\"\",MEDIAN(E35:N35))","v":""},{"$f":"IF(ISERROR(STDEV(E35:N35)),\"\",STDEV(E35:N35))","v":""},{"$f":"IF(ISERROR(T35/O35),\"\",T35/O35)","v":""}]
[{"$f":"IF(preencher!#ref!=\"\",\"\",preencher!#ref!)","v":{"$error":"#NAME?"}},{"$f":"IF(preencher!#ref!=\"\",\"\",preencher!#ref!)","v":{"$error":"#NAME?"}},{"$f":"IF(preencher!#ref!=\"\",\"\",preencher!#ref!)","v":{"$error":"#NAME?"}},{"$f":"IF(preencher!#ref!=\"\",\"\",preencher!#ref!)","v":{"$error":"#NAME?"}},{"$f":"IF(preencher!#ref!=\"\",\"\",IF(COUNTIF(preencher!#ref!,preencher!#ref!)=0,CONCATENATE(preencher!#ref!,#REF!),preencher!#ref!))","v":{"$error":"#NAME?"}},{"$f":"IF(preencher!#ref!=\"\",\"\",IF(COUNTIF(preencher!#ref!,preencher!#ref!)=0,CONCATENATE(preencher!#ref!,#REF!),preencher!#ref!))","v":{"$error":"#NAME?"}},{"$f":"IF(preencher!#ref!=\"\",\"\",IF(COUNTIF(preencher!#ref!,preencher!#ref!)=0,CONCATENATE(preencher!#ref!,#REF!),preencher!#ref!))","v":{"$error":"#NAME?"}},{"$f":"IF(preencher!#ref!=\"\",\"\",IF(COUNTIF(preencher!#ref!,preencher!#ref!)=0,CONCATENATE(preencher!#ref!,#REF!),preencher!#ref!))","v":{"$error":"#NAME?"}},{"$f":"IF(preencher!#ref!=\"\",\"\",IF(COUNTIF(preencher!#ref!,preencher!#ref!)=0,CONCATENATE(preencher!#ref!,#REF!),preencher!#ref!))","v":{"$error":"#NAME?"}},{"$f":"IF(preencher!#ref!=\"\",\"\",IF(COUNTIF(preencher!#ref!,preencher!#ref!)=0,CONCATENATE(preencher!#ref!,#REF!),preencher!#ref!))","v":{"$error":"#NAME?"}},{"$f":"IF(preencher!#ref!=\"\",\"\",IF(COUNTIF(preencher!#ref!,preencher!#ref!)=0,CONCATENATE(preencher!#ref!,#REF!),preencher!#ref!))","v":{"$error":"#NAME?"}},{"$f":"IF(preencher!#ref!=\"\",\"\",IF(COUNTIF(preencher!#ref!,preencher!#ref!)=0,CONCATENATE(preencher!#ref!,#REF!),preencher!#ref!))","v":{"$error":"#NAME?"}},{"$f":"IF(preencher!#ref!=\"\",\"\",IF(COUNTIF(preencher!#ref!,preencher!#ref!)=0,CONCATENATE(preencher!#ref!,#REF!),preencher!#ref!))","v":{"$error":"#NAME?"}},{"$f":"IF(preencher!#ref!=\"\",\"\",IF(COUNTIF(preencher!#ref!,preencher!#ref!)=0,CONCATENATE(preencher!#ref!,#REF!),preencher!#ref!))","v":{"$error":"#NAME?"}},{"$f":"IF(ISERROR(ROUND(AVERAGE(E36:N36),2)),\"\",ROUND(AVERAGE(E36:N36),2))","v":""},{"$f":"IF(ISERROR(ROUND(O36*D36,2)),\"\",ROUND(O36*D36,2))","v":""},null,null,{"$f":"IF(ISERROR(MEDIAN(E36:N36)),\"\",MEDIAN(E36:N36))","v":""},{"$f":"IF(ISERROR(STDEV(E36:N36)),\"\",STDEV(E36:N36))","v":""},{"$f":"IF(ISERROR(T36/O36),\"\",T36/O36)","v":""}]
[{"$f":"IF(preencher!#ref!=\"\",\"\",preencher!#ref!)","v":{"$error":"#NAME?"}},{"$f":"IF(preencher!#ref!=\"\",\"\",preencher!#ref!)","v":{"$error":"#NAME?"}},{"$f":"IF(preencher!#ref!=\"\",\"\",preencher!#ref!)","v":{"$error":"#NAME?"}},{"$f":"IF(preencher!#ref!=\"\",\"\",preencher!#ref!)","v":{"$error":"#NAME?"}},{"$f":"IF(preencher!#ref!=\"\",\"\",IF(COUNTIF(preencher!#ref!,preencher!#ref!)=0,CONCATENATE(preencher!#ref!,#REF!),preencher!#ref!))","v":{"$error":"#NAME?"}},{"$f":"IF(preencher!#ref!=\"\",\"\",IF(COUNTIF(preencher!#ref!,preencher!#ref!)=0,CONCATENATE(preencher!#ref!,#REF!),preencher!#ref!))","v":{"$error":"#NAME?"}},{"$f":"IF(preencher!#ref!=\"\",\"\",IF(COUNTIF(preencher!#ref!,preencher!#ref!)=0,CONCATENATE(preencher!#ref!,#REF!),preencher!#ref!))","v":{"$error":"#NAME?"}},{"$f":"IF(preencher!#ref!=\"\",\"\",IF(COUNTIF(preencher!#ref!,preencher!#ref!)=0,CONCATENATE(preencher!#ref!,#REF!),preencher!#ref!))","v":{"$error":"#NAME?"}},{"$f":"IF(preencher!#ref!=\"\",\"\",IF(COUNTIF(preencher!#ref!,preencher!#ref!)=0,CONCATENATE(preencher!#ref!,#REF!),preencher!#ref!))","v":{"$error":"#NAME?"}},{"$f":"IF(preencher!#ref!=\"\",\"\",IF(COUNTIF(preencher!#ref!,preencher!#ref!)=0,CONCATENATE(preencher!#ref!,#REF!),preencher!#ref!))","v":{"$error":"#NAME?"}},{"$f":"IF(preencher!#ref!=\"\",\"\",IF(COUNTIF(preencher!#ref!,preencher!#ref!)=0,CONCATENATE(preencher!#ref!,#REF!),preencher!#ref!))","v":{"$error":"#NAME?"}},{"$f":"IF(preencher!#ref!=\"\",\"\",IF(COUNTIF(preencher!#ref!,preencher!#ref!)=0,CONCATENATE(preencher!#ref!,#REF!),preencher!#ref!))","v":{"$error":"#NAME?"}},{"$f":"IF(preencher!#ref!=\"\",\"\",IF(COUNTIF(preencher!#ref!,preencher!#ref!)=0,CONCATENATE(preencher!#ref!,#REF!),preencher!#ref!))","v":{"$error":"#NAME?"}},{"$f":"IF(preencher!#ref!=\"\",\"\",IF(COUNTIF(preencher!#ref!,preencher!#ref!)=0,CONCATENATE(preencher!#ref!,#REF!),preencher!#ref!))","v":{"$error":"#NAME?"}},{"$f":"IF(ISERROR(ROUND(AVERAGE(E37:N37),2)),\"\",ROUND(AVERAGE(E37:N37),2))","v":""},{"$f":"IF(ISERROR(ROUND(O37*D37,2)),\"\",ROUND(O37*D37,2))","v":""},null,null,{"$f":"IF(ISERROR(MEDIAN(E37:N37)),\"\",MEDIAN(E37:N37))","v":""},{"$f":"IF(ISERROR(STDEV(E37:N37)),\"\",STDEV(E37:N37))","v":""},{"$f":"IF(ISERROR(T37/O37),\"\",T37/O37)","v":""}]
[{"$f":"IF(preencher!#ref!=\"\",\"\",preencher!#ref!)","v":{"$error":"#NAME?"}},{"$f":"IF(preencher!#ref!=\"\",\"\",preencher!#ref!)","v":{"$error":"#NAME?"}},{"$f":"IF(preencher!#ref!=\"\",\"\",preencher!#ref!)","v":{"$error":"#NAME?"}},{"$f":"IF(preencher!#ref!=\"\",\"\",preencher!#ref!)","v":{"$error":"#NAME?"}},{"$f":"IF(preencher!#ref!=\"\",\"\",IF(COUNTIF(preencher!#ref!,preencher!#ref!)=0,CONCATENATE(preencher!#ref!,#REF!),preencher!#ref!))","v":{"$error":"#NAME?"}},{"$f":"IF(preencher!#ref!=\"\",\"\",IF(COUNTIF(preencher!#ref!,preencher!#ref!)=0,CONCATENATE(preencher!#ref!,#REF!),preencher!#ref!))","v":{"$error":"#NAME?"}},{"$f":"IF(preencher!#ref!=\"\",\"\",IF(COUNTIF(preencher!#ref!,preencher!#ref!)=0,CONCATENATE(preencher!#ref!,#REF!),preencher!#ref!))","v":{"$error":"#NAME?"}},{"$f":"IF(preencher!#ref!=\"\",\"\",IF(COUNTIF(preencher!#ref!,preencher!#ref!)=0,CONCATENATE(preencher!#ref!,#REF!),preencher!#ref!))","v":{"$error":"#NAME?"}},{"$f":"IF(preencher!#ref!=\"\",\"\",IF(COUNTIF(preencher!#ref!,preencher!#ref!)=0,CONCATENATE(preencher!#ref!,#REF!),preencher!#ref!))","v":{"$error":"#NAME?"}},{"$f":"IF(preencher!#ref!=\"\",\"\",IF(COUNTIF(preencher!#ref!,preencher!#ref!)=0,CONCATENATE(preencher!#ref!,#REF!),preencher!#ref!))","v":{"$error":"#NAME?"}},{"$f":"IF(preencher!#ref!=\"\",\"\",IF(COUNTIF(preencher!#ref!,preencher!#ref!)=0,CONCATENATE(preencher!#ref!,#REF!),preencher!#ref!))","v":{"$error":"#NAME?"}},{"$f":"IF(preencher!#ref!=\"\",\"\",IF(COUNTIF(preencher!#ref!,preencher!#ref!)=0,CONCATENATE(preencher!#ref!,#REF!),preencher!#ref!))","v":{"$error":"#NAME?"}},{"$f":"IF(preencher!#ref!=\"\",\"\",IF(COUNTIF(preencher!#ref!,preencher!#ref!)=0,CONCATENATE(preencher!#ref!,#REF!),preencher!#ref!))","v":{"$error":"#NAME?"}},{"$f":"IF(preencher!#ref!=\"\",\"\",IF(COUNTIF(preencher!#ref!,preencher!#ref!)=0,CONCATENATE(preencher!#ref!,#REF!),preencher!#ref!))","v":{"$error":"#NAME?"}},{"$f":"IF(ISERROR(ROUND(AVERAGE(E38:N38),2)),\"\",ROUND(AVERAGE(E38:N38),2))","v":""},{"$f":"IF(ISERROR(ROUND(O38*D38,2)),\"\",ROUND(O38*D38,2))","v":""},null,null,{"$f":"IF(ISERROR(MEDIAN(E38:N38)),\"\",MEDIAN(E38:N38))","v":""},{"$f":"IF(ISERROR(STDEV(E38:N38)),\"\",STDEV(E38:N38))","v":""},{"$f":"IF(ISERROR(T38/O38),\"\",T38/O38)","v":""}]
[{"$f":"IF(preencher!#ref!=\"\",\"\",preencher!#ref!)","v":{"$error":"#NAME?"}},{"$f":"IF(preencher!#ref!=\"\",\"\",preencher!#ref!)","v":{"$error":"#NAME?"}},{"$f":"IF(preencher!#ref!=\"\",\"\",preencher!#ref!)","v":{"$error":"#NAME?"}},{"$f":"IF(preencher!#ref!=\"\",\"\",preencher!#ref!)","v":{"$error":"#NAME?"}},{"$f":"IF(preencher!#ref!=\"\",\"\",IF(COUNTIF(preencher!#ref!,preencher!#ref!)=0,CONCATENATE(preencher!#ref!,#REF!),preencher!#ref!))","v":{"$error":"#NAME?"}},{"$f":"IF(preencher!#ref!=\"\",\"\",IF(COUNTIF(preencher!#ref!,preencher!#ref!)=0,CONCATENATE(preencher!#ref!,#REF!),preencher!#ref!))","v":{"$error":"#NAME?"}},{"$f":"IF(preencher!#ref!=\"\",\"\",IF(COUNTIF(preencher!#ref!,preencher!#ref!)=0,CONCATENATE(preencher!#ref!,#REF!),preencher!#ref!))","v":{"$error":"#NAME?"}},{"$f":"IF(preencher!#ref!=\"\",\"\",IF(COUNTIF(preencher!#ref!,preencher!#ref!)=0,CONCATENATE(preencher!#ref!,#REF!),preencher!#ref!))","v":{"$error":"#NAME?"}},{"$f":"IF(preencher!#ref!=\"\",\"\",IF(COUNTIF(preencher!#ref!,preencher!#ref!)=0,CONCATENATE(preencher!#ref!,#REF!),preencher!#ref!))","v":{"$error":"#NAME?"}},{"$f":"IF(preencher!#ref!=\"\",\"\",IF(COUNTIF(preencher!#ref!,preencher!#ref!)=0,CONCATENATE(preencher!#ref!,#REF!),preencher!#ref!))","v":{"$error":"#NAME?"}},{"$f":"IF(preencher!#ref!=\"\",\"\",IF(COUNTIF(preencher!#ref!,preencher!#ref!)=0,CONCATENATE(preencher!#ref!,#REF!),preencher!#ref!))","v":{"$error":"#NAME?"}},{"$f":"IF(preencher!#ref!=\"\",\"\",IF(COUNTIF(preencher!#ref!,preencher!#ref!)=0,CONCATENATE(preencher!#ref!,#REF!),preencher!#ref!))","v":{"$error":"#NAME?"}},{"$f":"IF(preencher!#ref!=\"\",\"\",IF(COUNTIF(preencher!#ref!,preencher!#ref!)=0,CONCATENATE(preencher!#ref!,#REF!),preencher!#ref!))","v":{"$error":"#NAME?"}},{"$f":"IF(preencher!#ref!=\"\",\"\",IF(COUNTIF(preencher!#ref!,preencher!#ref!)=0,CONCATENATE(preencher!#ref!,#REF!),preencher!#ref!))","v":{"$error":"#NAME?"}},{"$f":"IF(ISERROR(ROUND(AVERAGE(E39:N39),2)),\"\",ROUND(AVERAGE(E39:N39),2))","v":""},{"$f":"IF(ISERROR(ROUND(O39*D39,2)),\"\",ROUND(O39*D39,2))","v":""},null,null,{"$f":"IF(ISERROR(MEDIAN(E39:N39)),\"\",MEDIAN(E39:N39))","v":""},{"$f":"IF(ISERROR(STDEV(E39:N39)),\"\",STDEV(E39:N39))","v":""},{"$f":"IF(ISERROR(T39/O39),\"\",T39/O39)","v":""}]
[{"$f":"IF(preencher!#ref!=\"\",\"\",preencher!#ref!)","v":{"$error":"#NAME?"}},{"$f":"IF(preencher!#ref!=\"\",\"\",preencher!#ref!)","v":{"$error":"#NAME?"}},{"$f":"IF(preencher!#ref!=\"\",\"\",preencher!#ref!)","v":{"$error":"#NAME?"}},{"$f":"IF(preencher!#ref!=\"\",\"\",preencher!#ref!)","v":{"$error":"#NAME?"}},{"$f":"IF(preencher!#ref!=\"\",\"\",IF(COUNTIF(preencher!#ref!,preencher!#ref!)=0,CONCATENATE(preencher!#ref!,#REF!),preencher!#ref!))","v":{"$error":"#NAME?"}},{"$f":"IF(preencher!#ref!=\"\",\"\",IF(COUNTIF(preencher!#ref!,preencher!#ref!)=0,CONCATENATE(preencher!#ref!,#REF!),preencher!#ref!))","v":{"$error":"#NAME?"}},{"$f":"IF(preencher!#ref!=\"\",\"\",IF(COUNTIF(preencher!#ref!,preencher!#ref!)=0,CONCATENATE(preencher!#ref!,#REF!),preencher!#ref!))","v":{"$error":"#NAME?"}},{"$f":"IF(preencher!#ref!=\"\",\"\",IF(COUNTIF(preencher!#ref!,preencher!#ref!)=0,CONCATENATE(preencher!#ref!,#REF!),preencher!#ref!))","v":{"$error":"#NAME?"}},{"$f":"IF(preencher!#ref!=\"\",\"\",IF(COUNTIF(preencher!#ref!,preencher!#ref!)=0,CONCATENATE(preencher!#ref!,#REF!),preencher!#ref!))","v":{"$error":"#NAME?"}},{"$f":"IF(preencher!#ref!=\"\",\"\",IF(COUNTIF(preencher!#ref!,preencher!#ref!)=0,CONCATENATE(preencher!#ref!,#REF!),preencher!#ref!))","v":{"$error":"#NAME?"}},{"$f":"IF(preencher!#ref!=\"\",\"\",IF(COUNTIF(preencher!#ref!,preencher!#ref!)=0,CONCATENATE(preencher!#ref!,#REF!),preencher!#ref!))","v":{"$error":"#NAME?"}},{"$f":"IF(preencher!#ref!=\"\",\"\",IF(COUNTIF(preencher!#ref!,preencher!#ref!)=0,CONCATENATE(preencher!#ref!,#REF!),preencher!#ref!))","v":{"$error":"#NAME?"}},{"$f":"IF(preencher!#ref!=\"\",\"\",IF(COUNTIF(preencher!#ref!,preencher!#ref!)=0,CONCATENATE(preencher!#ref!,#REF!),preencher!#ref!))","v":{"$error":"#NAME?"}},{"$f":"IF(preencher!#ref!=\"\",\"\",IF(COUNTIF(preencher!#ref!,preencher!#ref!)=0,CONCATENATE(preencher!#ref!,#REF!),preencher!#ref!))","v":{"$error":"#NAME?"}},{"$f":"IF(ISERROR(ROUND(AVERAGE(E40:N40),2)),\"\",ROUND(AVERAGE(E40:N40),2))","v":""},{"$f":"IF(ISERROR(ROUND(O40*D40,2)),\"\",ROUND(O40*D40,2))","v":""},null,null,{"$f":"IF(ISERROR(MEDIAN(E40:N40)),\"\",MEDIAN(E40:N40))","v":""},{"$f":"IF(ISERROR(STDEV(E40:N40)),\"\",STDEV(E40:N40))","v":""},{"$f":"IF(ISERROR(T40/O40),\"\",T40/O40)","v":""}]
[{"$f":"IF(preencher!#ref!=\"\",\"\",preencher!#ref!)","v":{"$error":"#NAME?"}},{"$f":"IF(preencher!#ref!=\"\",\"\",preencher!#ref!)","v":{"$error":"#NAME?"}},{"$f":"IF(preencher!#ref!=\"\",\"\",preencher!#ref!)","v":{"$error":"#NAME?"}},{"$f":"IF(preencher!#ref!=\"\",\"\",preencher!#ref!)","v":{"$error":"#NAME?"}},{"$f":"IF(preencher!#ref!=\"\",\"\",IF(COUNTIF(preencher!#ref!,preencher!#ref!)=0,CONCATENATE(preencher!#ref!,#REF!),preencher!#ref!))","v":{"$error":"#NAME?"}},{"$f":"IF(preencher!#ref!=\"\",\"\",IF(COUNTIF(preencher!#ref!,preencher!#ref!)=0,CONCATENATE(preencher!#ref!,#REF!),preencher!#ref!))","v":{"$error":"#NAME?"}},{"$f":"IF(preencher!#ref!=\"\",\"\",IF(COUNTIF(preencher!#ref!,preencher!#ref!)=0,CONCATENATE(preencher!#ref!,#REF!),preencher!#ref!))","v":{"$error":"#NAME?"}},{"$f":"IF(preencher!#ref!=\"\",\"\",IF(COUNTIF(preencher!#ref!,preencher!#ref!)=0,CONCATENATE(preencher!#ref!,#REF!),preencher!#ref!))","v":{"$error":"#NAME?"}},{"$f":"IF(preencher!#ref!=\"\",\"\",IF(COUNTIF(preencher!#ref!,preencher!#ref!)=0,CONCATENATE(preencher!#ref!,#REF!),preencher!#ref!))","v":{"$error":"#NAME?"}},{"$f":"IF(preencher!#ref!=\"\",\"\",IF(COUNTIF(preencher!#ref!,preencher!#ref!)=0,CONCATENATE(preencher!#ref!,#REF!),preencher!#ref!))","v":{"$error":"#NAME?"}},{"$f":"IF(preencher!#ref!=\"\",\"\",IF(COUNTIF(preencher!#ref!,preencher!#ref!)=0,CONCATENATE(preencher!#ref!,#REF!),preencher!#ref!))","v":{"$error":"#NAME?"}},{"$f":"IF(preencher!#ref!=\"\",\"\",IF(COUNTIF(preencher!#ref!,preencher!#ref!)=0,CONCATENATE(preencher!#ref!,#REF!),preencher!#ref!))","v":{"$error":"#NAME?"}},{"$f":"IF(preencher!#ref!=\"\",\"\",IF(COUNTIF(preencher!#ref!,preencher!#ref!)=0,CONCATENATE(preencher!#ref!,#REF!),preencher!#ref!))","v":{"$error":"#NAME?"}},{"$f":"IF(preencher!#ref!=\"\",\"\",IF(COUNTIF(preencher!#ref!,preencher!#ref!)=0,CONCATENATE(preencher!#ref!,#REF!),preencher!#ref!))","v":{"$error":"#NAME?"}},{"$f":"IF(ISERROR(ROUND(AVERAGE(E41:N41),2)),\"\",ROUND(AVERAGE(E41:N41),2))","v":""},{"$f":"IF(ISERROR(ROUND(O41*D41,2)),\"\",ROUND(O41*D41,2))","v":""},null,null,{"$f":"IF(ISERROR(MEDIAN(E41:N41)),\"\",MEDIAN(E41:N41))","v":""},{"$f":"IF(ISERROR(STDEV(E41:N41)),\"\",STDEV(E41:N41))","v":""},{"$f":"IF(ISERROR(T41/O41),\"\",T41/O41)","v":""}]
[{"$f":"IF(preencher!#ref!=\"\",\"\",preencher!#ref!)","v":{"$error":"#NAME?"}},{"$f":"IF(preencher!#ref!=\"\",\"\",preencher!#ref!)","v":{"$error":"#NAME?"}},{"$f":"IF(preencher!#ref!=\"\",\"\",preencher!#ref!)","v":{"$error":"#NAME?"}},{"$f":"IF(preencher!#ref!=\"\",\"\",preencher!#ref!)","v":{"$error":"#NAME?"}},{"$f":"IF(preencher!#ref!=\"\",\"\",IF(COUNTIF(preencher!#ref!,preencher!#ref!)=0,CONCATENATE(preencher!#ref!,#REF!),preencher!#ref!))","v":{"$error":"#NAME?"}},{"$f":"IF(preencher!#ref!=\"\",\"\",IF(COUNTIF(preencher!#ref!,preencher!#ref!)=0,CONCATENATE(preencher!#ref!,#REF!),preencher!#ref!))","v":{"$error":"#NAME?"}},{"$f":"IF(preencher!#ref!=\"\",\"\",IF(COUNTIF(preencher!#ref!,preencher!#ref!)=0,CONCATENATE(preencher!#ref!,#REF!),preencher!#ref!))","v":{"$error":"#NAME?"}},{"$f":"IF(preencher!#ref!=\"\",\"\",IF(COUNTIF(preencher!#ref!,preencher!#ref!)=0,CONCATENATE(preencher!#ref!,#REF!),preencher!#ref!))","v":{"$error":"#NAME?"}},{"$f":"IF(preencher!#ref!=\"\",\"\",IF(COUNTIF(preencher!#ref!,preencher!#ref!)=0,CONCATENATE(preencher!#ref!,#REF!),preencher!#ref!))","v":{"$error":"#NAME?"}},{"$f":"IF(preencher!#ref!=\"\",\"\",IF(COUNTIF(preencher!#ref!,preencher!#ref!)=0,CONCATENATE(preencher!#ref!,#REF!),preencher!#ref!))","v":{"$error":"#NAME?"}},{"$f":"IF(preencher!#ref!=\"\",\"\",IF(COUNTIF(preencher!#ref!,preencher!#ref!)=0,CONCATENATE(preencher!#ref!,#REF!),preencher!#ref!))","v":{"$error":"#NAME?"}},{"$f":"IF(preencher!#ref!=\"\",\"\",IF(COUNTIF(preencher!#ref!,preencher!#ref!)=0,CONCATENATE(preencher!#ref!,#REF!),preencher!#ref!))","v":{"$error":"#NAME?"}},{"$f":"IF(preencher!#ref!=\"\",\"\",IF(COUNTIF(preencher!#ref!,preencher!#ref!)=0,CONCATENATE(preencher!#ref!,#REF!),preencher!#ref!))","v":{"$error":"#NAME?"}},{"$f":"IF(preencher!#ref!=\"\",\"\",IF(COUNTIF(preencher!#ref!,preencher!#ref!)=0,CONCATENATE(preencher!#ref!,#REF!),preencher!#ref!))","v":{"$error":"#NAME?"}},{"$f":"IF(ISERROR(ROUND(AVERAGE(E42:N42),2)),\"\",ROUND(AVERAGE(E42:N42),2))","v":""},{"$f":"IF(ISERROR(ROUND(O42*D42,2)),\"\",ROUND(O42*D42,2))","v":""},null,null,{"$f":"IF(ISERROR(MEDIAN(E42:N42)),\"\",MEDIAN(E42:N42))","v":""},{"$f":"IF(ISERROR(STDEV(E42:N42)),\"\",STDEV(E42:N42))","v":""},{"$f":"IF(ISERROR(T42/O42),\"\",T42/O42)","v":""}]
[{"$f":"IF(preencher!#ref!=\"\",\"\",preencher!#ref!)","v":{"$error":"#NAME?"}},{"$f":"IF(preencher!#ref!=\"\",\"\",preencher!#ref!)","v":{"$error":"#NAME?"}},{"$f":"IF(preencher!#ref!=\"\",\"\",preencher!#ref!)","v":{"$error":"#NAME?"}},{"$f":"IF(preencher!#ref!=\"\",\"\",preencher!#ref!)","v":{"$error":"#NAME?"}},{"$f":"IF(preencher!#ref!=\"\",\"\",IF(COUNTIF(preencher!#ref!,preencher!#ref!)=0,CONCATENATE(preencher!#ref!,#REF!),preencher!#ref!))","v":{"$error":"#NAME?"}},{"$f":"IF(preencher!#ref!=\"\",\"\",IF(COUNTIF(preencher!#ref!,preencher!#ref!)=0,CONCATENATE(preencher!#ref!,#REF!),preencher!#ref!))","v":{"$error":"#NAME?"}},{"$f":"IF(preencher!#ref!=\"\",\"\",IF(COUNTIF(preencher!#ref!,preencher!#ref!)=0,CONCATENATE(preencher!#ref!,#REF!),preencher!#ref!))","v":{"$error":"#NAME?"}},{"$f":"IF(preencher!#ref!=\"\",\"\",IF(COUNTIF(preencher!#ref!,preencher!#ref!)=0,CONCATENATE(preencher!#ref!,#REF!),preencher!#ref!))","v":{"$error":"#NAME?"}},{"$f":"IF(preencher!#ref!=\"\",\"\",IF(COUNTIF(preencher!#ref!,preencher!#ref!)=0,CONCATENATE(preencher!#ref!,#REF!),preencher!#ref!))","v":{"$error":"#NAME?"}},{"$f":"IF(preencher!#ref!=\"\",\"\",IF(COUNTIF(preencher!#ref!,preencher!#ref!)=0,CONCATENATE(preencher!#ref!,#REF!),preencher!#ref!))","v":{"$error":"#NAME?"}},{"$f":"IF(preencher!#ref!=\"\",\"\",IF(COUNTIF(preencher!#ref!,preencher!#ref!)=0,CONCATENATE(preencher!#ref!,#REF!),preencher!#ref!))","v":{"$error":"#NAME?"}},{"$f":"IF(preencher!#ref!=\"\",\"\",IF(COUNTIF(preencher!#ref!,preencher!#ref!)=0,CONCATENATE(preencher!#ref!,#REF!),preencher!#ref!))","v":{"$error":"#NAME?"}},{"$f":"IF(preencher!#ref!=\"\",\"\",IF(COUNTIF(preencher!#ref!,preencher!#ref!)=0,CONCATENATE(preencher!#ref!,#REF!),preencher!#ref!))","v":{"$error":"#NAME?"}},{"$f":"IF(preencher!#ref!=\"\",\"\",IF(COUNTIF(preencher!#ref!,preencher!#ref!)=0,CONCATENATE(preencher!#ref!,#REF!),preencher!#ref!))","v":{"$error":"#NAME?"}},{"$f":"IF(ISERROR(ROUND(AVERAGE(E43:N43),2)),\"\",ROUND(AVERAGE(E43:N43),2))","v":""},{"$f":"IF(ISERROR(ROUND(O43*D43,2)),\"\",ROUND(O43*D43,2))","v":""},null,null,{"$f":"IF(ISERROR(MEDIAN(E43:N43)),\"\",MEDIAN(E43:N43))","v":""},{"$f":"IF(ISERROR(STDEV(E43:N43)),\"\",STDEV(E43:N43))","v":""},{"$f":"IF(ISERROR(T43/O43),\"\",T43/O43)","v":""}]
[{"$f":"IF(preencher!#ref!=\"\",\"\",preencher!#ref!)","v":{"$error":"#NAME?"}},{"$f":"IF(preencher!#ref!=\"\",\"\",preencher!#ref!)","v":{"$error":"#NAME?"}},{"$f":"IF(preencher!#ref!=\"\",\"\",preencher!#ref!)","v":{"$error":"#NAME?"}},{"$f":"IF(preencher!#ref!=\"\",\"\",preencher!#ref!)","v":{"$error":"#NAME?"}},{"$f":"IF(preencher!#ref!=\"\",\"\",IF(COUNTIF(preencher!#ref!,preencher!#ref!)=0,CONCATENATE(preencher!#ref!,#REF!),preencher!#ref!))","v":{"$error":"#NAME?"}},{"$f":"IF(preencher!#ref!=\"\",\"\",IF(COUNTIF(preencher!#ref!,preencher!#ref!)=0,CONCATENATE(preencher!#ref!,#REF!),preencher!#ref!))","v":{"$error":"#NAME?"}},{"$f":"IF(preencher!#ref!=\"\",\"\",IF(COUNTIF(preencher!#ref!,preencher!#ref!)=0,CONCATENATE(preencher!#ref!,#REF!),preencher!#ref!))","v":{"$error":"#NAME?"}},{"$f":"IF(preencher!#ref!=\"\",\"\",IF(COUNTIF(preencher!#ref!,preencher!#ref!)=0,CONCATENATE(preencher!#ref!,#REF!),preencher!#ref!))","v":{"$error":"#NAME?"}},{"$f":"IF(preencher!#ref!=\"\",\"\",IF(COUNTIF(preencher!#ref!,preencher!#ref!)=0,CONCATENATE(preencher!#ref!,#REF!),preencher!#ref!))","v":{"$error":"#NAME?"}},{"$f":"IF(preencher!#ref!=\"\",\"\",IF(COUNTIF(preencher!#ref!,preencher!#ref!)=0,CONCATENATE(preencher!#ref!,#REF!),preencher!#ref!))","v":{"$error":"#NAME?"}},{"$f":"IF(preencher!#ref!=\"\",\"\",IF(COUNTIF(preencher!#ref!,preencher!#ref!)=0,CONCATENATE(preencher!#ref!,#REF!),preencher!#ref!))","v":{"$error":"#NAME?"}},{"$f":"IF(preencher!#ref!=\"\",\"\",IF(COUNTIF(preencher!#ref!,preencher!#ref!)=0,CONCATENATE(preencher!#ref!,#REF!),preencher!#ref!))","v":{"$error":"#NAME?"}},{"$f":"IF(preencher!#ref!=\"\",\"\",IF(COUNTIF(preencher!#ref!,preencher!#ref!)=0,CONCATENATE(preencher!#ref!,#REF!),preencher!#ref!))","v":{"$error":"#NAME?"}},{"$f":"IF(preencher!#ref!=\"\",\"\",IF(COUNTIF(preencher!#ref!,preencher!#ref!)=0,CONCATENATE(preencher!#ref!,#REF!),preencher!#ref!))","v":{"$error":"#NAME?"}},{"$f":"IF(ISERROR(ROUND(AVERAGE(E44:N44),2)),\"\",ROUND(AVERAGE(E44:N44),2))","v":""},{"$f":"IF(ISERROR(ROUND(O44*D44,2)),\"\",ROUND(O44*D44,2))","v":""},null,null,{"$f":"IF(ISERROR(MEDIAN(E44:N44)),\"\",MEDIAN(E44:N44))","v":""},{"$f":"IF(ISERROR(STDEV(E44:N44)),\"\",STDEV(E44:N44))","v":""},{"$f":"IF(ISERROR(T44/O44),\"\",T44/O44)","v":""}]
[{"$f":"IF(preencher!#ref!=\"\",\"\",preencher!#ref!)","v":{"$error":"#NAME?"}},{"$f":"IF(preencher!#ref!=\"\",\"\",preencher!#ref!)","v":{"$error":"#NAME?"}},{"$f":"IF(preencher!#ref!=\"\",\"\",preencher!#ref!)","v":{"$error":"#NAME?"}},{"$f":"IF(preencher!#ref!=\"\",\"\",preencher!#ref!)","v":{"$error":"#NAME?"}},{"$f":"IF(preencher!#ref!=\"\",\"\",IF(COUNTIF(preencher!#ref!,preencher!#ref!)=0,CONCATENATE(preencher!#ref!,#REF!),preencher!#ref!))","v":{"$error":"#NAME?"}},{"$f":"IF(preencher!#ref!=\"\",\"\",IF(COUNTIF(preencher!#ref!,preencher!#ref!)=0,CONCATENATE(preencher!#ref!,#REF!),preencher!#ref!))","v":{"$error":"#NAME?"}},{"$f":"IF(preencher!#ref!=\"\",\"\",IF(COUNTIF(preencher!#ref!,preencher!#ref!)=0,CONCATENATE(preencher!#ref!,#REF!),preencher!#ref!))","v":{"$error":"#NAME?"}},{"$f":"IF(preencher!#ref!=\"\",\"\",IF(COUNTIF(preencher!#ref!,preencher!#ref!)=0,CONCATENATE(preencher!#ref!,#REF!),preencher!#ref!))","v":{"$error":"#NAME?"}},{"$f":"IF(preencher!#ref!=\"\",\"\",IF(COUNTIF(preencher!#ref!,preencher!#ref!)=0,CONCATENATE(preencher!#ref!,#REF!),preencher!#ref!))","v":{"$error":"#NAME?"}},{"$f":"IF(preencher!#ref!=\"\",\"\",IF(COUNTIF(preencher!#ref!,preencher!#ref!)=0,CONCATENATE(preencher!#ref!,#REF!),preencher!#ref!))","v":{"$error":"#NAME?"}},{"$f":"IF(preencher!#ref!=\"\",\"\",IF(COUNTIF(preencher!#ref!,preencher!#ref!)=0,CONCATENATE(preencher!#ref!,#REF!),preencher!#ref!))","v":{"$error":"#NAME?"}},{"$f":"IF(preencher!#ref!=\"\",\"\",IF(COUNTIF(preencher!#ref!,preencher!#ref!)=0,CONCATENATE(preencher!#ref!,#REF!),preencher!#ref!))","v":{"$error":"#NAME?"}},{"$f":"IF(preencher!#ref!=\"\",\"\",IF(COUNTIF(preencher!#ref!,preencher!#ref!)=0,CONCATENATE(preencher!#ref!,#REF!),preencher!#ref!))","v":{"$error":"#NAME?"}},{"$f":"IF(preencher!#ref!=\"\",\"\",IF(COUNTIF(preencher!#ref!,preencher!#ref!)=0,CONCATENATE(preencher!#ref!,#REF!),preencher!#ref!))","v":{"$error":"#NAME?"}},{"$f":"IF(ISERROR(ROUND(AVERAGE(E45:N45),2)),\"\",ROUND(AVERAGE(E45:N45),2))","v":""},{"$f":"IF(ISERROR(ROUND(O45*D45,2)),\"\",ROUND(O45*D45,2))","v":""},null,null,{"$f":"IF(ISERROR(MEDIAN(E45:N45)),\"\",MEDIAN(E45:N45))","v":""},{"$f":"IF(ISERROR(STDEV(E45:N45)),\"\",STDEV(E45:N45))","v":""},{"$f":"IF(ISERROR(T45/O45),\"\",T45/O45)","v":""}]
[{"$f":"IF(preencher!#ref!=\"\",\"\",preencher!#ref!)","v":{"$error":"#NAME?"}},{"$f":"IF(preencher!#ref!=\"\",\"\",preencher!#ref!)","v":{"$error":"#NAME?"}},{"$f":"IF(preencher!#ref!=\"\",\"\",preencher!#ref!)","v":{"$error":"#NAME?"}},{"$f":"IF(preencher!#ref!=\"\",\"\",preencher!#ref!)","v":{"$error":"#NAME?"}},{"$f":"IF(preencher!#ref!=\"\",\"\",IF(COUNTIF(preencher!#ref!,preencher!#ref!)=0,CONCATENATE(preencher!#ref!,#REF!),preencher!#ref!))","v":{"$error":"#NAME?"}},{"$f":"IF(preencher!#ref!=\"\",\"\",IF(COUNTIF(preencher!#ref!,preencher!#ref!)=0,CONCATENATE(preencher!#ref!,#REF!),preencher!#ref!))","v":{"$error":"#NAME?"}},{"$f":"IF(preencher!#ref!=\"\",\"\",IF(COUNTIF(preencher!#ref!,preencher!#ref!)=0,CONCATENATE(preencher!#ref!,#REF!),preencher!#ref!))","v":{"$error":"#NAME?"}},{"$f":"IF(preencher!#ref!=\"\",\"\",IF(COUNTIF(preencher!#ref!,preencher!#ref!)=0,CONCATENATE(preencher!#ref!,#REF!),preencher!#ref!))","v":{"$error":"#NAME?"}},{"$f":"IF(preencher!#ref!=\"\",\"\",IF(COUNTIF(preencher!#ref!,preencher!#ref!)=0,CONCATENATE(preencher!#ref!,#REF!),preencher!#ref!))","v":{"$error":"#NAME?"}},{"$f":"IF(preencher!#ref!=\"\",\"\",IF(COUNTIF(preencher!#ref!,preencher!#ref!)=0,CONCATENATE(preencher!#ref!,#REF!),preencher!#ref!))","v":{"$error":"#NAME?"}},{"$f":"IF(preencher!#ref!=\"\",\"\",IF(COUNTIF(preencher!#ref!,preencher!#ref!)=0,CONCATENATE(preencher!#ref!,#REF!),preencher!#ref!))","v":{"$error":"#NAME?"}},{"$f":"IF(preencher!#ref!=\"\",\"\",IF(COUNTIF(preencher!#ref!,preencher!#ref!)=0,CONCATENATE(preencher!#ref!,#REF!),preencher!#ref!))","v":{"$error":"#NAME?"}},{"$f":"IF(preencher!#ref!=\"\",\"\",IF(COUNTIF(preencher!#ref!,preencher!#ref!)=0,CONCATENATE(preencher!#ref!,#REF!),preencher!#ref!))","v":{"$error":"#NAME?"}},{"$f":"IF(preencher!#ref!=\"\",\"\",IF(COUNTIF(preencher!#ref!,preencher!#ref!)=0,CONCATENATE(preencher!#ref!,#REF!),preencher!#ref!))","v":{"$error":"#NAME?"}},{"$f":"IF(ISERROR(ROUND(AVERAGE(E46:N46),2)),\"\",ROUND(AVERAGE(E46:N46),2))","v":""},{"$f":"IF(ISERROR(ROUND(O46*D46,2)),\"\",ROUND(O46*D46,2))","v":""},null,null,{"$f":"IF(ISERROR(MEDIAN(E46:N46)),\"\",MEDIAN(E46:N46))","v":""},{"$f":"IF(ISERROR(STDEV(E46:N46)),\"\",STDEV(E46:N46))","v":""},{"$f":"IF(ISERROR(T46/O46),\"\",T46/O46)","v":""}]
[{"$f":"IF(preencher!#ref!=\"\",\"\",preencher!#ref!)","v":{"$error":"#NAME?"}},{"$f":"IF(preencher!#ref!=\"\",\"\",preencher!#ref!)","v":{"$error":"#NAME?"}},{"$f":"IF(preencher!#ref!=\"\",\"\",preencher!#ref!)","v":{"$error":"#NAME?"}},{"$f":"IF(preencher!#ref!=\"\",\"\",preencher!#ref!)","v":{"$error":"#NAME?"}},{"$f":"IF(preencher!#ref!=\"\",\"\",IF(COUNTIF(preencher!#ref!,preencher!#ref!)=0,CONCATENATE(preencher!#ref!,#REF!),preencher!#ref!))","v":{"$error":"#NAME?"}},{"$f":"IF(preencher!#ref!=\"\",\"\",IF(COUNTIF(preencher!#ref!,preencher!#ref!)=0,CONCATENATE(preencher!#ref!,#REF!),preencher!#ref!))","v":{"$error":"#NAME?"}},{"$f":"IF(preencher!#ref!=\"\",\"\",IF(COUNTIF(preencher!#ref!,preencher!#ref!)=0,CONCATENATE(preencher!#ref!,#REF!),preencher!#ref!))","v":{"$error":"#NAME?"}},{"$f":"IF(preencher!#ref!=\"\",\"\",IF(COUNTIF(preencher!#ref!,preencher!#ref!)=0,CONCATENATE(preencher!#ref!,#REF!),preencher!#ref!))","v":{"$error":"#NAME?"}},{"$f":"IF(preencher!#ref!=\"\",\"\",IF(COUNTIF(preencher!#ref!,preencher!#ref!)=0,CONCATENATE(preencher!#ref!,#REF!),preencher!#ref!))","v":{"$error":"#NAME?"}},{"$f":"IF(preencher!#ref!=\"\",\"\",IF(COUNTIF(preencher!#ref!,preencher!#ref!)=0,CONCATENATE(preencher!#ref!,#REF!),preencher!#ref!))","v":{"$error":"#NAME?"}},{"$f":"IF(preencher!#ref!=\"\",\"\",IF(COUNTIF(preencher!#ref!,preencher!#ref!)=0,CONCATENATE(preencher!#ref!,#REF!),preencher!#ref!))","v":{"$error":"#NAME?"}},{"$f":"IF(preencher!#ref!=\"\",\"\",IF(COUNTIF(preencher!#ref!,preencher!#ref!)=0,CONCATENATE(preencher!#ref!,#REF!),preencher!#ref!))","v":{"$error":"#NAME?"}},{"$f":"IF(preencher!#ref!=\"\",\"\",IF(COUNTIF(preencher!#ref!,preencher!#ref!)=0,CONCATENATE(preencher!#ref!,#REF!),preencher!#ref!))","v":{"$error":"#NAME?"}},{"$f":"IF(preencher!#ref!=\"\",\"\",IF(COUNTIF(preencher!#ref!,preencher!#ref!)=0,CONCATENATE(preencher!#ref!,#REF!),preencher!#ref!))","v":{"$error":"#NAME?"}},{"$f":"IF(ISERROR(ROUND(AVERAGE(E47:N47),2)),\"\",ROUND(AVERAGE(E47:N47),2))","v":""},{"$f":"IF(ISERROR(ROUND(O47*D47,2)),\"\",ROUND(O47*D47,2))","v":""},null,null,{"$f":"IF(ISERROR(MEDIAN(E47:N47)),\"\",MEDIAN(E47:N47))","v":""},{"$f":"IF(ISERROR(STDEV(E47:N47)),\"\",STDEV(E47:N47))","v":""},{"$f":"IF(ISERROR(T47/O47),\"\",T47/O47)","v":""}]
[{"$f":"IF(preencher!#ref!=\"\",\"\",preencher!#ref!)","v":{"$error":"#NAME?"}},{"$f":"IF(preencher!#ref!=\"\",\"\",preencher!#ref!)","v":{"$error":"#NAME?"}},{"$f":"IF(preencher!#ref!=\"\",\"\",preencher!#ref!)","v":{"$error":"#NAME?"}},{"$f":"IF(preencher!#ref!=\"\",\"\",preencher!#ref!)","v":{"$error":"#NAME?"}},{"$f":"IF(preencher!#ref!=\"\",\"\",IF(COUNTIF(preencher!#ref!,preencher!#ref!)=0,CONCATENATE(preencher!#ref!,#REF!),preencher!#ref!))","v":{"$error":"#NAME?"}},{"$f":"IF(preencher!#ref!=\"\",\"\",IF(COUNTIF(preencher!#ref!,preencher!#ref!)=0,CONCATENATE(preencher!#ref!,#REF!),preencher!#ref!))","v":{"$error":"#NAME?"}},{"$f":"IF(preencher!#ref!=\"\",\"\",IF(COUNTIF(preencher!#ref!,preencher!#ref!)=0,CONCATENATE(preencher!#ref!,#REF!),preencher!#ref!))","v":{"$error":"#NAME?"}},{"$f":"IF(preencher!#ref!=\"\",\"\",IF(COUNTIF(preencher!#ref!,preencher!#ref!)=0,CONCATENATE(preencher!#ref!,#REF!),preencher!#ref!))","v":{"$error":"#NAME?"}},{"$f":"IF(preencher!#ref!=\"\",\"\",IF(COUNTIF(preencher!#ref!,preencher!#ref!)=0,CONCATENATE(preencher!#ref!,#REF!),preencher!#ref!))","v":{"$error":"#NAME?"}},{"$f":"IF(preencher!#ref!=\"\",\"\",IF(COUNTIF(preencher!#ref!,preencher!#ref!)=0,CONCATENATE(preencher!#ref!,#REF!),preencher!#ref!))","v":{"$error":"#NAME?"}},{"$f":"IF(preencher!#ref!=\"\",\"\",IF(COUNTIF(preencher!#ref!,preencher!#ref!)=0,CONCATENATE(preencher!#ref!,#REF!),preencher!#ref!))","v":{"$error":"#NAME?"}},{"$f":"IF(preencher!#ref!=\"\",\"\",IF(COUNTIF(preencher!#ref!,preencher!#ref!)=0,CONCATENATE(preencher!#ref!,#REF!),preencher!#ref!))","v":{"$error":"#NAME?"}},{"$f":"IF(preencher!#ref!=\"\",\"\",IF(COUNTIF(preencher!#ref!,preencher!#ref!)=0,CONCATENATE(preencher!#ref!,#REF!),preencher!#ref!))","v":{"$error":"#NAME?"}},{"$f":"IF(preencher!#ref!=\"\",\"\",IF(COUNTIF(preencher!#ref!,preencher!#ref!)=0,CONCATENATE(preencher!#ref!,#REF!),preencher!#ref!))","v":{"$error":"#NAME?"}},{"$f":"IF(ISERROR(ROUND(AVERAGE(E48:N48),2)),\"\",ROUND(AVERAGE(E48:N48),2))","v":""},{"$f":"IF(ISERROR(ROUND(O48*D48,2)),\"\",ROUND(O48*D48,2))","v":""},null,null,{"$f":"IF(ISERROR(MEDIAN(E48:N48)),\"\",MEDIAN(E48:N48))","v":""},{"$f":"IF(ISERROR(STDEV(E48:N48)),\"\",STDEV(E48:N48))","v":""},{"$f":"IF(ISERROR(T48/O48),\"\",T48/O48)","v":""}]
[{"$f":"IF(preencher!#ref!=\"\",\"\",preencher!#ref!)","v":{"$error":"#NAME?"}},{"$f":"IF(preencher!#ref!=\"\",\"\",preencher!#ref!)","v":{"$error":"#NAME?"}},{"$f":"IF(preencher!#ref!=\"\",\"\",preencher!#ref!)","v":{"$error":"#NAME?"}},{"$f":"IF(preencher!#ref!=\"\",\"\",preencher!#ref!)","v":{"$error":"#NAME?"}},{"$f":"IF(preencher!#ref!=\"\",\"\",IF(COUNTIF(preencher!#ref!,preencher!#ref!)=0,CONCATENATE(preencher!#ref!,#REF!),preencher!#ref!))","v":{"$error":"#NAME?"}},{"$f":"IF(preencher!#ref!=\"\",\"\",IF(COUNTIF(preencher!#ref!,preencher!#ref!)=0,CONCATENATE(preencher!#ref!,#REF!),preencher!#ref!))","v":{"$error":"#NAME?"}},{"$f":"IF(preencher!#ref!=\"\",\"\",IF(COUNTIF(preencher!#ref!,preencher!#ref!)=0,CONCATENATE(preencher!#ref!,#REF!),preencher!#ref!))","v":{"$error":"#NAME?"}},{"$f":"IF(preencher!#ref!=\"\",\"\",IF(COUNTIF(preencher!#ref!,preencher!#ref!)=0,CONCATENATE(preencher!#ref!,#REF!),preencher!#ref!))","v":{"$error":"#NAME?"}},{"$f":"IF(preencher!#ref!=\"\",\"\",IF(COUNTIF(preencher!#ref!,preencher!#ref!)=0,CONCATENATE(preencher!#ref!,#REF!),preencher!#ref!))","v":{"$error":"#NAME?"}},{"$f":"IF(preencher!#ref!=\"\",\"\",IF(COUNTIF(preencher!#ref!,preencher!#ref!)=0,CONCATENATE(preencher!#ref!,#REF!),preencher!#ref!))","v":{"$error":"#NAME?"}},{"$f":"IF(preencher!#ref!=\"\",\"\",IF(COUNTIF(preencher!#ref!,preencher!#ref!)=0,CONCATENATE(preencher!#ref!,#REF!),preencher!#ref!))","v":{"$error":"#NAME?"}},{"$f":"IF(preencher!#ref!=\"\",\"\",IF(COUNTIF(preencher!#ref!,preencher!#ref!)=0,CONCATENATE(preencher!#ref!,#REF!),preencher!#ref!))","v":{"$error":"#NAME?"}},{"$f":"IF(preencher!#ref!=\"\",\"\",IF(COUNTIF(preencher!#ref!,preencher!#ref!)=0,CONCATENATE(preencher!#ref!,#REF!),preencher!#ref!))","v":{"$error":"#NAME?"}},{"$f":"IF(preencher!#ref!=\"\",\"\",IF(COUNTIF(preencher!#ref!,preencher!#ref!)=0,CONCATENATE(preencher!#ref!,#REF!),preencher!#ref!))","v":{"$error":"#NAME?"}},{"$f":"IF(ISERROR(ROUND(AVERAGE(E49:N49),2)),\"\",ROUND(AVERAGE(E49:N49),2))","v":""},{"$f":"IF(ISERROR(ROUND(O49*D49,2)),\"\",ROUND(O49*D49,2))","v":""},null,null,{"$f":"IF(ISERROR(MEDIAN(E49:N49)),\"\",MEDIAN(E49:N49))","v":""},{"$f":"IF(ISERROR(STDEV(E49:N49)),\"\",STDEV(E49:N49))","v":""},{"$f":"IF(ISERROR(T49/O49),\"\",T49/O49)","v":""}]
[{"$f":"IF(preencher!#ref!=\"\",\"\",preencher!#ref!)","v":{"$error":"#NAME?"}},{"$f":"IF(preencher!#ref!=\"\",\"\",preencher!#ref!)","v":{"$error":"#NAME?"}},{"$f":"IF(preencher!#ref!=\"\",\"\",preencher!#ref!)","v":{"$error":"#NAME?"}},{"$f":"IF(preencher!#ref!=\"\",\"\",preencher!#ref!)","v":{"$error":"#NAME?"}},{"$f":"IF(preencher!#ref!=\"\",\"\",IF(COUNTIF(preencher!#ref!,preencher!#ref!)=0,CONCATENATE(preencher!#ref!,#REF!),preencher!#ref!))","v":{"$error":"#NAME?"}},{"$f":"IF(preencher!#ref!=\"\",\"\",IF(COUNTIF(preencher!#ref!,preencher!#ref!)=0,CONCATENATE(preencher!#ref!,#REF!),preencher!#ref!))","v":{"$error":"#NAME?"}},{"$f":"IF(preencher!#ref!=\"\",\"\",IF(COUNTIF(preencher!#ref!,preencher!#ref!)=0,CONCATENATE(preencher!#ref!,#REF!),preencher!#ref!))","v":{"$error":"#NAME?"}},{"$f":"IF(preencher!#ref!=\"\",\"\",IF(COUNTIF(preencher!#ref!,preencher!#ref!)=0,CONCATENATE(preencher!#ref!,#REF!),preencher!#ref!))","v":{"$error":"#NAME?"}},{"$f":"IF(preencher!#ref!=\"\",\"\",IF(COUNTIF(preencher!#ref!,preencher!#ref!)=0,CONCATENATE(preencher!#ref!,#REF!),preencher!#ref!))","v":{"$error":"#NAME?"}},{"$f":"IF(preencher!#ref!=\"\",\"\",IF(COUNTIF(preencher!#ref!,preencher!#ref!)=0,CONCATENATE(preencher!#ref!,#REF!),preencher!#ref!))","v":{"$error":"#NAME?"}},{"$f":"IF(preencher!#ref!=\"\",\"\",IF(COUNTIF(preencher!#ref!,preencher!#ref!)=0,CONCATENATE(preencher!#ref!,#REF!),preencher!#ref!))","v":{"$error":"#NAME?"}},{"$f":"IF(preencher!#ref!=\"\",\"\",IF(COUNTIF(preencher!#ref!,preencher!#ref!)=0,CONCATENATE(preencher!#ref!,#REF!),preencher!#ref!))","v":{"$error":"#NAME?"}},{"$f":"IF(preencher!#ref!=\"\",\"\",IF(COUNTIF(preencher!#ref!,preencher!#ref!)=0,CONCATENATE(preencher!#ref!,#REF!),preencher!#ref!))","v":{"$error":"#NAME?"}},{"$f":"IF(preencher!#ref!=\"\",\"\",IF(COUNTIF(preencher!#ref!,preencher!#ref!)=0,CONCATENATE(preencher!#ref!,#REF!),preencher!#ref!))","v":{"$error":"#NAME?"}},{"$f":"IF(ISERROR(ROUND(AVERAGE(E50:N50),2)),\"\",ROUND(AVERAGE(E50:N50),2))","v":""},{"$f":"IF(ISERROR(ROUND(O50*D50,2)),\"\",ROUND(O50*D50,2))","v":""},null,null,{"$f":"IF(ISERROR(MEDIAN(E50:N50)),\"\",MEDIAN(E50:N50))","v":""},{"$f":"IF(ISERROR(STDEV(E50:N50)),\"\",STDEV(E50:N50))","v":""},{"$f":"IF(ISERROR(T50/O50),\"\",T50/O50)","v":""}]
[{"$f":"IF(preencher!#ref!=\"\",\"\",preencher!#ref!)","v":{"$error":"#NAME?"}},{"$f":"IF(preencher!#ref!=\"\",\"\",preencher!#ref!)","v":{"$error":"#NAME?"}},{"$f":"IF(preencher!#ref!=\"\",\"\",preencher!#ref!)","v":{"$error":"#NAME?"}},{"$f":"IF(preencher!#ref!=\"\",\"\",preencher!#ref!)","v":{"$error":"#NAME?"}},{"$f":"IF(preencher!#ref!=\"\",\"\",IF(COUNTIF(preencher!#ref!,preencher!#ref!)=0,CONCATENATE(preencher!#ref!,#REF!),preencher!#ref!))","v":{"$error":"#NAME?"}},{"$f":"IF(preencher!#ref!=\"\",\"\",IF(COUNTIF(preencher!#ref!,preencher!#ref!)=0,CONCATENATE(preencher!#ref!,#REF!),preencher!#ref!))","v":{"$error":"#NAME?"}},{"$f":"IF(preencher!#ref!=\"\",\"\",IF(COUNTIF(preencher!#ref!,preencher!#ref!)=0,CONCATENATE(preencher!#ref!,#REF!),preencher!#ref!))","v":{"$error":"#NAME?"}},{"$f":"IF(preencher!#ref!=\"\",\"\",IF(COUNTIF(preencher!#ref!,preencher!#ref!)=0,CONCATENATE(preencher!#ref!,#REF!),preencher!#ref!))","v":{"$error":"#NAME?"}},{"$f":"IF(preencher!#ref!=\"\",\"\",IF(COUNTIF(preencher!#ref!,preencher!#ref!)=0,CONCATENATE(preencher!#ref!,#REF!),preencher!#ref!))","v":{"$error":"#NAME?"}},{"$f":"IF(preencher!#ref!=\"\",\"\",IF(COUNTIF(preencher!#ref!,preencher!#ref!)=0,CONCATENATE(preencher!#ref!,#REF!),preencher!#ref!))","v":{"$error":"#NAME?"}},{"$f":"IF(preencher!#ref!=\"\",\"\",IF(COUNTIF(preencher!#ref!,preencher!#ref!)=0,CONCATENATE(preencher!#ref!,#REF!),preencher!#ref!))","v":{"$error":"#NAME?"}},{"$f":"IF(preencher!#ref!=\"\",\"\",IF(COUNTIF(preencher!#ref!,preencher!#ref!)=0,CONCATENATE(preencher!#ref!,#REF!),preencher!#ref!))","v":{"$error":"#NAME?"}},{"$f":"IF(preencher!#ref!=\"\",\"\",IF(COUNTIF(preencher!#ref!,preencher!#ref!)=0,CONCATENATE(preencher!#ref!,#REF!),preencher!#ref!))","v":{"$error":"#NAME?"}},{"$f":"IF(preencher!#ref!=\"\",\"\",IF(COUNTIF(preencher!#ref!,preencher!#ref!)=0,CONCATENATE(preencher!#ref!,#REF!),preencher!#ref!))","v":{"$error":"#NAME?"}},{"$f":"IF(ISERROR(ROUND(AVERAGE(E51:N51),2)),\"\",ROUND(AVERAGE(E51:N51),2))","v":""},{"$f":"IF(ISERROR(ROUND(O51*D51,2)),\"\",ROUND(O51*D51,2))","v":""},null,null,{"$f":"IF(ISERROR(MEDIAN(E51:N51)),\"\",MEDIAN(E51:N51))","v":""},{"$f":"IF(ISERROR(STDEV(E51:N51)),\"\",STDEV(E51:N51))","v":""},{"$f":"IF(ISERROR(T51/O51),\"\",T51/O51)","v":""}]
[{"$f":"IF(preencher!#ref!=\"\",\"\",preencher!#ref!)","v":{"$error":"#NAME?"}},{"$f":"IF(preencher!#ref!=\"\",\"\",preencher!#ref!)","v":{"$error":"#NAME?"}},{"$f":"IF(preencher!#ref!=\"\",\"\",preencher!#ref!)","v":{"$error":"#NAME?"}},{"$f":"IF(preencher!#ref!=\"\",\"\",preencher!#ref!)","v":{"$error":"#NAME?"}},{"$f":"IF(preencher!#ref!=\"\",\"\",IF(COUNTIF(preencher!#ref!,preencher!#ref!)=0,CONCATENATE(preencher!#ref!,#REF!),preencher!#ref!))","v":{"$error":"#NAME?"}},{"$f":"IF(preencher!#ref!=\"\",\"\",IF(COUNTIF(preencher!#ref!,preencher!#ref!)=0,CONCATENATE(preencher!#ref!,#REF!),preencher!#ref!))","v":{"$error":"#NAME?"}},{"$f":"IF(preencher!#ref!=\"\",\"\",IF(COUNTIF(preencher!#ref!,preencher!#ref!)=0,CONCATENATE(preencher!#ref!,#REF!),preencher!#ref!))","v":{"$error":"#NAME?"}},{"$f":"IF(preencher!#ref!=\"\",\"\",IF(COUNTIF(preencher!#ref!,preencher!#ref!)=0,CONCATENATE(preencher!#ref!,#REF!),preencher!#ref!))","v":{"$error":"#NAME?"}},{"$f":"IF(preencher!#ref!=\"\",\"\",IF(COUNTIF(preencher!#ref!,preencher!#ref!)=0,CONCATENATE(preencher!#ref!,#REF!),preencher!#ref!))","v":{"$error":"#NAME?"}},{"$f":"IF(preencher!#ref!=\"\",\"\",IF(COUNTIF(preencher!#ref!,preencher!#ref!)=0,CONCATENATE(preencher!#ref!,#REF!),preencher!#ref!))","v":{"$error":"#NAME?"}},{"$f":"IF(preencher!#ref!=\"\",\"\",IF(COUNTIF(preencher!#ref!,preencher!#ref!)=0,CONCATENATE(preencher!#ref!,#REF!),preencher!#ref!))","v":{"$error":"#NAME?"}},{"$f":"IF(preencher!#ref!=\"\",\"\",IF(COUNTIF(preencher!#ref!,preencher!#ref!)=0,CONCATENATE(preencher!#ref!,#REF!),preencher!#ref!))","v":{"$error":"#NAME?"}},{"$f":"IF(preencher!#ref!=\"\",\"\",IF(COUNTIF(preencher!#ref!,preencher!#ref!)=0,CONCATENATE(preencher!#ref!,#REF!),preencher!#ref!))","v":{"$error":"#NAME?"}},{"$f":"IF(preencher!#ref!=\"\",\"\",IF(COUNTIF(preencher!#ref!,preencher!#ref!)=0,CONCATENATE(preencher!#ref!,#REF!),preencher!#ref!))","v":{"$error":"#NAME?"}},{"$f":"IF(ISERROR(ROUND(AVERAGE(E52:N52),2)),\"\",ROUND(AVERAGE(E52:N52),2))","v":""},{"$f":"IF(ISERROR(ROUND(O52*D52,2)),\"\",ROUND(O52*D52,2))","v":""},null,null,{"$f":"IF(ISERROR(MEDIAN(E52:N52)),\"\",MEDIAN(E52:N52))","v":""},{"$f":"IF(ISERROR(STDEV(E52:N52)),\"\",STDEV(E52:N52))","v":""},{"$f":"IF(ISERROR(T52/O52),\"\",T52/O52)","v":""}]
[{"$f":"IF(preencher!#ref!=\"\",\"\",preencher!#ref!)","v":{"$error":"#NAME?"}},{"$f":"IF(preencher!#ref!=\"\",\"\",preencher!#ref!)","v":{"$error":"#NAME?"}},{"$f":"IF(preencher!#ref!=\"\",\"\",preencher!#ref!)","v":{"$error":"#NAME?"}},{"$f":"IF(preencher!#ref!=\"\",\"\",preencher!#ref!)","v":{"$error":"#NAME?"}},{"$f":"IF(preencher!#ref!=\"\",\"\",IF(COUNTIF(preencher!#ref!,preencher!#ref!)=0,CONCATENATE(preencher!#ref!,#REF!),preencher!#ref!))","v":{"$error":"#NAME?"}},{"$f":"IF(preencher!#ref!=\"\",\"\",IF(COUNTIF(preencher!#ref!,preencher!#ref!)=0,CONCATENATE(preencher!#ref!,#REF!),preencher!#ref!))","v":{"$error":"#NAME?"}},{"$f":"IF(preencher!#ref!=\"\",\"\",IF(COUNTIF(preencher!#ref!,preencher!#ref!)=0,CONCATENATE(preencher!#ref!,#REF!),preencher!#ref!))","v":{"$error":"#NAME?"}},{"$f":"IF(preencher!#ref!=\"\",\"\",IF(COUNTIF(preencher!#ref!,preencher!#ref!)=0,CONCATENATE(preencher!#ref!,#REF!),preencher!#ref!))","v":{"$error":"#NAME?"}},{"$f":"IF(preencher!#ref!=\"\",\"\",IF(COUNTIF(preencher!#ref!,preencher!#ref!)=0,CONCATENATE(preencher!#ref!,#REF!),preencher!#ref!))","v":{"$error":"#NAME?"}},{"$f":"IF(preencher!#ref!=\"\",\"\",IF(COUNTIF(preencher!#ref!,preencher!#ref!)=0,CONCATENATE(preencher!#ref!,#REF!),preencher!#ref!))","v":{"$error":"#NAME?"}},{"$f":"IF(preencher!#ref!=\"\",\"\",IF(COUNTIF(preencher!#ref!,preencher!#ref!)=0,CONCATENATE(preencher!#ref!,#REF!),preencher!#ref!))","v":{"$error":"#NAME?"}},{"$f":"IF(preencher!#ref!=\"\",\"\",IF(COUNTIF(preencher!#ref!,preencher!#ref!)=0,CONCATENATE(preencher!#ref!,#REF!),preencher!#ref!))","v":{"$error":"#NAME?"}},{"$f":"IF(preencher!#ref!=\"\",\"\",IF(COUNTIF(preencher!#ref!,preencher!#ref!)=0,CONCATENATE(preencher!#ref!,#REF!),preencher!#ref!))","v":{"$error":"#NAME?"}},{"$f":"IF(preencher!#ref!=\"\",\"\",IF(COUNTIF(preencher!#ref!,preencher!#ref!)=0,CONCATENATE(preencher!#ref!,#REF!),preencher!#ref!))","v":{"$error":"#NAME?"}},{"$f":"IF(ISERROR(ROUND(AVERAGE(E53:N53),2)),\"\",ROUND(AVERAGE(E53:N53),2))","v":""},{"$f":"IF(ISERROR(ROUND(O53*D53,2)),\"\",ROUND(O53*D53,2))","v":""},null,null,{"$f":"IF(ISERROR(MEDIAN(E53:N53)),\"\",MEDIAN(E53:N53))","v":""},{"$f":"IF(ISERROR(STDEV(E53:N53)),\"\",STDEV(E53:N53))","v":""},{"$f":"IF(ISERROR(T53/O53),\"\",T53/O53)","v":""}]
[{"$f":"IF(preencher!#ref!=\"\",\"\",preencher!#ref!)","v":{"$error":"#NAME?"}},{"$f":"IF(preencher!#ref!=\"\",\"\",preencher!#ref!)","v":{"$error":"#NAME?"}},{"$f":"IF(preencher!#ref!=\"\",\"\",preencher!#ref!)","v":{"$error":"#NAME?"}},{"$f":"IF(preencher!#ref!=\"\",\"\",preencher!#ref!)","v":{"$error":"#NAME?"}},{"$f":"IF(preencher!#ref!=\"\",\"\",IF(COUNTIF(preencher!#ref!,preencher!#ref!)=0,CONCATENATE(preencher!#ref!,#REF!),preencher!#ref!))","v":{"$error":"#NAME?"}},{"$f":"IF(preencher!#ref!=\"\",\"\",IF(COUNTIF(preencher!#ref!,preencher!#ref!)=0,CONCATENATE(preencher!#ref!,#REF!),preencher!#ref!))","v":{"$error":"#NAME?"}},{"$f":"IF(preencher!#ref!=\"\",\"\",IF(COUNTIF(preencher!#ref!,preencher!#ref!)=0,CONCATENATE(preencher!#ref!,#REF!),preencher!#ref!))","v":{"$error":"#NAME?"}},{"$f":"IF(preencher!#ref!=\"\",\"\",IF(COUNTIF(preencher!#ref!,preencher!#ref!)=0,CONCATENATE(preencher!#ref!,#REF!),preencher!#ref!))","v":{"$error":"#NAME?"}},{"$f":"IF(preencher!#ref!=\"\",\"\",IF(COUNTIF(preencher!#ref!,preencher!#ref!)=0,CONCATENATE(preencher!#ref!,#REF!),preencher!#ref!))","v":{"$error":"#NAME?"}},{"$f":"IF(preencher!#ref!=\"\",\"\",IF(COUNTIF(preencher!#ref!,preencher!#ref!)=0,CONCATENATE(preencher!#ref!,#REF!),preencher!#ref!))","v":{"$error":"#NAME?"}},{"$f":"IF(preencher!#ref!=\"\",\"\",IF(COUNTIF(preencher!#ref!,preencher!#ref!)=0,CONCATENATE(preencher!#ref!,#REF!),preencher!#ref!))","v":{"$error":"#NAME?"}},{"$f":"IF(preencher!#ref!=\"\",\"\",IF(COUNTIF(preencher!#ref!,preencher!#ref!)=0,CONCATENATE(preencher!#ref!,#REF!),preencher!#ref!))","v":{"$error":"#NAME?"}},{"$f":"IF(preencher!#ref!=\"\",\"\",IF(COUNTIF(preencher!#ref!,preencher!#ref!)=0,CONCATENATE(preencher!#ref!,#REF!),preencher!#ref!))","v":{"$error":"#NAME?"}},{"$f":"IF(preencher!#ref!=\"\",\"\",IF(COUNTIF(preencher!#ref!,preencher!#ref!)=0,CONCATENATE(preencher!#ref!,#REF!),preencher!#ref!))","v":{"$error":"#NAME?"}},{"$f":"IF(ISERROR(ROUND(AVERAGE(E54:N54),2)),\"\",ROUND(AVERAGE(E54:N54),2))","v":""},{"$f":"IF(ISERROR(ROUND(O54*D54,2)),\"\",ROUND(O54*D54,2))","v":""},null,null,{"$f":"IF(ISERROR(MEDIAN(E54:N54)),\"\",MEDIAN(E54:N54))","v":""},{"$f":"IF(ISERROR(STDEV(E54:N54)),\"\",STDEV(E54:N54))","v":""},{"$f":"IF(ISERROR(T54/O54),\"\",T54/O54)","v":""}]
[{"$f":"IF(preencher!#ref!=\"\",\"\",preencher!#ref!)","v":{"$error":"#NAME?"}},{"$f":"IF(preencher!#ref!=\"\",\"\",preencher!#ref!)","v":{"$error":"#NAME?"}},{"$f":"IF(preencher!#ref!=\"\",\"\",preencher!#ref!)","v":{"$error":"#NAME?"}},{"$f":"IF(preencher!#ref!=\"\",\"\",preencher!#ref!)","v":{"$error":"#NAME?"}},{"$f":"IF(preencher!#ref!=\"\",\"\",IF(COUNTIF(preencher!#ref!,preencher!#ref!)=0,CONCATENATE(preencher!#ref!,#REF!),preencher!#ref!))","v":{"$error":"#NAME?"}},{"$f":"IF(preencher!#ref!=\"\",\"\",IF(COUNTIF(preencher!#ref!,preencher!#ref!)=0,CONCATENATE(preencher!#ref!,#REF!),preencher!#ref!))","v":{"$error":"#NAME?"}},{"$f":"IF(preencher!#ref!=\"\",\"\",IF(COUNTIF(preencher!#ref!,preencher!#ref!)=0,CONCATENATE(preencher!#ref!,#REF!),preencher!#ref!))","v":{"$error":"#NAME?"}},{"$f":"IF(preencher!#ref!=\"\",\"\",IF(COUNTIF(preencher!#ref!,preencher!#ref!)=0,CONCATENATE(preencher!#ref!,#REF!),preencher!#ref!))","v":{"$error":"#NAME?"}},{"$f":"IF(preencher!#ref!=\"\",\"\",IF(COUNTIF(preencher!#ref!,preencher!#ref!)=0,CONCATENATE(preencher!#ref!,#REF!),preencher!#ref!))","v":{"$error":"#NAME?"}},{"$f":"IF(preencher!#ref!=\"\",\"\",IF(COUNTIF(preencher!#ref!,preencher!#ref!)=0,CONCATENATE(preencher!#ref!,#REF!),preencher!#ref!))","v":{"$error":"#NAME?"}},{"$f":"IF(preencher!#ref!=\"\",\"\",IF(COUNTIF(preencher!#ref!,preencher!#ref!)=0,CONCATENATE(preencher!#ref!,#REF!),preencher!#ref!))","v":{"$error":"#NAME?"}},{"$f":"IF(preencher!#ref!=\"\",\"\",IF(COUNTIF(preencher!#ref!,preencher!#ref!)=0,CONCATENATE(preencher!#ref!,#REF!),preencher!#ref!))","v":{"$error":"#NAME?"}},{"$f":"IF(preencher!#ref!=\"\",\"\",IF(COUNTIF(preencher!#ref!,preencher!#ref!)=0,CONCATENATE(preencher!#ref!,#REF!),preencher!#ref!))","v":{"$error":"#NAME?"}},{"$f":"IF(preencher!#ref!=\"\",\"\",IF(COUNTIF(preencher!#ref!,preencher!#ref!)=0,CONCATENATE(preencher!#ref!,#REF!),preencher!#ref!))","v":{"$error":"#NAME?"}},{"$f":"IF(ISERROR(ROUND(AVERAGE(E55:N55),2)),\"\",ROUND(AVERAGE(E55:N55),2))","v":""},{"$f":"IF(ISERROR(ROUND(O55*D55,2)),\"\",ROUND(O55*D55,2))","v":""},null,null,{"$f":"IF(ISERROR(MEDIAN(E55:N55)),\"\",MEDIAN(E55:N55))","v":""},{"$f":"IF(ISERROR(STDEV(E55:N55)),\"\",STDEV(E55:N55))","v":""},{"$f":"IF(ISERROR(T55/O55),\"\",T55/O55)","v":""}]
[{"$f":"IF(preencher!#ref!=\"\",\"\",preencher!#ref!)","v":{"$error":"#NAME?"}},{"$f":"IF(preencher!#ref!=\"\",\"\",preencher!#ref!)","v":{"$error":"#NAME?"}},{"$f":"IF(preencher!#ref!=\"\",\"\",preencher!#ref!)","v":{"$error":"#NAME?"}},{"$f":"IF(preencher!#ref!=\"\",\"\",preencher!#ref!)","v":{"$error":"#NAME?"}},{"$f":"IF(preencher!#ref!=\"\",\"\",IF(COUNTIF(preencher!#ref!,preencher!#ref!)=0,CONCATENATE(preencher!#ref!,#REF!),preencher!#ref!))","v":{"$error":"#NAME?"}},{"$f":"IF(preencher!#ref!=\"\",\"\",IF(COUNTIF(preencher!#ref!,preencher!#ref!)=0,CONCATENATE(preencher!#ref!,#REF!),preencher!#ref!))","v":{"$error":"#NAME?"}},{"$f":"IF(preencher!#ref!=\"\",\"\",IF(COUNTIF(preencher!#ref!,preencher!#ref!)=0,CONCATENATE(preencher!#ref!,#REF!),preencher!#ref!))","v":{"$error":"#NAME?"}},{"$f":"IF(preencher!#ref!=\"\",\"\",IF(COUNTIF(preencher!#ref!,preencher!#ref!)=0,CONCATENATE(preencher!#ref!,#REF!),preencher!#ref!))","v":{"$error":"#NAME?"}},{"$f":"IF(preencher!#ref!=\"\",\"\",IF(COUNTIF(preencher!#ref!,preencher!#ref!)=0,CONCATENATE(preencher!#ref!,#REF!),preencher!#ref!))","v":{"$error":"#NAME?"}},{"$f":"IF(preencher!#ref!=\"\",\"\",IF(COUNTIF(preencher!#ref!,preencher!#ref!)=0,CONCATENATE(preencher!#ref!,#REF!),preencher!#ref!))","v":{"$error":"#NAME?"}},{"$f":"IF(preencher!#ref!=\"\",\"\",IF(COUNTIF(preencher!#ref!,preencher!#ref!)=0,CONCATENATE(preencher!#ref!,#REF!),preencher!#ref!))","v":{"$error":"#NAME?"}},{"$f":"IF(preencher!#ref!=\"\",\"\",IF(COUNTIF(preencher!#ref!,preencher!#ref!)=0,CONCATENATE(preencher!#ref!,#REF!),preencher!#ref!))","v":{"$error":"#NAME?"}},{"$f":"IF(preencher!#ref!=\"\",\"\",IF(COUNTIF(preencher!#ref!,preencher!#ref!)=0,CONCATENATE(preencher!#ref!,#REF!),preencher!#ref!))","v":{"$error":"#NAME?"}},{"$f":"IF(preencher!#ref!=\"\",\"\",IF(COUNTIF(preencher!#ref!,preencher!#ref!)=0,CONCATENATE(preencher!#ref!,#REF!),preencher!#ref!))","v":{"$error":"#NAME?"}},{"$f":"IF(ISERROR(ROUND(AVERAGE(E56:N56),2)),\"\",ROUND(AVERAGE(E56:N56),2))","v":""},{"$f":"IF(ISERROR(ROUND(O56*D56,2)),\"\",ROUND(O56*D56,2))","v":""},null,null,{"$f":"IF(ISERROR(MEDIAN(E56:N56)),\"\",MEDIAN(E56:N56))","v":""},{"$f":"IF(ISERROR(STDEV(E56:N56)),\"\",STDEV(E56:N56))","v":""},{"$f":"IF(ISERROR(T56/O56),\"\",T56/O56)","v":""}]
[{"$f":"IF(preencher!#ref!=\"\",\"\",preencher!#ref!)","v":{"$error":"#NAME?"}},{"$f":"IF(preencher!#ref!=\"\",\"\",preencher!#ref!)","v":{"$error":"#NAME?"}},{"$f":"IF(preencher!#ref!=\"\",\"\",preencher!#ref!)","v":{"$error":"#NAME?"}},{"$f":"IF(preencher!#ref!=\"\",\"\",preencher!#ref!)","v":{"$error":"#NAME?"}},{"$f":"IF(preencher!#ref!=\"\",\"\",IF(COUNTIF(preencher!#ref!,preencher!#ref!)=0,CONCATENATE(preencher!#ref!,#REF!),preencher!#ref!))","v":{"$error":"#NAME?"}},{"$f":"IF(preencher!#ref!=\"\",\"\",IF(COUNTIF(preencher!#ref!,preencher!#ref!)=0,CONCATENATE(preencher!#ref!,#REF!),preencher!#ref!))","v":{"$error":"#NAME?"}},{"$f":"IF(preencher!#ref!=\"\",\"\",IF(COUNTIF(preencher!#ref!,preencher!#ref!)=0,CONCATENATE(preencher!#ref!,#REF!),preencher!#ref!))","v":{"$error":"#NAME?"}},{"$f":"IF(preencher!#ref!=\"\",\"\",IF(COUNTIF(preencher!#ref!,preencher!#ref!)=0,CONCATENATE(preencher!#ref!,#REF!),preencher!#ref!))","v":{"$error":"#NAME?"}},{"$f":"IF(preencher!#ref!=\"\",\"\",IF(COUNTIF(preencher!#ref!,preencher!#ref!)=0,CONCATENATE(preencher!#ref!,#REF!),preencher!#ref!))","v":{"$error":"#NAME?"}},{"$f":"IF(preencher!#ref!=\"\",\"\",IF(COUNTIF(preencher!#ref!,preencher!#ref!)=0,CONCATENATE(preencher!#ref!,#REF!),preencher!#ref!))","v":{"$error":"#NAME?"}},{"$f":"IF(preencher!#ref!=\"\",\"\",IF(COUNTIF(preencher!#ref!,preencher!#ref!)=0,CONCATENATE(preencher!#ref!,#REF!),preencher!#ref!))","v":{"$error":"#NAME?"}},{"$f":"IF(preencher!#ref!=\"\",\"\",IF(COUNTIF(preencher!#ref!,preencher!#ref!)=0,CONCATENATE(preencher!#ref!,#REF!),preencher!#ref!))","v":{"$error":"#NAME?"}},{"$f":"IF(preencher!#ref!=\"\",\"\",IF(COUNTIF(preencher!#ref!,preencher!#ref!)=0,CONCATENATE(preencher!#ref!,#REF!),preencher!#ref!))","v":{"$error":"#NAME?"}},{"$f":"IF(preencher!#ref!=\"\",\"\",IF(COUNTIF(preencher!#ref!,preencher!#ref!)=0,CONCATENATE(preencher!#ref!,#REF!),preencher!#ref!))","v":{"$error":"#NAME?"}},{"$f":"IF(ISERROR(ROUND(AVERAGE(E57:N57),2)),\"\",ROUND(AVERAGE(E57:N57),2))","v":""},{"$f":"IF(ISERROR(ROUND(O57*D57,2)),\"\",ROUND(O57*D57,2))","v":""},null,null,{"$f":"IF(ISERROR(MEDIAN(E57:N57)),\"\",MEDIAN(E57:N57))","v":""},{"$f":"IF(ISERROR(STDEV(E57:N57)),\"\",STDEV(E57:N57))","v":""},{"$f":"IF(ISERROR(T57/O57),\"\",T57/O57)","v":""}]
[{"$f":"IF(preencher!#ref!=\"\",\"\",preencher!#ref!)","v":{"$error":"#NAME?"}},{"$f":"IF(preencher!#ref!=\"\",\"\",preencher!#ref!)","v":{"$error":"#NAME?"}},{"$f":"IF(preencher!#ref!=\"\",\"\",preencher!#ref!)","v":{"$error":"#NAME?"}},{"$f":"IF(preencher!#ref!=\"\",\"\",preencher!#ref!)","v":{"$error":"#NAME?"}},{"$f":"IF(preencher!#ref!=\"\",\"\",IF(COUNTIF(preencher!#ref!,preencher!#ref!)=0,CONCATENATE(preencher!#ref!,#REF!),preencher!#ref!))","v":{"$error":"#NAME?"}},{"$f":"IF(preencher!#ref!=\"\",\"\",IF(COUNTIF(preencher!#ref!,preencher!#ref!)=0,CONCATENATE(preencher!#ref!,#REF!),preencher!#ref!))","v":{"$error":"#NAME?"}},{"$f":"IF(preencher!#ref!=\"\",\"\",IF(COUNTIF(preencher!#ref!,preencher!#ref!)=0,CONCATENATE(preencher!#ref!,#REF!),preencher!#ref!))","v":{"$error":"#NAME?"}},{"$f":"IF(preencher!#ref!=\"\",\"\",IF(COUNTIF(preencher!#ref!,preencher!#ref!)=0,CONCATENATE(preencher!#ref!,#REF!),preencher!#ref!))","v":{"$error":"#NAME?"}},{"$f":"IF(preencher!#ref!=\"\",\"\",IF(COUNTIF(preencher!#ref!,preencher!#ref!)=0,CONCATENATE(preencher!#ref!,#REF!),preencher!#ref!))","v":{"$error":"#NAME?"}},{"$f":"IF(preencher!#ref!=\"\",\"\",IF(COUNTIF(preencher!#ref!,preencher!#ref!)=0,CONCATENATE(preencher!#ref!,#REF!),preencher!#ref!))","v":{"$error":"#NAME?"}},{"$f":"IF(preencher!#ref!=\"\",\"\",IF(COUNTIF(preencher!#ref!,preencher!#ref!)=0,CONCATENATE(preencher!#ref!,#REF!),preencher!#ref!))","v":{"$error":"#NAME?"}},{"$f":"IF(preencher!#ref!=\"\",\"\",IF(COUNTIF(preencher!#ref!,preencher!#ref!)=0,CONCATENATE(preencher!#ref!,#REF!),preencher!#ref!))","v":{"$error":"#NAME?"}},{"$f":"IF(preencher!#ref!=\"\",\"\",IF(COUNTIF(preencher!#ref!,preencher!#ref!)=0,CONCATENATE(preencher!#ref!,#REF!),preencher!#ref!))","v":{"$error":"#NAME?"}},{"$f":"IF(preencher!#ref!=\"\",\"\",IF(COUNTIF(preencher!#ref!,preencher!#ref!)=0,CONCATENATE(preencher!#ref!,#REF!),preencher!#ref!))","v":{"$error":"#NAME?"}},{"$f":"IF(ISERROR(ROUND(AVERAGE(E58:N58),2)),\"\",ROUND(AVERAGE(E58:N58),2))","v":""},{"$f":"IF(ISERROR(ROUND(O58*D58,2)),\"\",ROUND(O58*D58,2))","v":""},null,null,{"$f":"IF(ISERROR(MEDIAN(E58:N58)),\"\",MEDIAN(E58:N58))","v":""},{"$f":"IF(ISERROR(STDEV(E58:N58)),\"\",STDEV(E58:N58))","v":""},{"$f":"IF(ISERROR(T58/O58),\"\",T58/O58)","v":""}]
[{"$f":"IF(preencher!#ref!=\"\",\"\",preencher!#ref!)","v":{"$error":"#NAME?"}},{"$f":"IF(preencher!#ref!=\"\",\"\",preencher!#ref!)","v":{"$error":"#NAME?"}},{"$f":"IF(preencher!#ref!=\"\",\"\",preencher!#ref!)","v":{"$error":"#NAME?"}},{"$f":"IF(preencher!#ref!=\"\",\"\",preencher!#ref!)","v":{"$error":"#NAME?"}},{"$f":"IF(preencher!#ref!=\"\",\"\",IF(COUNTIF(preencher!#ref!,preencher!#ref!)=0,CONCATENATE(preencher!#ref!,#REF!),preencher!#ref!))","v":{"$error":"#NAME?"}},{"$f":"IF(preencher!#ref!=\"\",\"\",IF(COUNTIF(preencher!#ref!,preencher!#ref!)=0,CONCATENATE(preencher!#ref!,#REF!),preencher!#ref!))","v":{"$error":"#NAME?"}},{"$f":"IF(preencher!#ref!=\"\",\"\",IF(COUNTIF(preencher!#ref!,preencher!#ref!)=0,CONCATENATE(preencher!#ref!,#REF!),preencher!#ref!))","v":{"$error":"#NAME?"}},{"$f":"IF(preencher!#ref!=\"\",\"\",IF(COUNTIF(preencher!#ref!,preencher!#ref!)=0,CONCATENATE(preencher!#ref!,#REF!),preencher!#ref!))","v":{"$error":"#NAME?"}},{"$f":"IF(preencher!#ref!=\"\",\"\",IF(COUNTIF(preencher!#ref!,preencher!#ref!)=0,CONCATENATE(preencher!#ref!,#REF!),preencher!#ref!))","v":{"$error":"#NAME?"}},{"$f":"IF(preencher!#ref!=\"\",\"\",IF(COUNTIF(preencher!#ref!,preencher!#ref!)=0,CONCATENATE(preencher!#ref!,#REF!),preencher!#ref!))","v":{"$error":"#NAME?"}},{"$f":"IF(preencher!#ref!=\"\",\"\",IF(COUNTIF(preencher!#ref!,preencher!#ref!)=0,CONCATENATE(preencher!#ref!,#REF!),preencher!#ref!))","v":{"$error":"#NAME?"}},{"$f":"IF(preencher!#ref!=\"\",\"\",IF(COUNTIF(preencher!#ref!,preencher!#ref!)=0,CONCATENATE(preencher!#ref!,#REF!),preencher!#ref!))","v":{"$error":"#NAME?"}},{"$f":"IF(preencher!#ref!=\"\",\"\",IF(COUNTIF(preencher!#ref!,preencher!#ref!)=0,CONCATENATE(preencher!#ref!,#REF!),preencher!#ref!))","v":{"$error":"#NAME?"}},{"$f":"IF(preencher!#ref!=\"\",\"\",IF(COUNTIF(preencher!#ref!,preencher!#ref!)=0,CONCATENATE(preencher!#ref!,#REF!),preencher!#ref!))","v":{"$error":"#NAME?"}},{"$f":"IF(ISERROR(ROUND(AVERAGE(E59:N59),2)),\"\",ROUND(AVERAGE(E59:N59),2))","v":""},{"$f":"IF(ISERROR(ROUND(O59*D59,2)),\"\",ROUND(O59*D59,2))","v":""},null,null,{"$f":"IF(ISERROR(MEDIAN(E59:N59)),\"\",MEDIAN(E59:N59))","v":""},{"$f":"IF(ISERROR(STDEV(E59:N59)),\"\",STDEV(E59:N59))","v":""},{"$f":"IF(ISERROR(T59/O59),\"\",T59/O59)","v":""}]
[{"$f":"IF(preencher!#ref!=\"\",\"\",preencher!#ref!)","v":{"$error":"#NAME?"}},{"$f":"IF(preencher!#ref!=\"\",\"\",preencher!#ref!)","v":{"$error":"#NAME?"}},{"$f":"IF(preencher!#ref!=\"\",\"\",preencher!#ref!)","v":{"$error":"#NAME?"}},{"$f":"IF(preencher!#ref!=\"\",\"\",preencher!#ref!)","v":{"$error":"#NAME?"}},{"$f":"IF(preencher!#ref!=\"\",\"\",IF(COUNTIF(preencher!#ref!,preencher!#ref!)=0,CONCATENATE(preencher!#ref!,#REF!),preencher!#ref!))","v":{"$error":"#NAME?"}},{"$f":"IF(preencher!#ref!=\"\",\"\",IF(COUNTIF(preencher!#ref!,preencher!#ref!)=0,CONCATENATE(preencher!#ref!,#REF!),preencher!#ref!))","v":{"$error":"#NAME?"}},{"$f":"IF(preencher!#ref!=\"\",\"\",IF(COUNTIF(preencher!#ref!,preencher!#ref!)=0,CONCATENATE(preencher!#ref!,#REF!),preencher!#ref!))","v":{"$error":"#NAME?"}},{"$f":"IF(preencher!#ref!=\"\",\"\",IF(COUNTIF(preencher!#ref!,preencher!#ref!)=0,CONCATENATE(preencher!#ref!,#REF!),preencher!#ref!))","v":{"$error":"#NAME?"}},{"$f":"IF(preencher!#ref!=\"\",\"\",IF(COUNTIF(preencher!#ref!,preencher!#ref!)=0,CONCATENATE(preencher!#ref!,#REF!),preencher!#ref!))","v":{"$error":"#NAME?"}},{"$f":"IF(preencher!#ref!=\"\",\"\",IF(COUNTIF(preencher!#ref!,preencher!#ref!)=0,CONCATENATE(preencher!#ref!,#REF!),preencher!#ref!))","v":{"$error":"#NAME?"}},{"$f":"IF(preencher!#ref!=\"\",\"\",IF(COUNTIF(preencher!#ref!,preencher!#ref!)=0,CONCATENATE(preencher!#ref!,#REF!),preencher!#ref!))","v":{"$error":"#NAME?"}},{"$f":"IF(preencher!#ref!=\"\",\"\",IF(COUNTIF(preencher!#ref!,preencher!#ref!)=0,CONCATENATE(preencher!#ref!,#REF!),preencher!#ref!))","v":{"$error":"#NAME?"}},{"$f":"IF(preencher!#ref!=\"\",\"\",IF(COUNTIF(preencher!#ref!,preencher!#ref!)=0,CONCATENATE(preencher!#ref!,#REF!),preencher!#ref!))","v":{"$error":"#NAME?"}},{"$f":"IF(preencher!#ref!=\"\",\"\",IF(COUNTIF(preencher!#ref!,preencher!#ref!)=0,CONCATENATE(preencher!#ref!,#REF!),preencher!#ref!))","v":{"$error":"#NAME?"}},{"$f":"IF(ISERROR(ROUND(AVERAGE(E60:N60),2)),\"\",ROUND(AVERAGE(E60:N60),2))","v":""},{"$f":"IF(ISERROR(ROUND(O60*D60,2)),\"\",ROUND(O60*D60,2))","v":""},null,null,{"$f":"IF(ISERROR(MEDIAN(E60:N60)),\"\",MEDIAN(E60:N60))","v":""},{"$f":"IF(ISERROR(STDEV(E60:N60)),\"\",STDEV(E60:N60))","v":""},{"$f":"IF(ISERROR(T60/O60),\"\",T60/O60)","v":""}]
[{"$f":"IF(preencher!#ref!=\"\",\"\",preencher!#ref!)","v":{"$error":"#NAME?"}},{"$f":"IF(preencher!#ref!=\"\",\"\",preencher!#ref!)","v":{"$error":"#NAME?"}},{"$f":"IF(preencher!#ref!=\"\",\"\",preencher!#ref!)","v":{"$error":"#NAME?"}},{"$f":"IF(preencher!#ref!=\"\",\"\",preencher!#ref!)","v":{"$error":"#NAME?"}},{"$f":"IF(preencher!#ref!=\"\",\"\",IF(COUNTIF(preencher!#ref!,preencher!#ref!)=0,CONCATENATE(preencher!#ref!,#REF!),preencher!#ref!))","v":{"$error":"#NAME?"}},{"$f":"IF(preencher!#ref!=\"\",\"\",IF(COUNTIF(preencher!#ref!,preencher!#ref!)=0,CONCATENATE(preencher!#ref!,#REF!),preencher!#ref!))","v":{"$error":"#NAME?"}},{"$f":"IF(preencher!#ref!=\"\",\"\",IF(COUNTIF(preencher!#ref!,preencher!#ref!)=0,CONCATENATE(preencher!#ref!,#REF!),preencher!#ref!))","v":{"$error":"#NAME?"}},{"$f":"IF(preencher!#ref!=\"\",\"\",IF(COUNTIF(preencher!#ref!,preencher!#ref!)=0,CONCATENATE(preencher!#ref!,#REF!),preencher!#ref!))","v":{"$error":"#NAME?"}},{"$f":"IF(preencher!#ref!=\"\",\"\",IF(COUNTIF(preencher!#ref!,preencher!#ref!)=0,CONCATENATE(preencher!#ref!,#REF!),preencher!#ref!))","v":{"$error":"#NAME?"}},{"$f":"IF(preencher!#ref!=\"\",\"\",IF(COUNTIF(preencher!#ref!,preencher!#ref!)=0,CONCATENATE(preencher!#ref!,#REF!),preencher!#ref!))","v":{"$error":"#NAME?"}},{"$f":"IF(preencher!#ref!=\"\",\"\",IF(COUNTIF(preencher!#ref!,preencher!#ref!)=0,CONCATENATE(preencher!#ref!,#REF!),preencher!#ref!))","v":{"$error":"#NAME?"}},{"$f":"IF(preencher!#ref!=\"\",\"\",IF(COUNTIF(preencher!#ref!,preencher!#ref!)=0,CONCATENATE(preencher!#ref!,#REF!),preencher!#ref!))","v":{"$error":"#NAME?"}},{"$f":"IF(preencher!#ref!=\"\",\"\",IF(COUNTIF(preencher!#ref!,preencher!#ref!)=0,CONCATENATE(preencher!#ref!,#REF!),preencher!#ref!))","v":{"$error":"#NAME?"}},{"$f":"IF(preencher!#ref!=\"\",\"\",IF(COUNTIF(preencher!#ref!,preencher!#ref!)=0,CONCATENATE(preencher!#ref!,#REF!),preencher!#ref!))","v":{"$error":"#NAME?"}},{"$f":"IF(ISERROR(ROUND(AVERAGE(E61:N61),2)),\"\",ROUND(AVERAGE(E61:N61),2))","v":""},{"$f":"IF(ISERROR(ROUND(O61*D61,2)),\"\",ROUND(O61*D61,2))","v":""},null,null,{"$f":"IF(ISERROR(MEDIAN(E61:N61)),\"\",MEDIAN(E61:N61))","v":""},{"$f":"IF(ISERROR(STDEV(E61:N61)),\"\",STDEV(E61:N61))","v":""},{"$f":"IF(ISERROR(T61/O61),\"\",T61/O61)","v":""}]
[{"$f":"IF(preencher!#ref!=\"\",\"\",preencher!#ref!)","v":{"$error":"#NAME?"}},{"$f":"IF(preencher!#ref!=\"\",\"\",preencher!#ref!)","v":{"$error":"#NAME?"}},{"$f":"IF(preencher!#ref!=\"\",\"\",preencher!#ref!)","v":{"$error":"#NAME?"}},{"$f":"IF(preencher!#ref!=\"\",\"\",preencher!#ref!)","v":{"$error":"#NAME?"}},{"$f":"IF(preencher!#ref!=\"\",\"\",IF(COUNTIF(preencher!#ref!,preencher!#ref!)=0,CONCATENATE(preencher!#ref!,#REF!),preencher!#ref!))","v":{"$error":"#NAME?"}},{"$f":"IF(preencher!#ref!=\"\",\"\",IF(COUNTIF(preencher!#ref!,preencher!#ref!)=0,CONCATENATE(preencher!#ref!,#REF!),preencher!#ref!))","v":{"$error":"#NAME?"}},{"$f":"IF(preencher!#ref!=\"\",\"\",IF(COUNTIF(preencher!#ref!,preencher!#ref!)=0,CONCATENATE(preencher!#ref!,#REF!),preencher!#ref!))","v":{"$error":"#NAME?"}},{"$f":"IF(preencher!#ref!=\"\",\"\",IF(COUNTIF(preencher!#ref!,preencher!#ref!)=0,CONCATENATE(preencher!#ref!,#REF!),preencher!#ref!))","v":{"$error":"#NAME?"}},{"$f":"IF(preencher!#ref!=\"\",\"\",IF(COUNTIF(preencher!#ref!,preencher!#ref!)=0,CONCATENATE(preencher!#ref!,#REF!),preencher!#ref!))","v":{"$error":"#NAME?"}},{"$f":"IF(preencher!#ref!=\"\",\"\",IF(COUNTIF(preencher!#ref!,preencher!#ref!)=0,CONCATENATE(preencher!#ref!,#REF!),preencher!#ref!))","v":{"$error":"#NAME?"}},{"$f":"IF(preencher!#ref!=\"\",\"\",IF(COUNTIF(preencher!#ref!,preencher!#ref!)=0,CONCATENATE(preencher!#ref!,#REF!),preencher!#ref!))","v":{"$error":"#NAME?"}},{"$f":"IF(preencher!#ref!=\"\",\"\",IF(COUNTIF(preencher!#ref!,preencher!#ref!)=0,CONCATENATE(preencher!#ref!,#REF!),preencher!#ref!))","v":{"$error":"#NAME?"}},{"$f":"IF(preencher!#ref!=\"\",\"\",IF(COUNTIF(preencher!#ref!,preencher!#ref!)=0,CONCATENATE(preencher!#ref!,#REF!),preencher!#ref!))","v":{"$error":"#NAME?"}},{"$f":"IF(preencher!#ref!=\"\",\"\",IF(COUNTIF(preencher!#ref!,preencher!#ref!)=0,CONCATENATE(preencher!#ref!,#REF!),preencher!#ref!))","v":{"$error":"#NAME?"}},{"$f":"IF(ISERROR(ROUND(AVERAGE(E62:N62),2)),\"\",ROUND(AVERAGE(E62:N62),2))","v":""},{"$f":"IF(ISERROR(ROUND(O62*D62,2)),\"\",ROUND(O62*D62,2))","v":""},null,null,{"$f":"IF(ISERROR(MEDIAN(E62:N62)),\"\",MEDIAN(E62:N62))","v":""},{"$f":"IF(ISERROR(STDEV(E62:N62)),\"\",STDEV(E62:N62))","v":""},{"$f":"IF(ISERROR(T62/O62),\"\",T62/O62)","v":""}]
[{"$f":"IF(preencher!#ref!=\"\",\"\",preencher!#ref!)","v":{"$error":"#NAME?"}},{"$f":"IF(preencher!#ref!=\"\",\"\",preencher!#ref!)","v":{"$error":"#NAME?"}},{"$f":"IF(preencher!#ref!=\"\",\"\",preencher!#ref!)","v":{"$error":"#NAME?"}},{"$f":"IF(preencher!#ref!=\"\",\"\",preencher!#ref!)","v":{"$error":"#NAME?"}},{"$f":"IF(preencher!#ref!=\"\",\"\",IF(COUNTIF(preencher!#ref!,preencher!#ref!)=0,CONCATENATE(preencher!#ref!,#REF!),preencher!#ref!))","v":{"$error":"#NAME?"}},{"$f":"IF(preencher!#ref!=\"\",\"\",IF(COUNTIF(preencher!#ref!,preencher!#ref!)=0,CONCATENATE(preencher!#ref!,#REF!),preencher!#ref!))","v":{"$error":"#NAME?"}},{"$f":"IF(preencher!#ref!=\"\",\"\",IF(COUNTIF(preencher!#ref!,preencher!#ref!)=0,CONCATENATE(preencher!#ref!,#REF!),preencher!#ref!))","v":{"$error":"#NAME?"}},{"$f":"IF(preencher!#ref!=\"\",\"\",IF(COUNTIF(preencher!#ref!,preencher!#ref!)=0,CONCATENATE(preencher!#ref!,#REF!),preencher!#ref!))","v":{"$error":"#NAME?"}},{"$f":"IF(preencher!#ref!=\"\",\"\",IF(COUNTIF(preencher!#ref!,preencher!#ref!)=0,CONCATENATE(preencher!#ref!,#REF!),preencher!#ref!))","v":{"$error":"#NAME?"}},{"$f":"IF(preencher!#ref!=\"\",\"\",IF(COUNTIF(preencher!#ref!,preencher!#ref!)=0,CONCATENATE(preencher!#ref!,#REF!),preencher!#ref!))","v":{"$error":"#NAME?"}},{"$f":"IF(preencher!#ref!=\"\",\"\",IF(COUNTIF(preencher!#ref!,preencher!#ref!)=0,CONCATENATE(preencher!#ref!,#REF!),preencher!#ref!))","v":{"$error":"#NAME?"}},{"$f":"IF(preencher!#ref!=\"\",\"\",IF(COUNTIF(preencher!#ref!,preencher!#ref!)=0,CONCATENATE(preencher!#ref!,#REF!),preencher!#ref!))","v":{"$error":"#NAME?"}},{"$f":"IF(preencher!#ref!=\"\",\"\",IF(COUNTIF(preencher!#ref!,preencher!#ref!)=0,CONCATENATE(preencher!#ref!,#REF!),preencher!#ref!))","v":{"$error":"#NAME?"}},{"$f":"IF(preencher!#ref!=\"\",\"\",IF(COUNTIF(preencher!#ref!,preencher!#ref!)=0,CONCATENATE(preencher!#ref!,#REF!),preencher!#ref!))","v":{"$error":"#NAME?"}},{"$f":"IF(ISERROR(ROUND(AVERAGE(E63:N63),2)),\"\",ROUND(AVERAGE(E63:N63),2))","v":""},{"$f":"IF(ISERROR(ROUND(O63*D63,2)),\"\",ROUND(O63*D63,2))","v":""},null,null,{"$f":"IF(ISERROR(MEDIAN(E63:N63)),\"\",MEDIAN(E63:N63))","v":""},{"$f":"IF(ISERROR(STDEV(E63:N63)),\"\",STDEV(E63:N63))","v":""},{"$f":"IF(ISERROR(T63/O63),\"\",T63/O63)","v":""}]
[{"$f":"IF(preencher!#ref!=\"\",\"\",preencher!#ref!)","v":{"$error":"#NAME?"}},{"$f":"IF(preencher!#ref!=\"\",\"\",preencher!#ref!)","v":{"$error":"#NAME?"}},{"$f":"IF(preencher!#ref!=\"\",\"\",preencher!#ref!)","v":{"$error":"#NAME?"}},{"$f":"IF(preencher!#ref!=\"\",\"\",preencher!#ref!)","v":{"$error":"#NAME?"}},{"$f":"IF(preencher!#ref!=\"\",\"\",IF(COUNTIF(preencher!#ref!,preencher!#ref!)=0,CONCATENATE(preencher!#ref!,#REF!),preencher!#ref!))","v":{"$error":"#NAME?"}},{"$f":"IF(preencher!#ref!=\"\",\"\",IF(COUNTIF(preencher!#ref!,preencher!#ref!)=0,CONCATENATE(preencher!#ref!,#REF!),preencher!#ref!))","v":{"$error":"#NAME?"}},{"$f":"IF(preencher!#ref!=\"\",\"\",IF(COUNTIF(preencher!#ref!,preencher!#ref!)=0,CONCATENATE(preencher!#ref!,#REF!),preencher!#ref!))","v":{"$error":"#NAME?"}},{"$f":"IF(preencher!#ref!=\"\",\"\",IF(COUNTIF(preencher!#ref!,preencher!#ref!)=0,CONCATENATE(preencher!#ref!,#REF!),preencher!#ref!))","v":{"$error":"#NAME?"}},{"$f":"IF(preencher!#ref!=\"\",\"\",IF(COUNTIF(preencher!#ref!,preencher!#ref!)=0,CONCATENATE(preencher!#ref!,#REF!),preencher!#ref!))","v":{"$error":"#NAME?"}},{"$f":"IF(preencher!#ref!=\"\",\"\",IF(COUNTIF(preencher!#ref!,preencher!#ref!)=0,CONCATENATE(preencher!#ref!,#REF!),preencher!#ref!))","v":{"$error":"#NAME?"}},{"$f":"IF(preencher!#ref!=\"\",\"\",IF(COUNTIF(preencher!#ref!,preencher!#ref!)=0,CONCATENATE(preencher!#ref!,#REF!),preencher!#ref!))","v":{"$error":"#NAME?"}},{"$f":"IF(preencher!#ref!=\"\",\"\",IF(COUNTIF(preencher!#ref!,preencher!#ref!)=0,CONCATENATE(preencher!#ref!,#REF!),preencher!#ref!))","v":{"$error":"#NAME?"}},{"$f":"IF(preencher!#ref!=\"\",\"\",IF(COUNTIF(preencher!#ref!,preencher!#ref!)=0,CONCATENATE(preencher!#ref!,#REF!),preencher!#ref!))","v":{"$error":"#NAME?"}},{"$f":"IF(preencher!#ref!=\"\",\"\",IF(COUNTIF(preencher!#ref!,preencher!#ref!)=0,CONCATENATE(preencher!#ref!,#REF!),preencher!#ref!))","v":{"$error":"#NAME?"}},{"$f":"IF(ISERROR(ROUND(AVERAGE(E64:N64),2)),\"\",ROUND(AVERAGE(E64:N64),2))","v":""},{"$f":"IF(ISERROR(ROUND(O64*D64,2)),\"\",ROUND(O64*D64,2))","v":""},null,null,{"$f":"IF(ISERROR(MEDIAN(E64:N64)),\"\",MEDIAN(E64:N64))","v":""},{"$f":"IF(ISERROR(STDEV(E64:N64)),\"\",STDEV(E64:N64))","v":""},{"$f":"IF(ISERROR(T64/O64),\"\",T64/O64)","v":""}]
[{"$f":"IF(preencher!#ref!=\"\",\"\",preencher!#ref!)","v":{"$error":"#NAME?"}},{"$f":"IF(preencher!#ref!=\"\",\"\",preencher!#ref!)","v":{"$error":"#NAME?"}},{"$f":"IF(preencher!#ref!=\"\",\"\",preencher!#ref!)","v":{"$error":"#NAME?"}},{"$f":"IF(preencher!#ref!=\"\",\"\",preencher!#ref!)","v":{"$error":"#NAME?"}},{"$f":"IF(preencher!#ref!=\"\",\"\",IF(COUNTIF(preencher!#ref!,preencher!#ref!)=0,CONCATENATE(preencher!#ref!,#REF!),preencher!#ref!))","v":{"$error":"#NAME?"}},{"$f":"IF(preencher!#ref!=\"\",\"\",IF(COUNTIF(preencher!#ref!,preencher!#ref!)=0,CONCATENATE(preencher!#ref!,#REF!),preencher!#ref!))","v":{"$error":"#NAME?"}},{"$f":"IF(preencher!#ref!=\"\",\"\",IF(COUNTIF(preencher!#ref!,preencher!#ref!)=0,CONCATENATE(preencher!#ref!,#REF!),preencher!#ref!))","v":{"$error":"#NAME?"}},{"$f":"IF(preencher!#ref!=\"\",\"\",IF(COUNTIF(preencher!#ref!,preencher!#ref!)=0,CONCATENATE(preencher!#ref!,#REF!),preencher!#ref!))","v":{"$error":"#NAME?"}},{"$f":"IF(preencher!#ref!=\"\",\"\",IF(COUNTIF(preencher!#ref!,preencher!#ref!)=0,CONCATENATE(preencher!#ref!,#REF!),preencher!#ref!))","v":{"$error":"#NAME?"}},{"$f":"IF(preencher!#ref!=\"\",\"\",IF(COUNTIF(preencher!#ref!,preencher!#ref!)=0,CONCATENATE(preencher!#ref!,#REF!),preencher!#ref!))","v":{"$error":"#NAME?"}},{"$f":"IF(preencher!#ref!=\"\",\"\",IF(COUNTIF(preencher!#ref!,preencher!#ref!)=0,CONCATENATE(preencher!#ref!,#REF!),preencher!#ref!))","v":{"$error":"#NAME?"}},{"$f":"IF(preencher!#ref!=\"\",\"\",IF(COUNTIF(preencher!#ref!,preencher!#ref!)=0,CONCATENATE(preencher!#ref!,#REF!),preencher!#ref!))","v":{"$error":"#NAME?"}},{"$f":"IF(preencher!#ref!=\"\",\"\",IF(COUNTIF(preencher!#ref!,preencher!#ref!)=0,CONCATENATE(preencher!#ref!,#REF!),preencher!#ref!))","v":{"$error":"#NAME?"}},{"$f":"IF(preencher!#ref!=\"\",\"\",IF(COUNTIF(preencher!#ref!,preencher!#ref!)=0,CONCATENATE(preencher!#ref!,#REF!),preencher!#ref!))","v":{"$error":"#NAME?"}},{"$f":"IF(ISERROR(ROUND(AVERAGE(E65:N65),2)),\"\",ROUND(AVERAGE(E65:N65),2))","v":""},{"$f":"IF(ISERROR(ROUND(O65*D65,2)),\"\",ROUND(O65*D65,2))","v":""},null,null,{"$f":"IF(ISERROR(MEDIAN(E65:N65)),\"\",MEDIAN(E65:N65))","v":""},{"$f":"IF(ISERROR(STDEV(E65:N65)),\"\",STDEV(E65:N65))","v":""},{"$f":"IF(ISERROR(T65/O65),\"\",T65/O65)","v":""}]
[{"$f":"IF(preencher!#ref!=\"\",\"\",preencher!#ref!)","v":{"$error":"#NAME?"}},{"$f":"IF(preencher!#ref!=\"\",\"\",preencher!#ref!)","v":{"$error":"#NAME?"}},{"$f":"IF(preencher!#ref!=\"\",\"\",preencher!#ref!)","v":{"$error":"#NAME?"}},{"$f":"IF(preencher!#ref!=\"\",\"\",preencher!#ref!)","v":{"$error":"#NAME?"}},{"$f":"IF(preencher!#ref!=\"\",\"\",IF(COUNTIF(preencher!#ref!,preencher!#ref!)=0,CONCATENATE(preencher!#ref!,#REF!),preencher!#ref!))","v":{"$error":"#NAME?"}},{"$f":"IF(preencher!#ref!=\"\",\"\",IF(COUNTIF(preencher!#ref!,preencher!#ref!)=0,CONCATENATE(preencher!#ref!,#REF!),preencher!#ref!))","v":{"$error":"#NAME?"}},{"$f":"IF(preencher!#ref!=\"\",\"\",IF(COUNTIF(preencher!#ref!,preencher!#ref!)=0,CONCATENATE(preencher!#ref!,#REF!),preencher!#ref!))","v":{"$error":"#NAME?"}},{"$f":"IF(preencher!#ref!=\"\",\"\",IF(COUNTIF(preencher!#ref!,preencher!#ref!)=0,CONCATENATE(preencher!#ref!,#REF!),preencher!#ref!))","v":{"$error":"#NAME?"}},{"$f":"IF(preencher!#ref!=\"\",\"\",IF(COUNTIF(preencher!#ref!,preencher!#ref!)=0,CONCATENATE(preencher!#ref!,#REF!),preencher!#ref!))","v":{"$error":"#NAME?"}},{"$f":"IF(preencher!#ref!=\"\",\"\",IF(COUNTIF(preencher!#ref!,preencher!#ref!)=0,CONCATENATE(preencher!#ref!,#REF!),preencher!#ref!))","v":{"$error":"#NAME?"}},{"$f":"IF(preencher!#ref!=\"\",\"\",IF(COUNTIF(preencher!#ref!,preencher!#ref!)=0,CONCATENATE(preencher!#ref!,#REF!),preencher!#ref!))","v":{"$error":"#NAME?"}},{"$f":"IF(preencher!#ref!=\"\",\"\",IF(COUNTIF(preencher!#ref!,preencher!#ref!)=0,CONCATENATE(preencher!#ref!,#REF!),preencher!#ref!))","v":{"$error":"#NAME?"}},{"$f":"IF(preencher!#ref!=\"\",\"\",IF(COUNTIF(preencher!#ref!,preencher!#ref!)=0,CONCATENATE(preencher!#ref!,#REF!),preencher!#ref!))","v":{"$error":"#NAME?"}},{"$f":"IF(preencher!#ref!=\"\",\"\",IF(COUNTIF(preencher!#ref!,preencher!#ref!)=0,CONCATENATE(preencher!#ref!,#REF!),preencher!#ref!))","v":{"$error":"#NAME?"}},{"$f":"IF(ISERROR(ROUND(AVERAGE(E66:N66),2)),\"\",ROUND(AVERAGE(E66:N66),2))","v":""},{"$f":"IF(ISERROR(ROUND(O66*D66,2)),\"\",ROUND(O66*D66,2))","v":""},null,null,{"$f":"IF(ISERROR(MEDIAN(E66:N66)),\"\",MEDIAN(E66:N66))","v":""},{"$f":"IF(ISERROR(STDEV(E66:N66)),\"\",STDEV(E66:N66))","v":""},{"$f":"IF(ISERROR(T66/O66),\"\",T66/O66)","v":""}]
[{"$f":"IF(preencher!#ref!=\"\",\"\",preencher!#ref!)","v":{"$error":"#NAME?"}},{"$f":"IF(preencher!#ref!=\"\",\"\",preencher!#ref!)","v":{"$error":"#NAME?"}},{"$f":"IF(preencher!#ref!=\"\",\"\",preencher!#ref!)","v":{"$error":"#NAME?"}},{"$f":"IF(preencher!#ref!=\"\",\"\",preencher!#ref!)","v":{"$error":"#NAME?"}},{"$f":"IF(preencher!#ref!=\"\",\"\",IF(COUNTIF(preencher!#ref!,preencher!#ref!)=0,CONCATENATE(preencher!#ref!,#REF!),preencher!#ref!))","v":{"$error":"#NAME?"}},{"$f":"IF(preencher!#ref!=\"\",\"\",IF(COUNTIF(preencher!#ref!,preencher!#ref!)=0,CONCATENATE(preencher!#ref!,#REF!),preencher!#ref!))","v":{"$error":"#NAME?"}},{"$f":"IF(preencher!#ref!=\"\",\"\",IF(COUNTIF(preencher!#ref!,preencher!#ref!)=0,CONCATENATE(preencher!#ref!,#REF!),preencher!#ref!))","v":{"$error":"#NAME?"}},{"$f":"IF(preencher!#ref!=\"\",\"\",IF(COUNTIF(preencher!#ref!,preencher!#ref!)=0,CONCATENATE(preencher!#ref!,#REF!),preencher!#ref!))","v":{"$error":"#NAME?"}},{"$f":"IF(preencher!#ref!=\"\",\"\",IF(COUNTIF(preencher!#ref!,preencher!#ref!)=0,CONCATENATE(preencher!#ref!,#REF!),preencher!#ref!))","v":{"$error":"#NAME?"}},{"$f":"IF(preencher!#ref!=\"\",\"\",IF(COUNTIF(preencher!#ref!,preencher!#ref!)=0,CONCATENATE(preencher!#ref!,#REF!),preencher!#ref!))","v":{"$error":"#NAME?"}},{"$f":"IF(preencher!#ref!=\"\",\"\",IF(COUNTIF(preencher!#ref!,preencher!#ref!)=0,CONCATENATE(preencher!#ref!,#REF!),preencher!#ref!))","v":{"$error":"#NAME?"}},{"$f":"IF(preencher!#ref!=\"\",\"\",IF(COUNTIF(preencher!#ref!,preencher!#ref!)=0,CONCATENATE(preencher!#ref!,#REF!),preencher!#ref!))","v":{"$error":"#NAME?"}},{"$f":"IF(preencher!#ref!=\"\",\"\",IF(COUNTIF(preencher!#ref!,preencher!#ref!)=0,CONCATENATE(preencher!#ref!,#REF!),preencher!#ref!))","v":{"$error":"#NAME?"}},{"$f":"IF(preencher!#ref!=\"\",\"\",IF(COUNTIF(preencher!#ref!,preencher!#ref!)=0,CONCATENATE(preencher!#ref!,#REF!),preencher!#ref!))","v":{"$error":"#NAME?"}},{"$f":"IF(ISERROR(ROUND(AVERAGE(E67:N67),2)),\"\",ROUND(AVERAGE(E67:N67),2))","v":""},{"$f":"IF(ISERROR(ROUND(O67*D67,2)),\"\",ROUND(O67*D67,2))","v":""},null,null,{"$f":"IF(ISERROR(MEDIAN(E67:N67)),\"\",MEDIAN(E67:N67))","v":""},{"$f":"IF(ISERROR(STDEV(E67:N67)),\"\",STDEV(E67:N67))","v":""},{"$f":"IF(ISERROR(T67/O67),\"\",T67/O67)","v":""}]
["VALOR GLOBAL",null,null,null,null,null,null,null,null,null,null,null,null,null,null,{"$f":"IF(SUM(P8:P67)=0,\"\",SUM(P8:P67))","v":""}]

{"sheet":"Média 4º, 5º e 6º","index":4,"n_rows":68,"n_cols":21,"rows_kept":68,"cut":false,"hidden":true,"merged":[[5,18,5,20],[67,0,67,14]]}
[]
[]
[]
[]
[]
[null,null,null,null,null,null,null,null,null,null,null,null,null,null,null,null,null,null,"ANÁLISE ESTATÍSTICA"]
[{"$f":"PREENCHER!A4","v":"ITEM"},{"$f":"PREENCHER!B4","v":"ESPECIFICAÇÃO"},{"$f":"PREENCHER!C4","v":"UN"},{"$f":"PREENCHER!D4","v":"QTDE"},{"$f":"preencher!#ref!","v":{"$error":"#NAME?"}},{"$f":"preencher!#ref!","v":{"$error":"#NAME?"}},{"$f":"PREENCHER!G5","v":"MAGAZINE LUIZA"},{"$f":"preencher!#ref!","v":{"$error":"#NAME?"}},{"$f":"preencher!#ref!","v":{"$error":"#NAME?"}},{"$f":"preencher!#ref!","v":{"$error":"#NAME?"}},{"$f":"preencher!#ref!","v":{"$error":"#NAME?"}},{"$f":"preencher!#ref!","v":{"$error":"#NAME?"}},{"$f":"preencher!#ref!","v":{"$error":"#NAME?"}},{"$f":"preencher!#ref!","v":{"$error":"#NAME?"}},{"$f":"PREENCHER!M5","v":"UNITÁRIO"},{"$f":"PREENCHER!N5","v":"TOTAL"},{"$f":"PREENCHER!Q4","v":"OBSERVAÇÃO"},null,"MEDIANA","DESVIO PADRÃO","COEFICIENTE DE VARIAÇÃO"]
[{"$f":"IF(PREENCHER!A6=\"\",\"\",PREENCHER!A6)","v":1},{"$f":"IF(PREENCHER!B6=\"\",\"\",PREENCHER!B6)","v":"ESCADA PLATAFORMA EM ALUMÍNIO, NR 12, CAPACIDADE MÍNIMA 150 KG, COM BASE FIXA E 2 RODAS TRASEIRAS PARA MOVIMENTAÇÃO. COM CORRIMÃO. "},{"$f":"IF(PREENCHER!C6=\"\",\"\",PREENCHER!C6)","v":"UNIDADE"},{"$f":"IF(PREENCHER!D6=\"\",\"\",PREENCHER!D6)","v":2},{"$f":"IF(preencher!#ref!=\"\",\"\",IF(COUNTIF(PREENCHER!$AG6:$AI6,preencher!#ref!)=0,CONCATENATE(PREENCHER!AO6,#REF!),preencher!#ref!))","v":{"$error":"#NAME?"}},{"$f":"IF(PREENCHER!G6=\"\",\"\",IF(COUNTIF(PREENCHER!$AG6:$AI6,PREENCHER!G6)=0,CONCATENATE(PREENCHER!AP6,#REF!),PREENCHER!G6))","v":{"$error":"#REF!"}},{"$f":"IF(preencher!#ref!=\"\",\"\",IF(COUNTIF(PREENCHER!$AG6:$AI6,preencher!#ref!)=0,CONCATENATE(PREENCHER!AQ6,#REF!),preencher!#ref!))","v":{"$error":"#NAME?"}},{"$f":"IF(preencher!#ref!=\"\",\"\",IF(COUNTIF(PREENCHER!$AG6:$AI6,preencher!#ref!)=0,CONCATENATE(PREENCHER!AR6,#REF!),preencher!#ref!))","v":{"$error":"#NAME?"}},{"$f":"IF(preencher!#ref!=\"\",\"\",IF(COUNTIF(PREENCHER!$AG6:$AI6,preencher!#ref!)=0,CONCATENATE(PREENCHER!AS6,#REF!),preencher!#ref!))","v":{"$error":"#NAME?"}},{"$f":"IF(preencher!#ref!=\"\",\"\",IF(COUNTIF(PREENCHER!$AG6:$AI6,preencher!#ref!)=0,CONCATENATE(PREENCHER!AT6,#REF!),preencher!#ref!))","v":{"$error":"#NAME?"}},{"$f":"IF(preencher!#ref!=\"\",\"\",IF(COUNTIF(PREENCHER!$AG6:$AI6,preencher!#ref!)=0,CONCATENATE(PREENCHER!AU6,#REF!),preencher!#ref!))","v":{"$error":"#NAME?"}},{"$f":"IF(preencher!#ref!=\"\",\"\",IF(COUNTIF(PREENCHER!$AG6:$AI6,preencher!#ref!)=0,CONCATENATE(PREENCHER!AV6,#REF!),preencher!#ref!))","v":{"$error":"#NAME?"}},{"$f":"IF(preencher!#ref!=\"\",\"\",IF(COUNTIF(PREENCHER!$AG6:$AI6,preencher!#ref!)=0,CONCATENATE(PREENCHER!AW6,#REF!),preencher!#ref!))","v":{"$error":"#NAME?"}},{"$f":"IF(preencher!#ref!=\"\",\"\",IF(COUNTIF(PREENCHER!$AG6:$AI6,preencher!#ref!)=0,CONCATENATE(PREENCHER!AX6,#REF!),preencher!#ref!))","v":{"$error":"#NAME?"}},{"$f":"IF(ISERROR(ROUND(AVERAGE(E8:N8),2)),\"\",ROUND(AVERAGE(E8:N8),2))","v":""},{"$f":"IF(ISERROR(ROUND(O8*D8,2)),\"\",ROUND(O8*D8,2))","v":""},null,null,{"$f":"IF(ISERROR(MEDIAN(E8:N8)),\"\",MEDIAN(E8:N8))","v":""},{"$f":"IF(ISERROR(STDEV(E8:N8)),\"\",STDEV(E8:N8))","v":""},{"$f":"IF(ISERROR(T8/O8),\"\",T8/O8)","v":""}]
[{"$f":"IF(PREENCHER!A7=\"\",\"\",PREENCHER!A7)","v":2},{"$f":"IF(PREENCHER!B7=\"\",\"\",PREENCHER!B7)","v":""},{"$f":"IF(PREENCHER!C7=\"\",\"\",PREENCHER!C7)","v":"GRAMAS"},{"$f":"IF(PREENCHER!D7=\"\",\"\",PREENCHER!D7)","v":0},{"$f":"IF(preencher!#ref!=\"\",\"\",IF(COUNTIF(PREENCHER!$AG7:$AI7,preencher!#ref!)=0,CONCATENATE(PREENCHER!AO7,#REF!),preencher!#ref!))","v":{"$error":"#NAME?"}},{"$f":"IF(PREENCHER!G7=\"\",\"\",IF(COUNTIF(PREENCHER!$AG7:$AI7,PREENCHER!G7)=0,CONCATENATE(PREENCHER!AP7,#REF!),PREENCHER!G7))","v":""},{"$f":"IF(preencher!#ref!=\"\",\"\",IF(COUNTIF(PREENCHER!$AG7:$AI7,preencher!#ref!)=0,CONCATENATE(PREENCHER!AQ7,#REF!),preencher!#ref!))","v":{"$error":"#NAME?"}},{"$f":"IF(preencher!#ref!=\"\",\"\",IF(COUNTIF(PREENCHER!$AG7:$AI7,preencher!#ref!)=0,CONCATENATE(PREENCHER!AR7,#REF!),preencher!#ref!))","v":{"$error":"#NAME?"}},{"$f":"IF(preencher!#ref!=\"\",\"\",IF(COUNTIF(PREENCHER!$AG7:$AI7,preencher!#ref!)=0,CONCATENATE(PREENCHER!AS7,#REF!),preencher!#ref!))","v":{"$error":"#NAME?"}},{"$f":"IF(preencher!#ref!=\"\",\"\",IF(COUNTIF(PREENCHER!$AG7:$AI7,preencher!#ref!)=0,CONCATENATE(PREENCHER!AT7,#REF!),preencher!#ref!))","v":{"$error":"#NAME?"}},{"$f":"IF(preencher!#ref!=\"\",\"\",IF(COUNTIF(PREENCHER!$AG7:$AI7,preencher!#ref!)=0,CONCATENATE(PREENCHER!AU7,#REF!),preencher!#ref!))","v":{"$error":"#NAME?"}},{"$f":"IF(preencher!#ref!=\"\",\"\",IF(COUNTIF(PREENCHER!$AG7:$AI7,preencher!#ref!)=0,CONCATENATE(PREENCHER!AV7,#REF!),preencher!#ref!))","v":{"$error":"#NAME?"}},{"$f":"IF(preencher!#ref!=\"\",\"\",IF(COUNTIF(PREENCHER!$AG7:$AI7,preencher!#ref!)=0,CONCATENATE(PREENCHER!AW7,#REF!),preencher!#ref!))","v":{"$error":"#NAME?"}},{"$f":"IF(preencher!#ref!=\"\",\"\",IF(COUNTIF(PREENCHER!$AG7:$AI7,preencher!#ref!)=0,CONCATENATE(PREENCHER!AX7,#REF!),preencher!#ref!))","v":{"$error":"#NAME?"}},{"$f":"IF(ISERROR(ROUND(AVERAGE(E9:N9),2)),\"\",ROUND(AVERAGE(E9:N9),2))","v":""},{"$f":"IF(ISERROR(ROUND(O9*D9,2)),\"\",ROUND(O9*D9,2))","v":""},null,null,{"$f":"IF(ISERROR(MEDIAN(E9:N9)),\"\",MEDIAN(E9:N9))","v":""},{"$f":"IF(ISERROR(STDEV(E9:N9)),\"\",STDEV(E9:N9))","v":""},{"$f":"IF(ISERROR(T9/O9),\"\",T9/O9)","v":""}]
[{"$f":"IF(PREENCHER!A8=\"\",\"\",PREENCHER!A8)","v":3},{"$f":"IF(PREENCHER!B8=\"\",\"\",PREENCHER!B8)","v":""},{"$f":"IF(PREENCHER!C8=\"\",\"\",PREENCHER!C8)","v":"GRAMAS"},{"$f":"IF(PREENCHER!D8=\"\",\"\",PREENCHER!D8)","v":0},{"$f":"IF(preencher!#ref!=\"\",\"\",IF(COUNTIF(PREENCHER!$AG8:$AI8,preencher!#ref!)=0,CONCATENATE(PREENCHER!AO8,#REF!),preencher!#ref!))","v":{"$error":"#NAME?"}},{"$f":"IF(PREENCHER!G8=\"\",\"\",IF(COUNTIF(PREENCHER!$AG8:$AI8,PREENCHER!G8)=0,CONCATENATE(PREENCHER!AP8,#REF!),PREENCHER!G8))","v":""},{"$f":"IF(preencher!#ref!=\"\",\"\",IF(COUNTIF(PREENCHER!$AG8:$AI8,preencher!#ref!)=0,CONCATENATE(PREENCHER!AQ8,#REF!),preencher!#ref!))","v":{"$error":"#NAME?"}},{"$f":"IF(preencher!#ref!=\"\",\"\",IF(COUNTIF(PREENCHER!$AG8:$AI8,preencher!#ref!)=0,CONCATENATE(PREENCHER!AR8,#REF!),preencher!#ref!))","v":{"$error":"#NAME?"}},{"$f":"IF(preencher!#ref!=\"\",\"\",IF(COUNTIF(PREENCHER!$AG8:$AI8,preencher!#ref!)=0,CONCATENATE(PREENCHER!AS8,#REF!),preencher!#ref!))","v":{"$error":"#NAME?"}},{"$f":"IF(preencher!#ref!=\"\",\"\",IF(COUNTIF(PREENCHER!$AG8:$AI8,preencher!#ref!)=0,CONCATENATE(PREENCHER!AT8,#REF!),preencher!#ref!))","v":{"$error":"#NAME?"}},{"$f":"IF(preencher!#ref!=\"\",\"\",IF(COUNTIF(PREENCHER!$AG8:$AI8,preencher!#ref!)=0,CONCATENATE(PREENCHER!AU8,#REF!),preencher!#ref!))","v":{"$error":"#NAME?"}},{"$f":"IF(preencher!#ref!=\"\",\"\",IF(COUNTIF(PREENCHER!$AG8:$AI8,preencher!#ref!)=0,CONCATENATE(PREENCHER!AV8,#REF!),preencher!#ref!))","v":{"$error":"#NAME?"}},{"$f":"IF(preencher!#ref!=\"\",\"\",IF(COUNTIF(PREENCHER!$AG8:$AI8,preencher!#ref!)=0,CONCATENATE(PREENCHER!AW8,#REF!),preencher!#ref!))","v":{"$error":"#NAME?"}},{"$f":"IF(preencher!#ref!=\"\",\"\",IF(COUNTIF(PREENCHER!$AG8:$AI8,preencher!#ref!)=0,CONCATENATE(PREENCHER!AX8,#REF!),preencher!#ref!))","v":{"$error":"#NAME?"}},{"$f":"IF(ISERROR(ROUND(AVERAGE(E10:N10),2)),\"\",ROUND(AVERAGE(E10:N10),2))","v":""},{"$f":"IF(ISERROR(ROUND(O10*D10,2)),\"\",ROUND(O10*D10,2))","v":""},null,null,{"$f":"IF(ISERROR(MEDIAN(E10:N10)),\"\",MEDIAN(E10:N10))","v":""},{"$f":"IF(ISERROR(STDEV(E10:N10)),\"\",STDEV(E10:N10))","v":""},{"$f":"IF(ISERROR(T10/O10),\"\",T10/O10)","v":""}]
[{"$f":"IF(preencher!#ref!=\"\",\"\",preencher!#ref!)","v":{"$error":"#NAME?"}},{"$f":"IF(preencher!#ref!=\"\",\"\",preencher!#ref!)","v":{"$error":"#NAME?"}},{"$f":"IF(preencher!#ref!=\"\",\"\",preencher!#ref!)","v":{"$error":"#NAME?"}},{"$f":"IF(preencher!#ref!=\"\",\"\",preencher!#ref!)","v":{"$error":"#NAME?"}},{"$f":"IF(preencher!#ref!=\"\",\"\",IF(COUNTIF(preencher!#ref!,preencher!#ref!)=0,CONCATENATE(preencher!#ref!,#REF!),preencher!#ref!))","v":{"$error":"#NAME?"}},{"$f":"IF(preencher!#ref!=\"\",\"\",IF(COUNTIF(preencher!#ref!,preencher!#ref!)=0,CONCATENATE(preencher!#ref!,#REF!),preencher!#ref!))","v":{"$error":"#NAME?"}},{"$f":"IF(preencher!#ref!=\"\",\"\",IF(COUNTIF(preencher!#ref!,preencher!#ref!)=0,CONCATENATE(preencher!#ref!,#REF!),preencher!#ref!))","v":{"$error":"#NAME?"}},{"$f":"IF(preencher!#ref!=\"\",\"\",IF(COUNTIF(preencher!#ref!,preencher!#ref!)=0,CONCATENATE(preencher!#ref!,#REF!),preencher!#ref!))","v":{"$error":"#NAME?"}},{"$f":"IF(preencher!#ref!=\"\",\"\",IF(COUNTIF(preencher!#ref!,preencher!#ref!)=0,CONCATENATE(preencher!#ref!,#REF!),preencher!#ref!))","v":{"$error":"#NAME?"}},{"$f":"IF(preencher!#ref!=\"\",\"\",IF(COUNTIF(preencher!#ref!,preencher!#ref!)=0,CONCATENATE(preencher!#ref!,#REF!),preencher!#ref!))","v":{"$error":"#NAME?"}},{"$f":"IF(preencher!#ref!=\"\",\"\",IF(COUNTIF(preencher!#ref!,preencher!#ref!)=0,CONCATENATE(preencher!#ref!,#REF!),preencher!#ref!))","v":{"$error":"#NAME?"}},{"$f":"IF(preencher!#ref!=\"\",\"\",IF(COUNTIF(preencher!#ref!,preencher!#ref!)=0,CONCATENATE(preencher!#ref!,#REF!),preencher!#ref!))","v":{"$error":"#NAME?"}},{"$f":"IF(preencher!#ref!=\"\",\"\",IF(COUNTIF(preencher!#ref!,preencher!#ref!)=0,CONCATENATE(preencher!#ref!,#REF!),preencher!#ref!))","v":{"$error":"#NAME?"}},{"$f":"IF(preencher!#ref!=\"\",\"\",IF(COUNTIF(preencher!#ref!,preencher!#ref!)=0,CONCATENATE(preencher!#ref!,#REF!),preencher!#ref!))","v":{"$error":"#NAME?"}},{"$f":"IF(ISERROR(ROUND(AVERAGE(E11:N11),2)),\"\",ROUND(AVERAGE(E11:N11),2))","v":""},{"$f":"IF(ISERROR(ROUND(O11*D11,2)),\"\",ROUND(O11*D11,2))","v":""},null,null,{"$f":"IF(ISERROR(MEDIAN(E11:N11)),\"\",MEDIAN(E11:N11))","v":""},{"$f":"IF(ISERROR(STDEV(E11:N11)),\"\",STDEV(E11:N11))","v":""},{"$f":"IF(ISERROR(T11/O11),\"\",T11/O11)","v":""}]
[{"$f":"IF(preencher!#ref!=\"\",\"\",preencher!#ref!)","v":{"$error":"#NAME?"}},{"$f":"IF(preencher!#ref!=\"\",\"\",preencher!#ref!)","v":{"$error":"#NAME?"}},{"$f":"IF(preencher!#ref!=\"\",\"\",preencher!#ref!)","v":{"$error":"#NAME?"}},{"$f":"IF(preencher!#ref!=\"\",\"\",preencher!#ref!)","v":{"$error":"#NAME?"}},{"$f":"IF(preencher!#ref!=\"\",\"\",IF(COUNTIF(preencher!#ref!,preencher!#ref!)=0,CONCATENATE(preencher!#ref!,#REF!),preencher!#ref!))","v":{"$error":"#NAME?"}},{"$f":"IF(preencher!#ref!=\"\",\"\",IF(COUNTIF(preencher!#ref!,preencher!#ref!)=0,CONCATENATE(preencher!#ref!,#REF!),preencher!#ref!))","v":{"$error":"#NAME?"}},{"$f":"IF(preencher!#ref!=\"\",\"\",IF(COUNTIF(preencher!#ref!,preencher!#ref!)=0,CONCATENATE(preencher!#ref!,#REF!),preencher!#ref!))","v":{"$error":"#NAME?"}},{"$f":"IF(preencher!#ref!=\"\",\"\",IF(COUNTIF(preencher!#ref!,preencher!#ref!)=0,CONCATENATE(preencher!#ref!,#REF!),preencher!#ref!))","v":{"$error":"#NAME?"}},{"$f":"IF(preencher!#ref!=\"\",\"\",IF(COUNTIF(preencher!#ref!,preencher!#ref!)=0,CONCATENATE(preencher!#ref!,#REF!),preencher!#ref!))","v":{"$error":"#NAME?"}},{"$f":"IF(preencher!#ref!=\"\",\"\",IF(COUNTIF(preencher!#ref!,preencher!#ref!)=0,CONCATENATE(preencher!#ref!,#REF!),preencher!#ref!))","v":{"$error":"#NAME?"}},{"$f":"IF(preencher!#ref!=\"\",\"\",IF(COUNTIF(preencher!#ref!,preencher!#ref!)=0,CONCATENATE(preencher!#ref!,#REF!),preencher!#ref!))","v":{"$error":"#NAME?"}},{"$f":"IF(preencher!#ref!=\"\",\"\",IF(COUNTIF(preencher!#ref!,preencher!#ref!)=0,CONCATENATE(preencher!#ref!,#REF!),preencher!#ref!))","v":{"$error":"#NAME?"}},{"$f":"IF(preencher!#ref!=\"\",\"\",IF(COUNTIF(preencher!#ref!,preencher!#ref!)=0,CONCATENATE(preencher!#ref!,#REF!),preencher!#ref!))","v":{"$error":"#NAME?"}},{"$f":"IF(preencher!#ref!=\"\",\"\",IF(COUNTIF(preencher!#ref!,preencher!#ref!)=0,CONCATENATE(preencher!#ref!,#REF!),preencher!#ref!))","v":{"$error":"#NAME?"}},{"$f":"IF(ISERROR(ROUND(AVERAGE(E12:N12),2)),\"\",ROUND(AVERAGE(E12:N12),2))","v":""},{"$f":"IF(ISERROR(ROUND(O12*D12,2)),\"\",ROUND(O12*D12,2))","v":""},null,null,{"$f":"IF(ISERROR(MEDIAN(E12:N12)),\"\",MEDIAN(E12:N12))","v":""},{"$f":"IF(ISERROR(STDEV(E12:N12)),\"\",STDEV(E12:N12))","v":""},{"$f":"IF(ISERROR(T12/O12),\"\",T12/O12)","v":""}]
[{"$f":"IF(preencher!#ref!=\"\",\"\",preencher!#ref!)","v":{"$error":"#NAME?"}},{"$f":"IF(preencher!#ref!=\"\",\"\",preencher!#ref!)","v":{"$error":"#NAME?"}},{"$f":"IF(preencher!#ref!=\"\",\"\",preencher!#ref!)","v":{"$error":"#NAME?"}},{"$f":"IF(preencher!#ref!=\"\",\"\",preencher!#ref!)","v":{"$error":"#NAME?"}},{"$f":"IF(preencher!#ref!=\"\",\"\",IF(COUNTIF(preencher!#ref!,preencher!#ref!)=0,CONCATENATE(preencher!#ref!,#REF!),preencher!#ref!))","v":{"$error":"#NAME?"}},{"$f":"IF(preencher!#ref!=\"\",\"\",IF(COUNTIF(preencher!#ref!,preencher!#ref!)=0,CONCATENATE(preencher!#ref!,#REF!),preencher!#ref!))","v":{"$error":"#NAME?"}},{"$f":"IF(preencher!#ref!=\"\",\"\",IF(COUNTIF(preencher!#ref!,preencher!#ref!)=0,CONCATENATE(preencher!#ref!,#REF!),preencher!#ref!))","v":{"$error":"#NAME?"}},{"$f":"IF(preencher!#ref!=\"\",\"\",IF(COUNTIF(preencher!#ref!,preencher!#ref!)=0,CONCATENATE(preencher!#ref!,#REF!),preencher!#ref!))","v":{"$error":"#NAME?"}},{"$f":"IF(preencher!#ref!=\"\",\"\",IF(COUNTIF(preencher!#ref!,preencher!#ref!)=0,CONCATENATE(preencher!#ref!,#REF!),preencher!#ref!))","v":{"$error":"#NAME?"}},{"$f":"IF(preencher!#ref!=\"\",\"\",IF(COUNTIF(preencher!#ref!,preencher!#ref!)=0,CONCATENATE(preencher!#ref!,#REF!),preencher!#ref!))","v":{"$error":"#NAME?"}},{"$f":"IF(preencher!#ref!=\"\",\"\",IF(COUNTIF(preencher!#ref!,preencher!#ref!)=0,CONCATENATE(preencher!#ref!,#REF!),preencher!#ref!))","v":{"$error":"#NAME?"}},{"$f":"IF(preencher!#ref!=\"\",\"\",IF(COUNTIF(preencher!#ref!,preencher!#ref!)=0,CONCATENATE(preencher!#ref!,#REF!),preencher!#ref!))","v":{"$error":"#NAME?"}},{"$f":"IF(preencher!#ref!=\"\",\"\",IF(COUNTIF(preencher!#ref!,preencher!#ref!)=0,CONCATENATE(preencher!#ref!,#REF!),preencher!#ref!))","v":{"$error":"#NAME?"}},{"$f":"IF(preencher!#ref!=\"\",\"\",IF(COUNTIF(preencher!#ref!,preencher!#ref!)=0,CONCATENATE(preencher!#ref!,#REF!),preencher!#ref!))","v":{"$error":"#NAME?"}},{"$f":"IF(ISERROR(ROUND(AVERAGE(E13:N13),2)),\"\",ROUND(AVERAGE(E13:N13),2))","v":""},{"$f":"IF(ISERROR(ROUND(O13*D13,2)),\"\",ROUND(O13*D13,2))","v":""},null,null,{"$f":"IF(ISERROR(MEDIAN(E13:N13)),\"\",MEDIAN(E13:N13))","v":""},{"$f":"IF(ISERROR(STDEV(E13:N13)),\"\",STDEV(E13:N13))","v":""},{"$f":"IF(ISERROR(T13/O13),\"\",T13/O13)","v":""}]
[{"$f":"IF(preencher!#ref!=\"\",\"\",preencher!#ref!)","v":{"$error":"#NAME?"}},{"$f":"IF(preencher!#ref!=\"\",\"\",preencher!#ref!)","v":{"$error":"#NAME?"}},{"$f":"IF(preencher!#ref!=\"\",\"\",preencher!#ref!)","v":{"$error":"#NAME?"}},{"$f":"IF(preencher!#ref!=\"\",\"\",preencher!#ref!)","v":{"$error":"#NAME?"}},{"$f":"IF(preencher!#ref!=\"\",\"\",IF(COUNTIF(preencher!#ref!,preencher!#ref!)=0,CONCATENATE(preencher!#ref!,#REF!),preencher!#ref!))","v":{"$error":"#NAME?"}},{"$f":"IF(preencher!#ref!=\"\",\"\",IF(COUNTIF(preencher!#ref!,preencher!#ref!)=0,CONCATENATE(preencher!#ref!,#REF!),preencher!#ref!))","v":{"$error":"#NAME?"}},{"$f":"IF(preencher!#ref!=\"\",\"\",IF(COUNTIF(preencher!#ref!,preencher!#ref!)=0,CONCATENATE(preencher!#ref!,#REF!),preencher!#ref!))","v":{"$error":"#NAME?"}},{"$f":"IF(preencher!#ref!=\"\",\"\",IF(COUNTIF(preencher!#ref!,preencher!#ref!)=0,CONCATENATE(preencher!#ref!,#REF!),preencher!#ref!))","v":{"$error":"#NAME?"}},{"$f":"IF(preencher!#ref!=\"\",\"\",IF(COUNTIF(preencher!#ref!,preencher!#ref!)=0,CONCATENATE(preencher!#ref!,#REF!),preencher!#ref!))","v":{"$error":"#NAME?"}},{"$f":"IF(preencher!#ref!=\"\",\"\",IF(COUNTIF(preencher!#ref!,preencher!#ref!)=0,CONCATENATE(preencher!#ref!,#REF!),preencher!#ref!))","v":{"$error":"#NAME?"}},{"$f":"IF(preencher!#ref!=\"\",\"\",IF(COUNTIF(preencher!#ref!,preencher!#ref!)=0,CONCATENATE(preencher!#ref!,#REF!),preencher!#ref!))","v":{"$error":"#NAME?"}},{"$f":"IF(preencher!#ref!=\"\",\"\",IF(COUNTIF(preencher!#ref!,preencher!#ref!)=0,CONCATENATE(preencher!#ref!,#REF!),preencher!#ref!))","v":{"$error":"#NAME?"}},{"$f":"IF(preencher!#ref!=\"\",\"\",IF(COUNTIF(preencher!#ref!,preencher!#ref!)=0,CONCATENATE(preencher!#ref!,#REF!),preencher!#ref!))","v":{"$error":"#NAME?"}},{"$f":"IF(preencher!#ref!=\"\",\"\",IF(COUNTIF(preencher!#ref!,preencher!#ref!)=0,CONCATENATE(preencher!#ref!,#REF!),preencher!#ref!))","v":{"$error":"#NAME?"}},{"$f":"IF(ISERROR(ROUND(AVERAGE(E14:N14),2)),\"\",ROUND(AVERAGE(E14:N14),2))","v":""},{"$f":"IF(ISERROR(ROUND(O14*D14,2)),\"\",ROUND(O14*D14,2))","v":""},null,null,{"$f":"IF(ISERROR(MEDIAN(E14:N14)),\"\",MEDIAN(E14:N14))","v":""},{"$f":"IF(ISERROR(STDEV(E14:N14)),\"\",STDEV(E14:N14))","v":""},{"$f":"IF(ISERROR(T14/O14),\"\",T14/O14)","v":""}]
[{"$f":"IF(preencher!#ref!=\"\",\"\",preencher!#ref!)","v":{"$error":"#NAME?"}},{"$f":"IF(preencher!#ref!=\"\",\"\",preencher!#ref!)","v":{"$error":"#NAME?"}},{"$f":"IF(preencher!#ref!=\"\",\"\",preencher!#ref!)","v":{"$error":"#NAME?"}},{"$f":"IF(preencher!#ref!=\"\",\"\",preencher!#ref!)","v":{"$error":"#NAME?"}},{"$f":"IF(preencher!#ref!=\"\",\"\",IF(COUNTIF(preencher!#ref!,preencher!#ref!)=0,CONCATENATE(preencher!#ref!,#REF!),preencher!#ref!))","v":{"$error":"#NAME?"}},{"$f":"IF(preencher!#ref!=\"\",\"\",IF(COUNTIF(preencher!#ref!,preencher!#ref!)=0,CONCATENATE(preencher!#ref!,#REF!),preencher!#ref!))","v":{"$error":"#NAME?"}},{"$f":"IF(preencher!#ref!=\"\",\"\",IF(COUNTIF(preencher!#ref!,preencher!#ref!)=0,CONCATENATE(preencher!#ref!,#REF!),preencher!#ref!))","v":{"$error":"#NAME?"}},{"$f":"IF(preencher!#ref!=\"\",\"\",IF(COUNTIF(preencher!#ref!,preencher!#ref!)=0,CONCATENATE(preencher!#ref!,#REF!),preencher!#ref!))","v":{"$error":"#NAME?"}},{"$f":"IF(preencher!#ref!=\"\",\"\",IF(COUNTIF(preencher!#ref!,preencher!#ref!)=0,CONCATENATE(preencher!#ref!,#REF!),preencher!#ref!))","v":{"$error":"#NAME?"}},{"$f":"IF(preencher!#ref!=\"\",\"\",IF(COUNTIF(preencher!#ref!,preencher!#ref!)=0,CONCATENATE(preencher!#ref!,#REF!),preencher!#ref!))","v":{"$error":"#NAME?"}},{"$f":"IF(preencher!#ref!=\"\",\"\",IF(COUNTIF(preencher!#ref!,preencher!#ref!)=0,CONCATENATE(preencher!#ref!,#REF!),preencher!#ref!))","v":{"$error":"#NAME?"}},{"$f":"IF(preencher!#ref!=\"\",\"\",IF(COUNTIF(preencher!#ref!,preencher!#ref!)=0,CONCATENATE(preencher!#ref!,#REF!),preencher!#ref!))","v":{"$error":"#NAME?"}},{"$f":"IF(preencher!#ref!=\"\",\"\",IF(COUNTIF(preencher!#ref!,preencher!#ref!)=0,CONCATENATE(preencher!#ref!,#REF!),preencher!#ref!))","v":{"$error":"#NAME?"}},{"$f":"IF(preencher!#ref!=\"\",\"\",IF(COUNTIF(preencher!#ref!,preencher!#ref!)=0,CONCATENATE(preencher!#ref!,#REF!),preencher!#ref!))","v":{"$error":"#NAME?"}},{"$f":"IF(ISERROR(ROUND(AVERAGE(E15:N15),2)),\"\",ROUND(AVERAGE(E15:N15),2))","v":""},{"$f":"IF(ISERROR(ROUND(O15*D15,2)),\"\",ROUND(O15*D15,2))","v":""},null,null,{"$f":"IF(ISERROR(MEDIAN(E15:N15)),\"\",MEDIAN(E15:N15))","v":""},{"$f":"IF(ISERROR(STDEV(E15:N15)),\"\",STDEV(E15:N15))","v":""},{"$f":"IF(ISERROR(T15/O15),\"\",T15/O15)","v":""}]
[{"$f":"IF(preencher!#ref!=\"\",\"\",preencher!#ref!)","v":{"$error":"#NAME?"}},{"$f":"IF(preencher!#ref!=\"\",\"\",preencher!#ref!)","v":{"$error":"#NAME?"}},{"$f":"IF(preencher!#ref!=\"\",\"\",preencher!#ref!)","v":{"$error":"#NAME?"}},{"$f":"IF(preencher!#ref!=\"\",\"\",preencher!#ref!)","v":{"$error":"#NAME?"}},{"$f":"IF(preencher!#ref!=\"\",\"\",IF(COUNTIF(preencher!#ref!,preencher!#ref!)=0,CONCATENATE(preencher!#ref!,#REF!),preencher!#ref!))","v":{"$error":"#NAME?"}},{"$f":"IF(preencher!#ref!=\"\",\"\",IF(COUNTIF(preencher!#ref!,preencher!#ref!)=0,CONCATENATE(preencher!#ref!,#REF!),preencher!#ref!))","v":{"$error":"#NAME?"}},{"$f":"IF(preencher!#ref!=\"\",\"\",IF(COUNTIF(preencher!#ref!,preencher!#ref!)=0,CONCATENATE(preencher!#ref!,#REF!),preencher!#ref!))","v":{"$error":"#NAME?"}},{"$f":"IF(preencher!#ref!=\"\",\"\",IF(COUNTIF(preencher!#ref!,preencher!#ref!)=0,CONCATENATE(preencher!#ref!,#REF!),preencher!#ref!))","v":{"$error":"#NAME?"}},{"$f":"IF(preencher!#ref!=\"\",\"\",IF(COUNTIF(preencher!#ref!,preencher!#ref!)=0,CONCATENATE(preencher!#ref!,#REF!),preencher!#ref!))","v":{"$error":"#NAME?"}},{"$f":"IF(preencher!#ref!=\"\",\"\",IF(COUNTIF(preencher!#ref!,preencher!#ref!)=0,CONCATENATE(preencher!#ref!,#REF!),preencher!#ref!))","v":{"$error":"#NAME?"}},{"$f":"IF(preencher!#ref!=\"\",\"\",IF(COUNTIF(preencher!#ref!,preencher!#ref!)=0,CONCATENATE(preencher!#ref!,#REF!),preencher!#ref!))","v":{"$error":"#NAME?"}},{"$f":"IF(preencher!#ref!=\"\",\"\",IF(COUNTIF(preencher!#ref!,preencher!#ref!)=0,CONCATENATE(preencher!#ref!,#REF!),preencher!#ref!))","v":{"$error":"#NAME?"}},{"$f":"IF(preencher!#ref!=\"\",\"\",IF(COUNTIF(preencher!#ref!,preencher!#ref!)=0,CONCATENATE(preencher!#ref!,#REF!),preencher!#ref!))","v":{"$error":"#NAME?"}},{"$f":"IF(preencher!#ref!=\"\",\"\",IF(COUNTIF(preencher!#ref!,preencher!#ref!)=0,CONCATENATE(preencher!#ref!,#REF!),preencher!#ref!))","v":{"$error":"#NAME?"}},{"$f":"IF(ISERROR(ROUND(AVERAGE(E16:N16),2)),\"\",ROUND(AVERAGE(E16:N16),2))","v":""},{"$f":"IF(ISERROR(ROUND(O16*D16,2)),\"\",ROUND(O16*D16,2))","v":""},null,null,{"$f":"IF(ISERROR(MEDIAN(E16:N16)),\"\",MEDIAN(E16:N16))","v":""},{"$f":"IF(ISERROR(STDEV(E16:N16)),\"\",STDEV(E16:N16))","v":""},{"$f":"IF(ISERROR(T16/O16),\"\",T16/O16)","v":""}]
[{"$f":"IF(preencher!#ref!=\"\",\"\",preencher!#ref!)","v":{"$error":"#NAME?"}},{"$f":"IF(preencher!#ref!=\"\",\"\",preencher!#ref!)","v":{"$error":"#NAME?"}},{"$f":"IF(preencher!#ref!=\"\",\"\",preencher!#ref!)","v":{"$error":"#NAME?"}},{"$f":"IF(preencher!#ref!=\"\",\"\",preencher!#ref!)","v":{"$error":"#NAME?"}},{"$f":"IF(preencher!#ref!=\"\",\"\",IF(COUNTIF(preencher!#ref!,preencher!#ref!)=0,CONCATENATE(preencher!#ref!,#REF!),preencher!#ref!))","v":{"$error":"#NAME?"}},{"$f":"IF(preencher!#ref!=\"\",\"\",IF(COUNTIF(preencher!#ref!,preencher!#ref!)=0,CONCATENATE(preencher!#ref!,#REF!),preencher!#ref!))","v":{"$error":"#NAME?"}},{"$f":"IF(preencher!#ref!=\"\",\"\",IF(COUNTIF(preencher!#ref!,preencher!#ref!)=0,CONCATENATE(preencher!#ref!,#REF!),preencher!#ref!))","v":{"$error":"#NAME?"}},{"$f":"IF(preencher!#ref!=\"\",\"\",IF(COUNTIF(preencher!#ref!,preencher!#ref!)=0,CONCATENATE(preencher!#ref!,#REF!),preencher!#ref!))","v":{"$error":"#NAME?"}},{"$f":"IF(preencher!#ref!=\"\",\"\",IF(COUNTIF(preencher!#ref!,preencher!#ref!)=0,CONCATENATE(preencher!#ref!,#REF!),preencher!#ref!))","v":{"$error":"#NAME?"}},{"$f":"IF(preencher!#ref!=\"\",\"\",IF(COUNTIF(preencher!#ref!,preencher!#ref!)=0,CONCATENATE(preencher!#ref!,#REF!),preencher!#ref!))","v":{"$error":"#NAME?"}},{"$f":"IF(preencher!#ref!=\"\",\"\",IF(COUNTIF(preencher!#ref!,preencher!#ref!)=0,CONCATENATE(preencher!#ref!,#REF!),preencher!#ref!))","v":{"$error":"#NAME?"}},{"$f":"IF(preencher!#ref!=\"\",\"\",IF(COUNTIF(preencher!#ref!,preencher!#ref!)=0,CONCATENATE(preencher!#ref!,#REF!),preencher!#ref!))","v":{"$error":"#NAME?"}},{"$f":"IF(preencher!#ref!=\"\",\"\",IF(COUNTIF(preencher!#ref!,preencher!#ref!)=0,CONCATENATE(preencher!#ref!,#REF!),preencher!#ref!))","v":{"$error":"#NAME?"}},{"$f":"IF(preencher!#ref!=\"\",\"\",IF(COUNTIF(preencher!#ref!,preencher!#ref!)=0,CONCATENATE(preencher!#ref!,#REF!),preencher!#ref!))","v":{"$error":"#NAME?"}},{"$f":"IF(ISERROR(ROUND(AVERAGE(E17:N17),2)),\"\",ROUND(AVERAGE(E17:N17),2))","v":""},{"$f":"IF(ISERROR(ROUND(O17*D17,2)),\"\",ROUND(O17*D17,2))","v":""},null,null,{"$f":"IF(ISERROR(MEDIAN(E17:N17)),\"\",MEDIAN(E17:N17))","v":""},{"$f":"IF(ISERROR(STDEV(E17:N17)),\"\",STDEV(E17:N17))","v":""},{"$f":"IF(ISERROR(T17/O17),\"\",T17/O17)","v":""}]
[{"$f":"IF(preencher!#ref!=\"\",\"\",preencher!#ref!)","v":{"$error":"#NAME?"}},{"$f":"IF(preencher!#ref!=\"\",\"\",preencher!#ref!)","v":{"$error":"#NAME?"}},{"$f":"IF(preencher!#ref!=\"\",\"\",preencher!#ref!)","v":{"$error":"#NAME?"}},{"$f":"IF(preencher!#ref!=\"\",\"\",preencher!#ref!)","v":{"$error":"#NAME?"}},{"$f":"IF(preencher!#ref!=\"\",\"\",IF(COUNTIF(preencher!#ref!,preencher!#ref!)=0,CONCATENATE(preencher!#ref!,#REF!),preencher!#ref!))","v":{"$error":"#NAME?"}},{"$f":"IF(preencher!#ref!=\"\",\"\",IF(COUNTIF(preencher!#ref!,preencher!#ref!)=0,CONCATENATE(preencher!#ref!,#REF!),preencher!#ref!))","v":{"$error":"#NAME?"}},{"$f":"IF(preencher!#ref!=\"\",\"\",IF(COUNTIF(preencher!#ref!,preencher!#ref!)=0,CONCATENATE(preencher!#ref!,#REF!),preencher!#ref!))","v":{"$error":"#NAME?"}},{"$f":"IF(preencher!#ref!=\"\",\"\",IF(COUNTIF(preencher!#ref!,preencher!#ref!)=0,CONCATENATE(preencher!#ref!,#REF!),preencher!#ref!))","v":{"$error":"#NAME?"}},{"$f":"IF(preencher!#ref!=\"\",\"\",IF(COUNTIF(preencher!#ref!,preencher!#ref!)=0,CONCATENATE(preencher!#ref!,#REF!),preencher!#ref!))","v":{"$error":"#NAME?"}},{"$f":"IF(preencher!#ref!=\"\",\"\",IF(COUNTIF(preencher!#ref!,preencher!#ref!)=0,CONCATENATE(preencher!#ref!,#REF!),preencher!#ref!))","v":{"$error":"#NAME?"}},{"$f":"IF(preencher!#ref!=\"\",\"\",IF(COUNTIF(preencher!#ref!,preencher!#ref!)=0,CONCATENATE(preencher!#ref!,#REF!),preencher!#ref!))","v":{"$error":"#NAME?"}},{"$f":"IF(preencher!#ref!=\"\",\"\",IF(COUNTIF(preencher!#ref!,preencher!#ref!)=0,CONCATENATE(preencher!#ref!,#REF!),preencher!#ref!))","v":{"$error":"#NAME?"}},{"$f":"IF(preencher!#ref!=\"\",\"\",IF(COUNTIF(preencher!#ref!,preencher!#ref!)=0,CONCATENATE(preencher!#ref!,#REF!),preencher!#ref!))","v":{"$error":"#NAME?"}},{"$f":"IF(preencher!#ref!=\"\",\"\",IF(COUNTIF(preencher!#ref!,preencher!#ref!)=0,CONCATENATE(preencher!#ref!,#REF!),preencher!#ref!))","v":{"$error":"#NAME?"}},{"$f":"IF(ISERROR(ROUND(AVERAGE(E18:N18),2)),\"\",ROUND(AVERAGE(E18:N18),2))","v":""},{"$f":"IF(ISERROR(ROUND(O18*D18,2)),\"\",ROUND(O18*D18,2))","v":""},null,null,{"$f":"IF(ISERROR(MEDIAN(E18:N18)),\"\",MEDIAN(E18:N18))","v":""},{"$f":"IF(ISERROR(STDEV(E18:N18)),\"\",STDEV(E18:N18))","v":""},{"$f":"IF(ISERROR(T18/O18),\"\",T18/O18)","v":""}]
[{"$f":"IF(preencher!#ref!=\"\",\"\",preencher!#ref!)","v":{"$error":"#NAME?"}},{"$f":"IF(preencher!#ref!=\"\",\"\",preencher!#ref!)","v":{"$error":"#NAME?"}},{"$f":"IF(preencher!#ref!=\"\",\"\",preencher!#ref!)","v":{"$error":"#NAME?"}},{"$f":"IF(preencher!#ref!=\"\",\"\",preencher!#ref!)","v":{"$error":"#NAME?"}},{"$f":"IF(preencher!#ref!=\"\",\"\",IF(COUNTIF(preencher!#ref!,preencher!#ref!)=0,CONCATENATE(preencher!#ref!,#REF!),preencher!#ref!))","v":{"$error":"#NAME?"}},{"$f":"IF(preencher!#ref!=\"\",\"\",IF(COUNTIF(preencher!#ref!,preencher!#ref!)=0,CONCATENATE(preencher!#ref!,#REF!),preencher!#ref!))","v":{"$error":"#NAME?"}},{"$f":"IF(preencher!#ref!=\"\",\"\",IF(COUNTIF(preencher!#ref!,preencher!#ref!)=0,CONCATENATE(preencher!#ref!,#REF!),preencher!#ref!))","v":{"$error":"#NAME?"}},{"$f":"IF(preencher!#ref!=\"\",\"\",IF(COUNTIF(preencher!#ref!,preencher!#ref!)=0,CONCATENATE(preencher!#ref!,#REF!),preencher!#ref!))","v":{"$error":"#NAME?"}},{"$f":"IF(preencher!#ref!=\"\",\"\",IF(COUNTIF(preencher!#ref!,preencher!#ref!)=0,CONCATENATE(preencher!#ref!,#REF!),preencher!#ref!))","v":{"$error":"#NAME?"}},{"$f":"IF(preencher!#ref!=\"\",\"\",IF(COUNTIF(preencher!#ref!,preencher!#ref!)=0,CONCATENATE(preencher!#ref!,#REF!),preencher!#ref!))","v":{"$error":"#NAME?"}},{"$f":"IF(preencher!#ref!=\"\",\"\",IF(COUNTIF(preencher!#ref!,preencher!#ref!)=0,CONCATENATE(preencher!#ref!,#REF!),preencher!#ref!))","v":{"$error":"#NAME?"}},{"$f":"IF(preencher!#ref!=\"\",\"\",IF(COUNTIF(preencher!#ref!,preencher!#ref!)=0,CONCATENATE(preencher!#ref!,#REF!),preencher!#ref!))","v":{"$error":"#NAME?"}},{"$f":"IF(preencher!#ref!=\"\",\"\",IF(COUNTIF(preencher!#ref!,preencher!#ref!)=0,CONCATENATE(preencher!#ref!,#REF!),preencher!#ref!))","v":{"$error":"#NAME?"}},{"$f":"IF(preencher!#ref!=\"\",\"\",IF(COUNTIF(preencher!#ref!,preencher!#ref!)=0,CONCATENATE(preencher!#ref!,#REF!),preencher!#ref!))","v":{"$error":"#NAME?"}},{"$f":"IF(ISERROR(ROUND(AVERAGE(E19:N19),2)),\"\",ROUND(AVERAGE(E19:N19),2))","v":""},{"$f":"IF(ISERROR(ROUND(O19*D19,2)),\"\",ROUND(O19*D19,2))","v":""},null,null,{"$f":"IF(ISERROR(MEDIAN(E19:N19)),\"\",MEDIAN(E19:N19))","v":""},{"$f":"IF(ISERROR(STDEV(E19:N19)),\"\",STDEV(E19:N19))","v":""},{"$f":"IF(ISERROR(T19/O19),\"\",T19/O19)","v":""}]
[{"$f":"IF(preencher!#ref!=\"\",\"\",preencher!#ref!)","v":{"$error":"#NAME?"}},{"$f":"IF(preencher!#ref!=\"\",\"\",preencher!#ref!)","v":{"$error":"#NAME?"}},{"$f":"IF(preencher!#ref!=\"\",\"\",preencher!#ref!)","v":{"$error":"#NAME?"}},{"$f":"IF(preencher!#ref!=\"\",\"\",preencher!#ref!)","v":{"$error":"#NAME?"}},{"$f":"IF(preencher!#ref!=\"\",\"\",IF(COUNTIF(preencher!#ref!,preencher!#ref!)=0,CONCATENATE(preencher!#ref!,#REF!),preencher!#ref!))","v":{"$error":"#NAME?"}},{"$f":"IF(preencher!#ref!=\"\",\"\",IF(COUNTIF(preencher!#ref!,preencher!#ref!)=0,CONCATENATE(preencher!#ref!,#REF!),preencher!#ref!))","v":{"$error":"#NAME?"}},{"$f":"IF(preencher!#ref!=\"\",\"\",IF(COUNTIF(preencher!#ref!,preencher!#ref!)=0,CONCATENATE(preencher!#ref!,#REF!),preencher!#ref!))","v":{"$error":"#NAME?"}},{"$f":"IF(preencher!#ref!=\"\",\"\",IF(COUNTIF(preencher!#ref!,preencher!#ref!)=0,CONCATENATE(preencher!#ref!,#REF!),preencher!#ref!))","v":{"$error":"#NAME?"}},{"$f":"IF(preencher!#ref!=\"\",\"\",IF(COUNTIF(preencher!#ref!,preencher!#ref!)=0,CONCATENATE(preencher!#ref!,#REF!),preencher!#ref!))","v":{"$error":"#NAME?"}},{"$f":"IF(preencher!#ref!=\"\",\"\",IF(COUNTIF(preencher!#ref!,preencher!#ref!)=0,CONCATENATE(preencher!#ref!,#REF!),preencher!#ref!))","v":{"$error":"#NAME?"}},{"$f":"IF(preencher!#ref!=\"\",\"\",IF(COUNTIF(preencher!#ref!,preencher!#ref!)=0,CONCATENATE(preencher!#ref!,#REF!),preencher!#ref!))","v":{"$error":"#NAME?"}},{"$f":"IF(preencher!#ref!=\"\",\"\",IF(COUNTIF(preencher!#ref!,preencher!#ref!)=0,CONCATENATE(preencher!#ref!,#REF!),preencher!#ref!))","v":{"$error":"#NAME?"}},{"$f":"IF(preencher!#ref!=\"\",\"\",IF(COUNTIF(preencher!#ref!,preencher!#ref!)=0,CONCATENATE(preencher!#ref!,#REF!),preencher!#ref!))","v":{"$error":"#NAME?"}},{"$f":"IF(preencher!#ref!=\"\",\"\",IF(COUNTIF(preencher!#ref!,preencher!#ref!)=0,CONCATENATE(preencher!#ref!,#REF!),preencher!#ref!))","v":{"$error":"#NAME?"}},{"$f":"IF(ISERROR(ROUND(AVERAGE(E20:N20),2)),\"\",ROUND(AVERAGE(E20:N20),2))","v":""},{"$f":"IF(ISERROR(ROUND(O20*D20,2)),\"\",ROUND(O20*D20,2))","v":""},null,null,{"$f":"IF(ISERROR(MEDIAN(E20:N20)),\"\",MEDIAN(E20:N20))","v":""},{"$f":"IF(ISERROR(STDEV(E20:N20)),\"\",STDEV(E20:N20))","v":""},{"$f":"IF(ISERROR(T20/O20),\"\",T20/O20)","v":""}]
[{"$f":"IF(preencher!#ref!=\"\",\"\",preencher!#ref!)","v":{"$error":"#NAME?"}},{"$f":"IF(preencher!#ref!=\"\",\"\",preencher!#ref!)","v":{"$error":"#NAME?"}},{"$f":"IF(preencher!#ref!=\"\",\"\",preencher!#ref!)","v":{"$error":"#NAME?"}},{"$f":"IF(preencher!#ref!=\"\",\"\",preencher!#ref!)","v":{"$error":"#NAME?"}},{"$f":"IF(preencher!#ref!=\"\",\"\",IF(COUNTIF(preencher!#ref!,preencher!#ref!)=0,CONCATENATE(preencher!#ref!,#REF!),preencher!#ref!))","v":{"$error":"#NAME?"}},{"$f":"IF(preencher!#ref!=\"\",\"\",IF(COUNTIF(preencher!#ref!,preencher!#ref!)=0,CONCATENATE(preencher!#ref!,#REF!),preencher!#ref!))","v":{"$error":"#NAME?"}},{"$f":"IF(preencher!#ref!=\"\",\"\",IF(COUNTIF(preencher!#ref!,preencher!#ref!)=0,CONCATENATE(preencher!#ref!,#REF!),preencher!#ref!))","v":{"$error":"#NAME?"}},{"$f":"IF(preencher!#ref!=\"\",\"\",IF(COUNTIF(preencher!#ref!,preencher!#ref!)=0,CONCATENATE(preencher!#ref!,#REF!),preencher!#ref!))","v":{"$error":"#NAME?"}},{"$f":"IF(preencher!#ref!=\"\",\"\",IF(COUNTIF(preencher!#ref!,preencher!#ref!)=0,CONCATENATE(preencher!#ref!,#REF!),preencher!#ref!))","v":{"$error":"#NAME?"}},{"$f":"IF(preencher!#ref!=\"\",\"\",IF(COUNTIF(preencher!#ref!,preencher!#ref!)=0,CONCATENATE(preencher!#ref!,#REF!),preencher!#ref!))","v":{"$error":"#NAME?"}},{"$f":"IF(preencher!#ref!=\"\",\"\",IF(COUNTIF(preencher!#ref!,preencher!#ref!)=0,CONCATENATE(preencher!#ref!,#REF!),preencher!#ref!))","v":{"$error":"#NAME?"}},{"$f":"IF(preencher!#ref!=\"\",\"\",IF(COUNTIF(preencher!#ref!,preencher!#ref!)=0,CONCATENATE(preencher!#ref!,#REF!),preencher!#ref!))","v":{"$error":"#NAME?"}},{"$f":"IF(preencher!#ref!=\"\",\"\",IF(COUNTIF(preencher!#ref!,preencher!#ref!)=0,CONCATENATE(preencher!#ref!,#REF!),preencher!#ref!))","v":{"$error":"#NAME?"}},{"$f":"IF(preencher!#ref!=\"\",\"\",IF(COUNTIF(preencher!#ref!,preencher!#ref!)=0,CONCATENATE(preencher!#ref!,#REF!),preencher!#ref!))","v":{"$error":"#NAME?"}},{"$f":"IF(ISERROR(ROUND(AVERAGE(E21:N21),2)),\"\",ROUND(AVERAGE(E21:N21),2))","v":""},{"$f":"IF(ISERROR(ROUND(O21*D21,2)),\"\",ROUND(O21*D21,2))","v":""},null,null,{"$f":"IF(ISERROR(MEDIAN(E21:N21)),\"\",MEDIAN(E21:N21))","v":""},{"$f":"IF(ISERROR(STDEV(E21:N21)),\"\",STDEV(E21:N21))","v":""},{"$f":"IF(ISERROR(T21/O21),\"\",T21/O21)","v":""}]
[{"$f":"IF(preencher!#ref!=\"\",\"\",preencher!#ref!)","v":{"$error":"#NAME?"}},{"$f":"IF(preencher!#ref!=\"\",\"\",preencher!#ref!)","v":{"$error":"#NAME?"}},{"$f":"IF(preencher!#ref!=\"\",\"\",preencher!#ref!)","v":{"$error":"#NAME?"}},{"$f":"IF(preencher!#ref!=\"\",\"\",preencher!#ref!)","v":{"$error":"#NAME?"}},{"$f":"IF(preencher!#ref!=\"\",\"\",IF(COUNTIF(preencher!#ref!,preencher!#ref!)=0,CONCATENATE(preencher!#ref!,#REF!),preencher!#ref!))","v":{"$error":"#NAME?"}},{"$f":"IF(preencher!#ref!=\"\",\"\",IF(COUNTIF(preencher!#ref!,preencher!#ref!)=0,CONCATENATE(preencher!#ref!,#REF!),preencher!#ref!))","v":{"$error":"#NAME?"}},{"$f":"IF(preencher!#ref!=\"\",\"\",IF(COUNTIF(preencher!#ref!,preencher!#ref!)=0,CONCATENATE(preencher!#ref!,#REF!),preencher!#ref!))","v":{"$error":"#NAME?"}},{"$f":"IF(preencher!#ref!=\"\",\"\",IF(COUNTIF(preencher!#ref!,preencher!#ref!)=0,CONCATENATE(preencher!#ref!,#REF!),preencher!#ref!))","v":{"$error":"#NAME?"}},{"$f":"IF(preencher!#ref!=\"\",\"\",IF(COUNTIF(preencher!#ref!,preencher!#ref!)=0,CONCATENATE(preencher!#ref!,#REF!),preencher!#ref!))","v":{"$error":"#NAME?"}},{"$f":"IF(preencher!#ref!=\"\",\"\",IF(COUNTIF(preencher!#ref!,preencher!#ref!)=0,CONCATENATE(preencher!#ref!,#REF!),preencher!#ref!))","v":{"$error":"#NAME?"}},{"$f":"IF(preencher!#ref!=\"\",\"\",IF(COUNTIF(preencher!#ref!,preencher!#ref!)=0,CONCATENATE(preencher!#ref!,#REF!),preencher!#ref!))","v":{"$error":"#NAME?"}},{"$f":"IF(preencher!#ref!=\"\",\"\",IF(COUNTIF(preencher!#ref!,preencher!#ref!)=0,CONCATENATE(preencher!#ref!,#REF!),preencher!#ref!))","v":{"$error":"#NAME?"}},{"$f":"IF(preencher!#ref!=\"\",\"\",IF(COUNTIF(preencher!#ref!,preencher!#ref!)=0,CONCATENATE(preencher!#ref!,#REF!),preencher!#ref!))","v":{"$error":"#NAME?"}},{"$f":"IF(preencher!#ref!=\"\",\"\",IF(COUNTIF(preencher!#ref!,preencher!#ref!)=0,CONCATENATE(preencher!#ref!,#REF!),preencher!#ref!))","v":{"$error":"#NAME?"}},{"$f":"IF(ISERROR(ROUND(AVERAGE(E22:N22),2)),\"\",ROUND(AVERAGE(E22:N22),2))","v":""},{"$f":"IF(ISERROR(ROUND(O22*D22,2)),\"\",ROUND(O22*D22,2))","v":""},null,null,{"$f":"IF(ISERROR(MEDIAN(E22:N22)),\"\",MEDIAN(E22:N22))","v":""},{"$f":"IF(ISERROR(STDEV(E22:N22)),\"\",STDEV(E22:N22))","v":""},{"$f":"IF(ISERROR(T22/O22),\"\",T22/O22)","v":""}]
[{"$f":"IF(preencher!#ref!=\"\",\"\",preencher!#ref!)","v":{"$error":"#NAME?"}},{"$f":"IF(preencher!#ref!=\"\",\"\",preencher!#ref!)","v":{"$error":"#NAME?"}},{"$f":"IF(preencher!#ref!=\"\",\"\",preencher!#ref!)","v":{"$error":"#NAME?"}},{"$f":"IF(preencher!#ref!=\"\",\"\",preencher!#ref!)","v":{"$error":"#NAME?"}},{"$f":"IF(preencher!#ref!=\"\",\"\",IF(COUNTIF(preencher!#ref!,preencher!#ref!)=0,CONCATENATE(preencher!#ref!,#REF!),preencher!#ref!))","v":{"$error":"#NAME?"}},{"$f":"IF(preencher!#ref!=\"\",\"\",IF(COUNTIF(preencher!#ref!,preencher!#ref!)=0,CONCATENATE(preencher!#ref!,#REF!),preencher!#ref!))","v":{"$error":"#NAME?"}},{"$f":"IF(preencher!#ref!=\"\",\"\",IF(COUNTIF(preencher!#ref!,preencher!#ref!)=0,CONCATENATE(preencher!#ref!,#REF!),preencher!#ref!))","v":{"$error":"#NAME?"}},{"$f":"IF(preencher!#ref!=\"\",\"\",IF(COUNTIF(preencher!#ref!,preencher!#ref!)=0,CONCATENATE(preencher!#ref!,#REF!),preencher!#ref!))","v":{"$error":"#NAME?"}},{"$f":"IF(preencher!#ref!=\"\",\"\",IF(COUNTIF(preencher!#ref!,preencher!#ref!)=0,CONCATENATE(preencher!#ref!,#REF!),preencher!#ref!))","v":{"$error":"#NAME?"}},{"$f":"IF(preencher!#ref!=\"\",\"\",IF(COUNTIF(preencher!#ref!,preencher!#ref!)=0,CONCATENATE(preencher!#ref!,#REF!),preencher!#ref!))","v":{"$error":"#NAME?"}},{"$f":"IF(preencher!#ref!=\"\",\"\",IF(COUNTIF(preencher!#ref!,preencher!#ref!)=0,CONCATENATE(preencher!#ref!,#REF!),preencher!#ref!))","v":{"$error":"#NAME?"}},{"$f":"IF(preencher!#ref!=\"\",\"\",IF(COUNTIF(preencher!#ref!,preencher!#ref!)=0,CONCATENATE(preencher!#ref!,#REF!),preencher!#ref!))","v":{"$error":"#NAME?"}},{"$f":"IF(preencher!#ref!=\"\",\"\",IF(COUNTIF(preencher!#ref!,preencher!#ref!)=0,CONCATENATE(preencher!#ref!,#REF!),preencher!#ref!))","v":{"$error":"#NAME?"}},{"$f":"IF(preencher!#ref!=\"\",\"\",IF(COUNTIF(preencher!#ref!,preencher!#ref!)=0,CONCATENATE(preencher!#ref!,#REF!),preencher!#ref!))","v":{"$error":"#NAME?"}},{"$f":"IF(ISERROR(ROUND(AVERAGE(E23:N23),2)),\"\",ROUND(AVERAGE(E23:N23),2))","v":""},{"$f":"IF(ISERROR(ROUND(O23*D23,2)),\"\",ROUND(O23*D23,2))","v":""},null,null,{"$f":"IF(ISERROR(MEDIAN(E23:N23)),\"\",MEDIAN(E23:N23))","v":""},{"$f":"IF(ISERROR(STDEV(E23:N23)),\"\",STDEV(E23:N23))","v":""},{"$f":"IF(ISERROR(T23/O23),\"\",T23/O23)","v":""}]
[{"$f":"IF(preencher!#ref!=\"\",\"\",preencher!#ref!)","v":{"$error":"#NAME?"}},{"$f":"IF(preencher!#ref!=\"\",\"\",preencher!#ref!)","v":{"$error":"#NAME?"}},{"$f":"IF(preencher!#ref!=\"\",\"\",preencher!#ref!)","v":{"$error":"#NAME?"}},{"$f":"IF(preencher!#ref!=\"\",\"\",preencher!#ref!)","v":{"$error":"#NAME?"}},{"$f":"IF(preencher!#ref!=\"\",\"\",IF(COUNTIF(preencher!#ref!,preencher!#ref!)=0,CONCATENATE(preencher!#ref!,#REF!),preencher!#ref!))","v":{"$error":"#NAME?"}},{"$f":"IF(preencher!#ref!=\"\",\"\",IF(COUNTIF(preencher!#ref!,preencher!#ref!)=0,CONCATENATE(preencher!#ref!,#REF!),preencher!#ref!))","v":{"$error":"#NAME?"}},{"$f":"IF(preencher!#ref!=\"\",\"\",IF(COUNTIF(preencher!#ref!,preencher!#ref!)=0,CONCATENATE(preencher!#ref!,#REF!),preencher!#ref!))","v":{"$error":"#NAME?"}},{"$f":"IF(preencher!#ref!=\"\",\"\",IF(COUNTIF(preencher!#ref!,preencher!#ref!)=0,CONCATENATE(preencher!#ref!,#REF!),preencher!#ref!))","v":{"$error":"#NAME?"}},{"$f":"IF(preencher!#ref!=\"\",\"\",IF(COUNTIF(preencher!#ref!,preencher!#ref!)=0,CONCATENATE(preencher!#ref!,#REF!),preencher!#ref!))","v":{"$error":"#NAME?"}},{"$f":"IF(preencher!#ref!=\"\",\"\",IF(COUNTIF(preencher!#ref!,preencher!#ref!)=0,CONCATENATE(preencher!#ref!,#REF!),preencher!#ref!))","v":{"$error":"#NAME?"}},{"$f":"IF(preencher!#ref!=\"\",\"\",IF(COUNTIF(preencher!#ref!,preencher!#ref!)=0,CONCATENATE(preencher!#ref!,#REF!),preencher!#ref!))","v":{"$error":"#NAME?"}},{"$f":"IF(preencher!#ref!=\"\",\"\",IF(COUNTIF(preencher!#ref!,preencher!#ref!)=0,CONCATENATE(preencher!#ref!,#REF!),preencher!#ref!))","v":{"$error":"#NAME?"}},{"$f":"IF(preencher!#ref!=\"\",\"\",IF(COUNTIF(preencher!#ref!,preencher!#ref!)=0,CONCATENATE(preencher!#ref!,#REF!),preencher!#ref!))","v":{"$error":"#NAME?"}},{"$f":"IF(preencher!#ref!=\"\",\"\",IF(COUNTIF(preencher!#ref!,preencher!#ref!)=0,CONCATENATE(preencher!#ref!,#REF!),preencher!#ref!))","v":{"$error":"#NAME?"}},{"$f":"IF(ISERROR(ROUND(AVERAGE(E24:N24),2)),\"\",ROUND(AVERAGE(E24:N24),2))","v":""},{"$f":"IF(ISERROR(ROUND(O24*D24,2)),\"\",ROUND(O24*D24,2))","v":""},null,null,{"$f":"IF(ISERROR(MEDIAN(E24:N24)),\"\",MEDIAN(E24:N24))","v":""},{"$f":"IF(ISERROR(STDEV(E24:N24)),\"\",STDEV(E24:N24))","v":""},{"$f":"IF(ISERROR(T24/O24),\"\",T24/O24)","v":""}]
[{"$f":"IF(preencher!#ref!=\"\",\"\",preencher!#ref!)","v":{"$error":"#NAME?"}},{"$f":"IF(preencher!#ref!=\"\",\"\",preencher!#ref!)","v":{"$error":"#NAME?"}},{"$f":"IF(preencher!#ref!=\"\",\"\",preencher!#ref!)","v":{"$error":"#NAME?"}},{"$f":"IF(preencher!#ref!=\"\",\"\",preencher!#ref!)","v":{"$error":"#NAME?"}},{"$f":"IF(preencher!#ref!=\"\",\"\",IF(COUNTIF(preencher!#ref!,preencher!#ref!)=0,CONCATENATE(preencher!#ref!,#REF!),preencher!#ref!))","v":{"$error":"#NAME?"}},{"$f":"IF(preencher!#ref!=\"\",\"\",IF(COUNTIF(preencher!#ref!,preencher!#ref!)=0,CONCATENATE(preencher!#ref!,#REF!),preencher!#ref!))","v":{"$error":"#NAME?"}},{"$f":"IF(preencher!#ref!=\"\",\"\",IF(COUNTIF(preencher!#ref!,preencher!#ref!)=0,CONCATENATE(preencher!#ref!,#REF!),preencher!#ref!))","v":{"$error":"#NAME?"}},{"$f":"IF(preencher!#ref!=\"\",\"\",IF(COUNTIF(preencher!#ref!,preencher!#ref!)=0,CONCATENATE(preencher!#ref!,#REF!),preencher!#ref!))","v":{"$error":"#NAME?"}},{"$f":"IF(preencher!#ref!=\"\",\"\",IF(COUNTIF(preencher!#ref!,preencher!#ref!)=0,CONCATENATE(preencher!#ref!,#REF!),preencher!#ref!))","v":{"$error":"#NAME?"}},{"$f":"IF(preencher!#ref!=\"\",\"\",IF(COUNTIF(preencher!#ref!,preencher!#ref!)=0,CONCATENATE(preencher!#ref!,#REF!),preencher!#ref!))","v":{"$error":"#NAME?"}},{"$f":"IF(preencher!#ref!=\"\",\"\",IF(COUNTIF(preencher!#ref!,preencher!#ref!)=0,CONCATENATE(preencher!#ref!,#REF!),preencher!#ref!))","v":{"$error":"#NAME?"}},{"$f":"IF(preencher!#ref!=\"\",\"\",IF(COUNTIF(preencher!#ref!,preencher!#ref!)=0,CONCATENATE(preencher!#ref!,#REF!),preencher!#ref!))","v":{"$error":"#NAME?"}},{"$f":"IF(preencher!#ref!=\"\",\"\",IF(COUNTIF(preencher!#ref!,preencher!#ref!)=0,CONCATENATE(preencher!#ref!,#REF!),preencher!#ref!))","v":{"$error":"#NAME?"}},{"$f":"IF(preencher!#ref!=\"\",\"\",IF(COUNTIF(preencher!#ref!,preencher!#ref!)=0,CONCATENATE(preencher!#ref!,#REF!),preencher!#ref!))","v":{"$error":"#NAME?"}},{"$f":"IF(ISERROR(ROUND(AVERAGE(E25:N25),2)),\"\",ROUND(AVERAGE(E25:N25),2))","v":""},{"$f":"IF(ISERROR(ROUND(O25*D25,2)),\"\",ROUND(O25*D25,2))","v":""},null,null,{"$f":"IF(ISERROR(MEDIAN(E25:N25)),\"\",MEDIAN(E25:N25))","v":""},{"$f":"IF(ISERROR(STDEV(E25:N25)),\"\",STDEV(E25:N25))","v":""},{"$f":"IF(ISERROR(T25/O25),\"\",T25/O25)","v":""}]
[{"$f":"IF(preencher!#ref!=\"\",\"\",preencher!#ref!)","v":{"$error":"#NAME?"}},{"$f":"IF(preencher!#ref!=\"\",\"\",preencher!#ref!)","v":{"$error":"#NAME?"}},{"$f":"IF(preencher!#ref!=\"\",\"\",preencher!#ref!)","v":{"$error":"#NAME?"}},{"$f":"IF(preencher!#ref!=\"\",\"\",preencher!#ref!)","v":{"$error":"#NAME?"}},{"$f":"IF(preencher!#ref!=\"\",\"\",IF(COUNTIF(preencher!#ref!,preencher!#ref!)=0,CONCATENATE(preencher!#ref!,#REF!),preencher!#ref!))","v":{"$error":"#NAME?"}},{"$f":"IF(preencher!#ref!=\"\",\"\",IF(COUNTIF(preencher!#ref!,preencher!#ref!)=0,CONCATENATE(preencher!#ref!,#REF!),preencher!#ref!))","v":{"$error":"#NAME?"}},{"$f":"IF(preencher!#ref!=\"\",\"\",IF(COUNTIF(preencher!#ref!,preencher!#ref!)=0,CONCATENATE(preencher!#ref!,#REF!),preencher!#ref!))","v":{"$error":"#NAME?"}},{"$f":"IF(preencher!#ref!=\"\",\"\",IF(COUNTIF(preencher!#ref!,preencher!#ref!)=0,CONCATENATE(preencher!#ref!,#REF!),preencher!#ref!))","v":{"$error":"#NAME?"}},{"$f":"IF(preencher!#ref!=\"\",\"\",IF(COUNTIF(preencher!#ref!,preencher!#ref!)=0,CONCATENATE(preencher!#ref!,#REF!),preencher!#ref!))","v":{"$error":"#NAME?"}},{"$f":"IF(preencher!#ref!=\"\",\"\",IF(COUNTIF(preencher!#ref!,preencher!#ref!)=0,CONCATENATE(preencher!#ref!,#REF!),preencher!#ref!))","v":{"$error":"#NAME?"}},{"$f":"IF(preencher!#ref!=\"\",\"\",IF(COUNTIF(preencher!#ref!,preencher!#ref!)=0,CONCATENATE(preencher!#ref!,#REF!),preencher!#ref!))","v":{"$error":"#NAME?"}},{"$f":"IF(preencher!#ref!=\"\",\"\",IF(COUNTIF(preencher!#ref!,preencher!#ref!)=0,CONCATENATE(preencher!#ref!,#REF!),preencher!#ref!))","v":{"$error":"#NAME?"}},{"$f":"IF(preencher!#ref!=\"\",\"\",IF(COUNTIF(preencher!#ref!,preencher!#ref!)=0,CONCATENATE(preencher!#ref!,#REF!),preencher!#ref!))","v":{"$error":"#NAME?"}},{"$f":"IF(preencher!#ref!=\"\",\"\",IF(COUNTIF(preencher!#ref!,preencher!#ref!)=0,CONCATENATE(preencher!#ref!,#REF!),preencher!#ref!))","v":{"$error":"#NAME?"}},{"$f":"IF(ISERROR(ROUND(AVERAGE(E26:N26),2)),\"\",ROUND(AVERAGE(E26:N26),2))","v":""},{"$f":"IF(ISERROR(ROUND(O26*D26,2)),\"\",ROUND(O26*D26,2))","v":""},null,null,{"$f":"IF(ISERROR(MEDIAN(E26:N26)),\"\",MEDIAN(E26:N26))","v":""},{"$f":"IF(ISERROR(STDEV(E26:N26)),\"\",STDEV(E26:N26))","v":""},{"$f":"IF(ISERROR(T26/O26),\"\",T26/O26)","v":""}]
[{"$f":"IF(preencher!#ref!=\"\",\"\",preencher!#ref!)","v":{"$error":"#NAME?"}},{"$f":"IF(preencher!#ref!=\"\",\"\",preencher!#ref!)","v":{"$error":"#NAME?"}},{"$f":"IF(preencher!#ref!=\"\",\"\",preencher!#ref!)","v":{"$error":"#NAME?"}},{"$f":"IF(preencher!#ref!=\"\",\"\",preencher!#ref!)","v":{"$error":"#NAME?"}},{"$f":"IF(preencher!#ref!=\"\",\"\",IF(COUNTIF(preencher!#ref!,preencher!#ref!)=0,CONCATENATE(preencher!#ref!,#REF!),preencher!#ref!))","v":{"$error":"#NAME?"}},{"$f":"IF(preencher!#ref!=\"\",\"\",IF(COUNTIF(preencher!#ref!,preencher!#ref!)=0,CONCATENATE(preencher!#ref!,#REF!),preencher!#ref!))","v":{"$error":"#NAME?"}},{"$f":"IF(preencher!#ref!=\"\",\"\",IF(COUNTIF(preencher!#ref!,preencher!#ref!)=0,CONCATENATE(preencher!#ref!,#REF!),preencher!#ref!))","v":{"$error":"#NAME?"}},{"$f":"IF(preencher!#ref!=\"\",\"\",IF(COUNTIF(preencher!#ref!,preencher!#ref!)=0,CONCATENATE(preencher!#ref!,#REF!),preencher!#ref!))","v":{"$error":"#NAME?"}},{"$f":"IF(preencher!#ref!=\"\",\"\",IF(COUNTIF(preencher!#ref!,preencher!#ref!)=0,CONCATENATE(preencher!#ref!,#REF!),preencher!#ref!))","v":{"$error":"#NAME?"}},{"$f":"IF(preencher!#ref!=\"\",\"\",IF(COUNTIF(preencher!#ref!,preencher!#ref!)=0,CONCATENATE(preencher!#ref!,#REF!),preencher!#ref!))","v":{"$error":"#NAME?"}},{"$f":"IF(preencher!#ref!=\"\",\"\",IF(COUNTIF(preencher!#ref!,preencher!#ref!)=0,CONCATENATE(preencher!#ref!,#REF!),preencher!#ref!))","v":{"$error":"#NAME?"}},{"$f":"IF(preencher!#ref!=\"\",\"\",IF(COUNTIF(preencher!#ref!,preencher!#ref!)=0,CONCATENATE(preencher!#ref!,#REF!),preencher!#ref!))","v":{"$error":"#NAME?"}},{"$f":"IF(preencher!#ref!=\"\",\"\",IF(COUNTIF(preencher!#ref!,preencher!#ref!)=0,CONCATENATE(preencher!#ref!,#REF!),preencher!#ref!))","v":{"$error":"#NAME?"}},{"$f":"IF(preencher!#ref!=\"\",\"\",IF(COUNTIF(preencher!#ref!,preencher!#ref!)=0,CONCATENATE(preencher!#ref!,#REF!),preencher!#ref!))","v":{"$error":"#NAME?"}},{"$f":"IF(ISERROR(ROUND(AVERAGE(E27:N27),2)),\"\",ROUND(AVERAGE(E27:N27),2))","v":""},{"$f":"IF(ISERROR(ROUND(O27*D27,2)),\"\",ROUND(O27*D27,2))","v":""},null,null,{"$f":"IF(ISERROR(MEDIAN(E27:N27)),\"\",MEDIAN(E27:N27))","v":""},{"$f":"IF(ISERROR(STDEV(E27:N27)),\"\",STDEV(E27:N27))","v":""},{"$f":"IF(ISERROR(T27/O27),\"\",T27/O27)","v":""}]
[{"$f":"IF(preencher!#ref!=\"\",\"\",preencher!#ref!)","v":{"$error":"#NAME?"}},{"$f":"IF(preencher!#ref!=\"\",\"\",preencher!#ref!)","v":{"$error":"#NAME?"}},{"$f":"IF(preencher!#ref!=\"\",\"\",preencher!#ref!)","v":{"$error":"#NAME?"}},{"$f":"IF(preencher!#ref!=\"\",\"\",preencher!#ref!)","v":{"$error":"#NAME?"}},{"$f":"IF(preencher!#ref!=\"\",\"\",IF(COUNTIF(preencher!#ref!,preencher!#ref!)=0,CONCATENATE(preencher!#ref!,#REF!),preencher!#ref!))","v":{"$error":"#NAME?"}},{"$f":"IF(preencher!#ref!=\"\",\"\",IF(COUNTIF(preencher!#ref!,preencher!#ref!)=0,CONCATENATE(preencher!#ref!,#REF!),preencher!#ref!))","v":{"$error":"#NAME?"}},{"$f":"IF(preencher!#ref!=\"\",\"\",IF(COUNTIF(preencher!#ref!,preencher!#ref!)=0,CONCATENATE(preencher!#ref!,#REF!),preencher!#ref!))","v":{"$error":"#NAME?"}},{"$f":"IF(preencher!#ref!=\"\",\"\",IF(COUNTIF(preencher!#ref!,preencher!#ref!)=0,CONCATENATE(preencher!#ref!,#REF!),preencher!#ref!))","v":{"$error":"#NAME?"}},{"$f":"IF(preencher!#ref!=\"\",\"\",IF(COUNTIF(preencher!#ref!,preencher!#ref!)=0,CONCATENATE(preencher!#ref!,#REF!),preencher!#ref!))","v":{"$error":"#NAME?"}},{"$f":"IF(preencher!#ref!=\"\",\"\",IF(COUNTIF(preencher!#ref!,preencher!#ref!)=0,CONCATENATE(preencher!#ref!,#REF!),preencher!#ref!))","v":{"$error":"#NAME?"}},{"$f":"IF(preencher!#ref!=\"\",\"\",IF(COUNTIF(preencher!#ref!,preencher!#ref!)=0,CONCATENATE(preencher!#ref!,#REF!),preencher!#ref!))","v":{"$error":"#NAME?"}},{"$f":"IF(preencher!#ref!=\"\",\"\",IF(COUNTIF(preencher!#ref!,preencher!#ref!)=0,CONCATENATE(preencher!#ref!,#REF!),preencher!#ref!))","v":{"$error":"#NAME?"}},{"$f":"IF(preencher!#ref!=\"\",\"\",IF(COUNTIF(preencher!#ref!,preencher!#ref!)=0,CONCATENATE(preencher!#ref!,#REF!),preencher!#ref!))","v":{"$error":"#NAME?"}},{"$f":"IF(preencher!#ref!=\"\",\"\",IF(COUNTIF(preencher!#ref!,preencher!#ref!)=0,CONCATENATE(preencher!#ref!,#REF!),preencher!#ref!))","v":{"$error":"#NAME?"}},{"$f":"IF(ISERROR(ROUND(AVERAGE(E28:N28),2)),\"\",ROUND(AVERAGE(E28:N28),2))","v":""},{"$f":"IF(ISERROR(ROUND(O28*D28,2)),\"\",ROUND(O28*D28,2))","v":""},null,null,{"$f":"IF(ISERROR(MEDIAN(E28:N28)),\"\",MEDIAN(E28:N28))","v":""},{"$f":"IF(ISERROR(STDEV(E28:N28)),\"\",STDEV(E28:N28))","v":""},{"$f":"IF(ISERROR(T28/O28),\"\",T28/O28)","v":""}]
[{"$f":"IF(preencher!#ref!=\"\",\"\",preencher!#ref!)","v":{"$error":"#NAME?"}},{"$f":"IF(preencher!#ref!=\"\",\"\",preencher!#ref!)","v":{"$error":"#NAME?"}},{"$f":"IF(preencher!#ref!=\"\",\"\",preencher!#ref!)","v":{"$error":"#NAME?"}},{"$f":"IF(preencher!#ref!=\"\",\"\",preencher!#ref!)","v":{"$error":"#NAME?"}},{"$f":"IF(preencher!#ref!=\"\",\"\",IF(COUNTIF(preencher!#ref!,preencher!#ref!)=0,CONCATENATE(preencher!#ref!,#REF!),preencher!#ref!))","v":{"$error":"#NAME?"}},{"$f":"IF(preencher!#ref!=\"\",\"\",IF(COUNTIF(preencher!#ref!,preencher!#ref!)=0,CONCATENATE(preencher!#ref!,#REF!),preencher!#ref!))","v":{"$error":"#NAME?"}},{"$f":"IF(preencher!#ref!=\"\",\"\",IF(COUNTIF(preencher!#ref!,preencher!#ref!)=0,CONCATENATE(preencher!#ref!,#REF!),preencher!#ref!))","v":{"$error":"#NAME?"}},{"$f":"IF(preencher!#ref!=\"\",\"\",IF(COUNTIF(preencher!#ref!,preencher!#ref!)=0,CONCATENATE(preencher!#ref!,#REF!),preencher!#ref!))","v":{"$error":"#NAME?"}},{"$f":"IF(preencher!#ref!=\"\",\"\",IF(COUNTIF(preencher!#ref!,preencher!#ref!)=0,CONCATENATE(preencher!#ref!,#REF!),preencher!#ref!))","v":{"$error":"#NAME?"}},{"$f":"IF(preencher!#ref!=\"\",\"\",IF(COUNTIF(preencher!#ref!,preencher!#ref!)=0,CONCATENATE(preencher!#ref!,#REF!),preencher!#ref!))","v":{"$error":"#NAME?"}},{"$f":"IF(preencher!#ref!=\"\",\"\",IF(COUNTIF(preencher!#ref!,preencher!#ref!)=0,CONCATENATE(preencher!#ref!,#REF!),preencher!#ref!))","v":{"$error":"#NAME?"}},{"$f":"IF(preencher!#ref!=\"\",\"\",IF(COUNTIF(preencher!#ref!,preencher!#ref!)=0,CONCATENATE(preencher!#ref!,#REF!),preencher!#ref!))","v":{"$error":"#NAME?"}},{"$f":"IF(preencher!#ref!=\"\",\"\",IF(COUNTIF(preencher!#ref!,preencher!#ref!)=0,CONCATENATE(preencher!#ref!,#REF!),preencher!#ref!))","v":{"$error":"#NAME?"}},{"$f":"IF(preencher!#ref!=\"\",\"\",IF(COUNTIF(preencher!#ref!,preencher!#ref!)=0,CONCATENATE(preencher!#ref!,#REF!),preencher!#ref!))","v":{"$error":"#NAME?"}},{"$f":"IF(ISERROR(ROUND(AVERAGE(E29:N29),2)),\"\",ROUND(AVERAGE(E29:N29),2))","v":""},{"$f":"IF(ISERROR(ROUND(O29*D29,2)),\"\",ROUND(O29*D29,2))","v":""},null,null,{"$f":"IF(ISERROR(MEDIAN(E29:N29)),\"\",MEDIAN(E29:N29))","v":""},{"$f":"IF(ISERROR(STDEV(E29:N29)),\"\",STDEV(E29:N29))","v":""},{"$f":"IF(ISERROR(T29/O29),\"\",T29/O29)","v":""}]
[{"$f":"IF(preencher!#ref!=\"\",\"\",preencher!#ref!)","v":{"$error":"#NAME?"}},{"$f":"IF(preencher!#ref!=\"\",\"\",preencher!#ref!)","v":{"$error":"#NAME?"}},{"$f":"IF(preencher!#ref!=\"\",\"\",preencher!#ref!)","v":{"$error":"#NAME?"}},{"$f":"IF(preencher!#ref!=\"\",\"\",preencher!#ref!)","v":{"$error":"#NAME?"}},{"$f":"IF(preencher!#ref!=\"\",\"\",IF(COUNTIF(preencher!#ref!,preencher!#ref!)=0,CONCATENATE(preencher!#ref!,#REF!),preencher!#ref!))","v":{"$error":"#NAME?"}},{"$f":"IF(preencher!#ref!=\"\",\"\",IF(COUNTIF(preencher!#ref!,preencher!#ref!)=0,CONCATENATE(preencher!#ref!,#REF!),preencher!#ref!))","v":{"$error":"#NAME?"}},{"$f":"IF(preencher!#ref!=\"\",\"\",IF(COUNTIF(preencher!#ref!,preencher!#ref!)=0,CONCATENATE(preencher!#ref!,#REF!),preencher!#ref!))","v":{"$error":"#NAME?"}},{"$f":"IF(preencher!#ref!=\"\",\"\",IF(COUNTIF(preencher!#ref!,preencher!#ref!)=0,CONCATENATE(preencher!#ref!,#REF!),preencher!#ref!))","v":{"$error":"#NAME?"}},{"$f":"IF(preencher!#ref!=\"\",\"\",IF(COUNTIF(preencher!#ref!,preencher!#ref!)=0,CONCATENATE(preencher!#ref!,#REF!),preencher!#ref!))","v":{"$error":"#NAME?"}},{"$f":"IF(preencher!#ref!=\"\",\"\",IF(COUNTIF(preencher!#ref!,preencher!#ref!)=0,CONCATENATE(preencher!#ref!,#REF!),preencher!#ref!))","v":{"$error":"#NAME?"}},{"$f":"IF(preencher!#ref!=\"\",\"\",IF(COUNTIF(preencher!#ref!,preencher!#ref!)=0,CONCATENATE(preencher!#ref!,#REF!),preencher!#ref!))","v":{"$error":"#NAME?"}},{"$f":"IF(preencher!#ref!=\"\",\"\",IF(COUNTIF(preencher!#ref!,preencher!#ref!)=0,CONCATENATE(preencher!#ref!,#REF!),preencher!#ref!))","v":{"$error":"#NAME?"}},{"$f":"IF(preencher!#ref!=\"\",\"\",IF(COUNTIF(preencher!#ref!,preencher!#ref!)=0,CONCATENATE(preencher!#ref!,#REF!),preencher!#ref!))","v":{"$error":"#NAME?"}},{"$f":"IF(preencher!#ref!=\"\",\"\",IF(COUNTIF(preencher!#ref!,preencher!#ref!)=0,CONCATENATE(preencher!#ref!,#REF!),preencher!#ref!))","v":{"$error":"#NAME?"}},{"$f":"IF(ISERROR(ROUND(AVERAGE(E30:N30),2)),\"\",ROUND(AVERAGE(E30:N30),2))","v":""},{"$f":"IF(ISERROR(ROUND(O30*D30,2)),\"\",ROUND(O30*D30,2))","v":""},null,null,{"$f":"IF(ISERROR(MEDIAN(E30:N30)),\"\",MEDIAN(E30:N30))","v":""},{"$f":"IF(ISERROR(STDEV(E30:N30)),\"\",STDEV(E30:N30))","v":""},{"$f":"IF(ISERROR(T30/O30),\"\",T30/O30)","v":""}]
[{"$f":"IF(preencher!#ref!=\"\",\"\",preencher!#ref!)","v":{"$error":"#NAME?"}},{"$f":"IF(preencher!#ref!=\"\",\"\",preencher!#ref!)","v":{"$error":"#NAME?"}},{"$f":"IF(preencher!#ref!=\"\",\"\",preencher!#ref!)","v":{"$error":"#NAME?"}},{"$f":"IF(preencher!#ref!=\"\",\"\",preencher!#ref!)","v":{"$error":"#NAME?"}},{"$f":"IF(preencher!#ref!=\"\",\"\",IF(COUNTIF(preencher!#ref!,preencher!#ref!)=0,CONCATENATE(preencher!#ref!,#REF!),preencher!#ref!))","v":{"$error":"#NAME?"}},{"$f":"IF(preencher!#ref!=\"\",\"\",IF(COUNTIF(preencher!#ref!,preencher!#ref!)=0,CONCATENATE(preencher!#ref!,#REF!),preencher!#ref!))","v":{"$error":"#NAME?"}},{"$f":"IF(preencher!#ref!=\"\",\"\",IF(COUNTIF(preencher!#ref!,preencher!#ref!)=0,CONCATENATE(preencher!#ref!,#REF!),preencher!#ref!))","v":{"$error":"#NAME?"}},{"$f":"IF(preencher!#ref!=\"\",\"\",IF(COUNTIF(preencher!#ref!,preencher!#ref!)=0,CONCATENATE(preencher!#ref!,#REF!),preencher!#ref!))","v":{"$error":"#NAME?"}},{"$f":"IF(preencher!#ref!=\"\",\"\",IF(COUNTIF(preencher!#ref!,preencher!#ref!)=0,CONCATENATE(preencher!#ref!,#REF!),preencher!#ref!))","v":{"$error":"#NAME?"}},{"$f":"IF(preencher!#ref!=\"\",\"\",IF(COUNTIF(preencher!#ref!,preencher!#ref!)=0,CONCATENATE(preencher!#ref!,#REF!),preencher!#ref!))","v":{"$error":"#NAME?"}},{"$f":"IF(preencher!#ref!=\"\",\"\",IF(COUNTIF(preencher!#ref!,preencher!#ref!)=0,CONCATENATE(preencher!#ref!,#REF!),preencher!#ref!))","v":{"$error":"#NAME?"}},{"$f":"IF(preencher!#ref!=\"\",\"\",IF(COUNTIF(preencher!#ref!,preencher!#ref!)=0,CONCATENATE(preencher!#ref!,#REF!),preencher!#ref!))","v":{"$error":"#NAME?"}},{"$f":"IF(preencher!#ref!=\"\",\"\",IF(COUNTIF(preencher!#ref!,preencher!#ref!)=0,CONCATENATE(preencher!#ref!,#REF!),preencher!#ref!))","v":{"$error":"#NAME?"}},{"$f":"IF(preencher!#ref!=\"\",\"\",IF(COUNTIF(preencher!#ref!,preencher!#ref!)=0,CONCATENATE(preencher!#ref!,#REF!),preencher!#ref!))","v":{"$error":"#NAME?"}},{"$f":"IF(ISERROR(ROUND(AVERAGE(E31:N31),2)),\"\",ROUND(AVERAGE(E31:N31),2))","v":""},{"$f":"IF(ISERROR(ROUND(O31*D31,2)),\"\",ROUND(O31*D31,2))","v":""},null,null,{"$f":"IF(ISERROR(MEDIAN(E31:N31)),\"\",MEDIAN(E31:N31))","v":""},{"$f":"IF(ISERROR(STDEV(E31:N31)),\"\",STDEV(E31:N31))","v":""},{"$f":"IF(ISERROR(T31/O31),\"\",T31/O31)","v":""}]
[{"$f":"IF(preencher!#ref!=\"\",\"\",preencher!#ref!)","v":{"$error":"#NAME?"}},{"$f":"IF(preencher!#ref!=\"\",\"\",preencher!#ref!)","v":{"$error":"#NAME?"}},{"$f":"IF(preencher!#ref!=\"\",\"\",preencher!#ref!)","v":{"$error":"#NAME?"}},{"$f":"IF(preencher!#ref!=\"\",\"\",preencher!#ref!)","v":{"$error":"#NAME?"}},{"$f":"IF(preencher!#ref!=\"\",\"\",IF(COUNTIF(preencher!#ref!,preencher!#ref!)=0,CONCATENATE(preencher!#ref!,#REF!),preencher!#ref!))","v":{"$error":"#NAME?"}},{"$f":"IF(preencher!#ref!=\"\",\"\",IF(COUNTIF(preencher!#ref!,preencher!#ref!)=0,CONCATENATE(preencher!#ref!,#REF!),preencher!#ref!))","v":{"$error":"#NAME?"}},{"$f":"IF(preencher!#ref!=\"\",\"\",IF(COUNTIF(preencher!#ref!,preencher!#ref!)=0,CONCATENATE(preencher!#ref!,#REF!),preencher!#ref!))","v":{"$error":"#NAME?"}},{"$f":"IF(preencher!#ref!=\"\",\"\",IF(COUNTIF(preencher!#ref!,preencher!#ref!)=0,CONCATENATE(preencher!#ref!,#REF!),preencher!#ref!))","v":{"$error":"#NAME?"}},{"$f":"IF(preencher!#ref!=\"\",\"\",IF(COUNTIF(preencher!#ref!,preencher!#ref!)=0,CONCATENATE(preencher!#ref!,#REF!),preencher!#ref!))","v":{"$error":"#NAME?"}},{"$f":"IF(preencher!#ref!=\"\",\"\",IF(COUNTIF(preencher!#ref!,preencher!#ref!)=0,CONCATENATE(preencher!#ref!,#REF!),preencher!#ref!))","v":{"$error":"#NAME?"}},{"$f":"IF(preencher!#ref!=\"\",\"\",IF(COUNTIF(preencher!#ref!,preencher!#ref!)=0,CONCATENATE(preencher!#ref!,#REF!),preencher!#ref!))","v":{"$error":"#NAME?"}},{"$f":"IF(preencher!#ref!=\"\",\"\",IF(COUNTIF(preencher!#ref!,preencher!#ref!)=0,CONCATENATE(preencher!#ref!,#REF!),preencher!#ref!))","v":{"$error":"#NAME?"}},{"$f":"IF(preencher!#ref!=\"\",\"\",IF(COUNTIF(preencher!#ref!,preencher!#ref!)=0,CONCATENATE(preencher!#ref!,#REF!),preencher!#ref!))","v":{"$error":"#NAME?"}},{"$f":"IF(preencher!#ref!=\"\",\"\",IF(COUNTIF(preencher!#ref!,preencher!#ref!)=0,CONCATENATE(preencher!#ref!,#REF!),preencher!#ref!))","v":{"$error":"#NAME?"}},{"$f":"IF(ISERROR(ROUND(AVERAGE(E32:N32),2)),\"\",ROUND(AVERAGE(E32:N32),2))","v":""},{"$f":"IF(ISERROR(ROUND(O32*D32,2)),\"\",ROUND(O32*D32,2))","v":""},null,null,{"$f":"IF(ISERROR(MEDIAN(E32:N32)),\"\",MEDIAN(E32:N32))","v":""},{"$f":"IF(ISERROR(STDEV(E32:N32)),\"\",STDEV(E32:N32))","v":""},{"$f":"IF(ISERROR(T32/O32),\"\",T32/O32)","v":""}]
[{"$f":"IF(preencher!#ref!=\"\",\"\",preencher!#ref!)","v":{"$error":"#NAME?"}},{"$f":"IF(preencher!#ref!=\"\",\"\",preencher!#ref!)","v":{"$error":"#NAME?"}},{"$f":"IF(preencher!#ref!=\"\",\"\",preencher!#ref!)","v":{"$error":"#NAME?"}},{"$f":"IF(preencher!#ref!=\"\",\"\",preencher!#ref!)","v":{"$error":"#NAME?"}},{"$f":"IF(preencher!#ref!=\"\",\"\",IF(COUNTIF(preencher!#ref!,preencher!#ref!)=0,CONCATENATE(preencher!#ref!,#REF!),preencher!#ref!))","v":{"$error":"#NAME?"}},{"$f":"IF(preencher!#ref!=\"\",\"\",IF(COUNTIF(preencher!#ref!,preencher!#ref!)=0,CONCATENATE(preencher!#ref!,#REF!),preencher!#ref!))","v":{"$error":"#NAME?"}},{"$f":"IF(preencher!#ref!=\"\",\"\",IF(COUNTIF(preencher!#ref!,preencher!#ref!)=0,CONCATENATE(preencher!#ref!,#REF!),preencher!#ref!))","v":{"$error":"#NAME?"}},{"$f":"IF(preencher!#ref!=\"\",\"\",IF(COUNTIF(preencher!#ref!,preencher!#ref!)=0,CONCATENATE(preencher!#ref!,#REF!),preencher!#ref!))","v":{"$error":"#NAME?"}},{"$f":"IF(preencher!#ref!=\"\",\"\",IF(COUNTIF(preencher!#ref!,preencher!#ref!)=0,CONCATENATE(preencher!#ref!,#REF!),preencher!#ref!))","v":{"$error":"#NAME?"}},{"$f":"IF(preencher!#ref!=\"\",\"\",IF(COUNTIF(preencher!#ref!,preencher!#ref!)=0,CONCATENATE(preencher!#ref!,#REF!),preencher!#ref!))","v":{"$error":"#NAME?"}},{"$f":"IF(preencher!#ref!=\"\",\"\",IF(COUNTIF(preencher!#ref!,preencher!#ref!)=0,CONCATENATE(preencher!#ref!,#REF!),preencher!#ref!))","v":{"$error":"#NAME?"}},{"$f":"IF(preencher!#ref!=\"\",\"\",IF(COUNTIF(preencher!#ref!,preencher!#ref!)=0,CONCATENATE(preencher!#ref!,#REF!),preencher!#ref!))","v":{"$error":"#NAME?"}},{"$f":"IF(preencher!#ref!=\"\",\"\",IF(COUNTIF(preencher!#ref!,preencher!#ref!)=0,CONCATENATE(preencher!#ref!,#REF!),preencher!#ref!))","v":{"$error":"#NAME?"}},{"$f":"IF(preencher!#ref!=\"\",\"\",IF(COUNTIF(preencher!#ref!,preencher!#ref!)=0,CONCATENATE(preencher!#ref!,#REF!),preencher!#ref!))","v":{"$error":"#NAME?"}},{"$f":"IF(ISERROR(ROUND(AVERAGE(E33:N33),2)),\"\",ROUND(AVERAGE(E33:N33),2))","v":""},{"$f":"IF(ISERROR(ROUND(O33*D33,2)),\"\",ROUND(O33*D33,2))","v":""},null,null,{"$f":"IF(ISERROR(MEDIAN(E33:N33)),\"\",MEDIAN(E33:N33))","v":""},{"$f":"IF(ISERROR(STDEV(E33:N33)),\"\",STDEV(E33:N33))","v":""},{"$f":"IF(ISERROR(T33/O33),\"\",T33/O33)","v":""}]
[{"$f":"IF(preencher!#ref!=\"\",\"\",preencher!#ref!)","v":{"$error":"#NAME?"}},{"$f":"IF(preencher!#ref!=\"\",\"\",preencher!#ref!)","v":{"$error":"#NAME?"}},{"$f":"IF(preencher!#ref!=\"\",\"\",preencher!#ref!)","v":{"$error":"#NAME?"}},{"$f":"IF(preencher!#ref!=\"\",\"\",preencher!#ref!)","v":{"$error":"#NAME?"}},{"$f":"IF(preencher!#ref!=\"\",\"\",IF(COUNTIF(preencher!#ref!,preencher!#ref!)=0,CONCATENATE(preencher!#ref!,#REF!),preencher!#ref!))","v":{"$error":"#NAME?"}},{"$f":"IF(preencher!#ref!=\"\",\"\",IF(COUNTIF(preencher!#ref!,preencher!#ref!)=0,CONCATENATE(preencher!#ref!,#REF!),preencher!#ref!))","v":{"$error":"#NAME?"}},{"$f":"IF(preencher!#ref!=\"\",\"\",IF(COUNTIF(preencher!#ref!,preencher!#ref!)=0,CONCATENATE(preencher!#ref!,#REF!),preencher!#ref!))","v":{"$error":"#NAME?"}},{"$f":"IF(preencher!#ref!=\"\",\"\",IF(COUNTIF(preencher!#ref!,preencher!#ref!)=0,CONCATENATE(preencher!#ref!,#REF!),preencher!#ref!))","v":{"$error":"#NAME?"}},{"$f":"IF(preencher!#ref!=\"\",\"\",IF(COUNTIF(preencher!#ref!,preencher!#ref!)=0,CONCATENATE(preencher!#ref!,#REF!),preencher!#ref!))","v":{"$error":"#NAME?"}},{"$f":"IF(preencher!#ref!=\"\",\"\",IF(COUNTIF(preencher!#ref!,preencher!#ref!)=0,CONCATENATE(preencher!#ref!,#REF!),preencher!#ref!))","v":{"$error":"#NAME?"}},{"$f":"IF(preencher!#ref!=\"\",\"\",IF(COUNTIF(preencher!#ref!,preencher!#ref!)=0,CONCATENATE(preencher!#ref!,#REF!),preencher!#ref!))","v":{"$error":"#NAME?"}},{"$f":"IF(preencher!#ref!=\"\",\"\",IF(COUNTIF(preencher!#ref!,preencher!#ref!)=0,CONCATENATE(preencher!#ref!,#REF!),preencher!#ref!))","v":{"$error":"#NAME?"}},{"$f":"IF(preencher!#ref!=\"\",\"\",IF(COUNTIF(preencher!#ref!,preencher!#ref!)=0,CONCATENATE(preencher!#ref!,#REF!),preencher!#ref!))","v":{"$error":"#NAME?"}},{"$f":"IF(preencher!#ref!=\"\",\"\",IF(COUNTIF(preencher!#ref!,preencher!#ref!)=0,CONCATENATE(preencher!#ref!,#REF!),preencher!#ref!))","v":{"$error":"#NAME?"}},{"$f":"IF(ISERROR(ROUND(AVERAGE(E34:N34),2)),\"\",ROUND(AVERAGE(E34:N34),2))","v":""},{"$f":"IF(ISERROR(ROUND(O34*D34,2)),\"\",ROUND(O34*D34,2))","v":""},null,null,{"$f":"IF(ISERROR(MEDIAN(E34:N34)),\"\",MEDIAN(E34:N34))","v":""},{"$f":"IF(ISERROR(STDEV(E34:N34)),\"\",STDEV(E34:N34))","v":""},{"$f":"IF(ISERROR(T34/O34),\"\",T34/O34)","v":""}]
[{"$f":"IF(preencher!#ref!=\"\",\"\",preencher!#ref!)","v":{"$error":"#NAME?"}},{"$f":"IF(preencher!#ref!=\"\",\"\",preencher!#ref!)","v":{"$error":"#NAME?"}},{"$f":"IF(preencher!#ref!=\"\",\"\",preencher!#ref!)","v":{"$error":"#NAME?"}},{"$f":"IF(preencher!#ref!=\"\",\"\",preencher!#ref!)","v":{"$error":"#NAME?"}},{"$f":"IF(preencher!#ref!=\"\",\"\",IF(COUNTIF(preencher!#ref!,preencher!#ref!)=0,CONCATENATE(preencher!#ref!,#REF!),preencher!#ref!))","v":{"$error":"#NAME?"}},{"$f":"IF(preencher!#ref!=\"\",\"\",IF(COUNTIF(preencher!#ref!,preencher!#ref!)=0,CONCATENATE(preencher!#ref!,#REF!),preencher!#ref!))","v":{"$error":"#NAME?"}},{"$f":"IF(preencher!#ref!=\"\",\"\",IF(COUNTIF(preencher!#ref!,preencher!#ref!)=0,CONCATENATE(preencher!#ref!,#REF!),preencher!#ref!))","v":{"$error":"#NAME?"}},{"$f":"IF(preencher!#ref!=\"\",\"\",IF(COUNTIF(preencher!#ref!,preencher!#ref!)=0,CONCATENATE(preencher!#ref!,#REF!),preencher!#ref!))","v":{"$error":"#NAME?"}},{"$f":"IF(preencher!#ref!=\"\",\"\",IF(COUNTIF(preencher!#ref!,preencher!#ref!)=0,CONCATENATE(preencher!#ref!,#REF!),preencher!#ref!))","v":{"$error":"#NAME?"}},{"$f":"IF(preencher!#ref!=\"\",\"\",IF(COUNTIF(preencher!#ref!,preencher!#ref!)=0,CONCATENATE(preencher!#ref!,#REF!),preencher!#ref!))","v":{"$error":"#NAME?"}},{"$f":"IF(preencher!#ref!=\"\",\"\",IF(COUNTIF(preencher!#ref!,preencher!#ref!)=0,CONCATENATE(preencher!#ref!,#REF!),preencher!#ref!))","v":{"$error":"#NAME?"}},{"$f":"IF(preencher!#ref!=\"\",\"\",IF(COUNTIF(preencher!#ref!,preencher!#ref!)=0,CONCATENATE(preencher!#ref!,#REF!),preencher!#ref!))","v":{"$error":"#NAME?"}},{"$f":"IF(preencher!#ref!=\"\",\"\",IF(COUNTIF(preencher!#ref!,preencher!#ref!)=0,CONCATENATE(preencher!#ref!,#REF!),preencher!#ref!))","v":{"$error":"#NAME?"}},{"$f":"IF(preencher!#ref!=\"\",\"\",IF(COUNTIF(preencher!#ref!,preencher!#ref!)=0,CONCATENATE(preencher!#ref!,#REF!),preencher!#ref!))","v":{"$error":"#NAME?"}},{"$f":"IF(ISERROR(ROUND(AVERAGE(E35:N35),2)),\"\",ROUND(AVERAGE(E35:N35),2))","v":""},{"$f":"IF(ISERROR(ROUND(O35*D35,2)),\"\",ROUND(O35*D35,2))","v":""},null,null,{"$f":"IF(ISERROR(MEDIAN(E35:N35)),\"\",MEDIAN(E35:N35))","v":""},{"$f":"IF(ISERROR(STDEV(E35:N35)),\"\",STDEV(E35:N35))","v":""},{"$f":"IF(ISERROR(T35/O35),\"\",T35/O35)","v":""}]
[{"$f":"IF(preencher!#ref!=\"\",\"\",preencher!#ref!)","v":{"$error":"#NAME?"}},{"$f":"IF(preencher!#ref!=\"\",\"\",preencher!#ref!)","v":{"$error":"#NAME?"}},{"$f":"IF(preencher!#ref!=\"\",\"\",preencher!#ref!)","v":{"$error":"#NAME?"}},{"$f":"IF(preencher!#ref!=\"\",\"\",preencher!#ref!)","v":{"$error":"#NAME?"}},{"$f":"IF(preencher!#ref!=\"\",\"\",IF(COUNTIF(preencher!#ref!,preencher!#ref!)=0,CONCATENATE(preencher!#ref!,#REF!),preencher!#ref!))","v":{"$error":"#NAME?"}},{"$f":"IF(preencher!#ref!=\"\",\"\",IF(COUNTIF(preencher!#ref!,preencher!#ref!)=0,CONCATENATE(preencher!#ref!,#REF!),preencher!#ref!))","v":{"$error":"#NAME?"}},{"$f":"IF(preencher!#ref!=\"\",\"\",IF(COUNTIF(preencher!#ref!,preencher!#ref!)=0,CONCATENATE(preencher!#ref!,#REF!),preencher!#ref!))","v":{"$error":"#NAME?"}},{"$f":"IF(preencher!#ref!=\"\",\"\",IF(COUNTIF(preencher!#ref!,preencher!#ref!)=0,CONCATENATE(preencher!#ref!,#REF!),preencher!#ref!))","v":{"$error":"#NAME?"}},{"$f":"IF(preencher!#ref!=\"\",\"\",IF(COUNTIF(preencher!#ref!,preencher!#ref!)=0,CONCATENATE(preencher!#ref!,#REF!),preencher!#ref!))","v":{"$error":"#NAME?"}},{"$f":"IF(preencher!#ref!=\"\",\"\",IF(COUNTIF(preencher!#ref!,preencher!#ref!)=0,CONCATENATE(preencher!#ref!,#REF!),preencher!#ref!))","v":{"$error":"#NAME?"}},{"$f":"IF(preencher!#ref!=\"\",\"\",IF(COUNTIF(preencher!#ref!,preencher!#ref!)=0,CONCATENATE(preencher!#ref!,#REF!),preencher!#ref!))","v":{"$error":"#NAME?"}},{"$f":"IF(preencher!#ref!=\"\",\"\",IF(COUNTIF(preencher!#ref!,preencher!#ref!)=0,CONCATENATE(preencher!#ref!,#REF!),preencher!#ref!))","v":{"$error":"#NAME?"}},{"$f":"IF(preencher!#ref!=\"\",\"\",IF(COUNTIF(preencher!#ref!,preencher!#ref!)=0,CONCATENATE(preencher!#ref!,#REF!),preencher!#ref!))","v":{"$error":"#NAME?"}},{"$f":"IF(preencher!#ref!=\"\",\"\",IF(COUNTIF(preencher!#ref!,preencher!#ref!)=0,CONCATENATE(preencher!#ref!,#REF!),preencher!#ref!))","v":{"$error":"#NAME?"}},{"$f":"IF(ISERROR(ROUND(AVERAGE(E36:N36),2)),\"\",ROUND(AVERAGE(E36:N36),2))","v":""},{"$f":"IF(ISERROR(ROUND(O36*D36,2)),\"\",ROUND(O36*D36,2))","v":""},null,null,{"$f":"IF(ISERROR(MEDIAN(E36:N36)),\"\",MEDIAN(E36:N36))","v":""},{"$f":"IF(ISERROR(STDEV(E36:N36)),\"\",STDEV(E36:N36))","v":""},{"$f":"IF(ISERROR(T36/O36),\"\",T36/O36)","v":""}]
[{"$f":"IF(preencher!#ref!=\"\",\"\",preencher!#ref!)","v":{"$error":"#NAME?"}},{"$f":"IF(preencher!#ref!=\"\",\"\",preencher!#ref!)","v":{"$error":"#NAME?"}},{"$f":"IF(preencher!#ref!=\"\",\"\",preencher!#ref!)","v":{"$error":"#NAME?"}},{"$f":"IF(preencher!#ref!=\"\",\"\",preencher!#ref!)","v":{"$error":"#NAME?"}},{"$f":"IF(preencher!#ref!=\"\",\"\",IF(COUNTIF(preencher!#ref!,preencher!#ref!)=0,CONCATENATE(preencher!#ref!,#REF!),preencher!#ref!))","v":{"$error":"#NAME?"}},{"$f":"IF(preencher!#ref!=\"\",\"\",IF(COUNTIF(preencher!#ref!,preencher!#ref!)=0,CONCATENATE(preencher!#ref!,#REF!),preencher!#ref!))","v":{"$error":"#NAME?"}},{"$f":"IF(preencher!#ref!=\"\",\"\",IF(COUNTIF(preencher!#ref!,preencher!#ref!)=0,CONCATENATE(preencher!#ref!,#REF!),preencher!#ref!))","v":{"$error":"#NAME?"}},{"$f":"IF(preencher!#ref!=\"\",\"\",IF(COUNTIF(preencher!#ref!,preencher!#ref!)=0,CONCATENATE(preencher!#ref!,#REF!),preencher!#ref!))","v":{"$error":"#NAME?"}},{"$f":"IF(preencher!#ref!=\"\",\"\",IF(COUNTIF(preencher!#ref!,preencher!#ref!)=0,CONCATENATE(preencher!#ref!,#REF!),preencher!#ref!))","v":{"$error":"#NAME?"}},{"$f":"IF(preencher!#ref!=\"\",\"\",IF(COUNTIF(preencher!#ref!,preencher!#ref!)=0,CONCATENATE(preencher!#ref!,#REF!),preencher!#ref!))","v":{"$error":"#NAME?"}},{"$f":"IF(preencher!#ref!=\"\",\"\",IF(COUNTIF(preencher!#ref!,preencher!#ref!)=0,CONCATENATE(preencher!#ref!,#REF!),preencher!#ref!))","v":{"$error":"#NAME?"}},{"$f":"IF(preencher!#ref!=\"\",\"\",IF(COUNTIF(preencher!#ref!,preencher!#ref!)=0,CONCATENATE(preencher!#ref!,#REF!),preencher!#ref!))","v":{"$error":"#NAME?"}},{"$f":"IF(preencher!#ref!=\"\",\"\",IF(COUNTIF(preencher!#ref!,preencher!#ref!)=0,CONCATENATE(preencher!#ref!,#REF!),preencher!#ref!))","v":{"$error":"#NAME?"}},{"$f":"IF(preencher!#ref!=\"\",\"\",IF(COUNTIF(preencher!#ref!,preencher!#ref!)=0,CONCATENATE(preencher!#ref!,#REF!),preencher!#ref!))","v":{"$error":"#NAME?"}},{"$f":"IF(ISERROR(ROUND(AVERAGE(E37:N37),2)),\"\",ROUND(AVERAGE(E37:N37),2))","v":""},{"$f":"IF(ISERROR(ROUND(O37*D37,2)),\"\",ROUND(O37*D37,2))","v":""},null,null,{"$f":"IF(ISERROR(MEDIAN(E37:N37)),\"\",MEDIAN(E37:N37))","v":""},{"$f":"IF(ISERROR(STDEV(E37:N37)),\"\",STDEV(E37:N37))","v":""},{"$f":"IF(ISERROR(T37/O37),\"\",T37/O37)","v":""}]
[{"$f":"IF(preencher!#ref!=\"\",\"\",preencher!#ref!)","v":{"$error":"#NAME?"}},{"$f":"IF(preencher!#ref!=\"\",\"\",preencher!#ref!)","v":{"$error":"#NAME?"}},{"$f":"IF(preencher!#ref!=\"\",\"\",preencher!#ref!)","v":{"$error":"#NAME?"}},{"$f":"IF(preencher!#ref!=\"\",\"\",preencher!#ref!)","v":{"$error":"#NAME?"}},{"$f":"IF(preencher!#ref!=\"\",\"\",IF(COUNTIF(preencher!#ref!,preencher!#ref!)=0,CONCATENATE(preencher!#ref!,#REF!),preencher!#ref!))","v":{"$error":"#NAME?"}},{"$f":"IF(preencher!#ref!=\"\",\"\",IF(COUNTIF(preencher!#ref!,preencher!#ref!)=0,CONCATENATE(preencher!#ref!,#REF!),preencher!#ref!))","v":{"$error":"#NAME?"}},{"$f":"IF(preencher!#ref!=\"\",\"\",IF(COUNTIF(preencher!#ref!,preencher!#ref!)=0,CONCATENATE(preencher!#ref!,#REF!),preencher!#ref!))","v":{"$error":"#NAME?"}},{"$f":"IF(preencher!#ref!=\"\",\"\",IF(COUNTIF(preencher!#ref!,preencher!#ref!)=0,CONCATENATE(preencher!#ref!,#REF!),preencher!#ref!))","v":{"$error":"#NAME?"}},{"$f":"IF(preencher!#ref!=\"\",\"\",IF(COUNTIF(preencher!#ref!,preencher!#ref!)=0,CONCATENATE(preencher!#ref!,#REF!),preencher!#ref!))","v":{"$error":"#NAME?"}},{"$f":"IF(preencher!#ref!=\"\",\"\",IF(COUNTIF(preencher!#ref!,preencher!#ref!)=0,CONCATENATE(preencher!#ref!,#REF!),preencher!#ref!))","v":{"$error":"#NAME?"}},{"$f":"IF(preencher!#ref!=\"\",\"\",IF(COUNTIF(preencher!#ref!,preencher!#ref!)=0,CONCATENATE(preencher!#ref!,#REF!),preencher!#ref!))","v":{"$error":"#NAME?"}},{"$f":"IF(preencher!#ref!=\"\",\"\",IF(COUNTIF(preencher!#ref!,preencher!#ref!)=0,CONCATENATE(preencher!#ref!,#REF!),preencher!#ref!))","v":{"$error":"#NAME?"}},{"$f":"IF(preencher!#ref!=\"\",\"\",IF(COUNTIF(preencher!#ref!,preencher!#ref!)=0,CONCATENATE(preencher!#ref!,#REF!),preencher!#ref!))","v":{"$error":"#NAME?"}},{"$f":"IF(preencher!#ref!=\"\",\"\",IF(COUNTIF(preencher!#ref!,preencher!#ref!)=0,CONCATENATE(preencher!#ref!,#REF!),preencher!#ref!))","v":{"$error":"#NAME?"}},{"$f":"IF(ISERROR(ROUND(AVERAGE(E38:N38),2)),\"\",ROUND(AVERAGE(E38:N38),2))","v":""},{"$f":"IF(ISERROR(ROUND(O38*D38,2)),\"\",ROUND(O38*D38,2))","v":""},null,null,{"$f":"IF(ISERROR(MEDIAN(E38:N38)),\"\",MEDIAN(E38:N38))","v":""},{"$f":"IF(ISERROR(STDEV(E38:N38)),\"\",STDEV(E38:N38))","v":""},{"$f":"IF(ISERROR(T38/O38),\"\",T38/O38)","v":""}]
[{"$f":"IF(preencher!#ref!=\"\",\"\",preencher!#ref!)","v":{"$error":"#NAME?"}},{"$f":"IF(preencher!#ref!=\"\",\"\",preencher!#ref!)","v":{"$error":"#NAME?"}},{"$f":"IF(preencher!#ref!=\"\",\"\",preencher!#ref!)","v":{"$error":"#NAME?"}},{"$f":"IF(preencher!#ref!=\"\",\"\",preencher!#ref!)","v":{"$error":"#NAME?"}},{"$f":"IF(preencher!#ref!=\"\",\"\",IF(COUNTIF(preencher!#ref!,preencher!#ref!)=0,CONCATENATE(preencher!#ref!,#REF!),preencher!#ref!))","v":{"$error":"#NAME?"}},{"$f":"IF(preencher!#ref!=\"\",\"\",IF(COUNTIF(preencher!#ref!,preencher!#ref!)=0,CONCATENATE(preencher!#ref!,#REF!),preencher!#ref!))","v":{"$error":"#NAME?"}},{"$f":"IF(preencher!#ref!=\"\",\"\",IF(COUNTIF(preencher!#ref!,preencher!#ref!)=0,CONCATENATE(preencher!#ref!,#REF!),preencher!#ref!))","v":{"$error":"#NAME?"}},{"$f":"IF(preencher!#ref!=\"\",\"\",IF(COUNTIF(preencher!#ref!,preencher!#ref!)=0,CONCATENATE(preencher!#ref!,#REF!),preencher!#ref!))","v":{"$error":"#NAME?"}},{"$f":"IF(preencher!#ref!=\"\",\"\",IF(COUNTIF(preencher!#ref!,preencher!#ref!)=0,CONCATENATE(preencher!#ref!,#REF!),preencher!#ref!))","v":{"$error":"#NAME?"}},{"$f":"IF(preencher!#ref!=\"\",\"\",IF(COUNTIF(preencher!#ref!,preencher!#ref!)=0,CONCATENATE(preencher!#ref!,#REF!),preencher!#ref!))","v":{"$error":"#NAME?"}},{"$f":"IF(preencher!#ref!=\"\",\"\",IF(COUNTIF(preencher!#ref!,preencher!#ref!)=0,CONCATENATE(preencher!#ref!,#REF!),preencher!#ref!))","v":{"$error":"#NAME?"}},{"$f":"IF(preencher!#ref!=\"\",\"\",IF(COUNTIF(preencher!#ref!,preencher!#ref!)=0,CONCATENATE(preencher!#ref!,#REF!),preencher!#ref!))","v":{"$error":"#NAME?"}},{"$f":"IF(preencher!#ref!=\"\",\"\",IF(COUNTIF(preencher!#ref!,preencher!#ref!)=0,CONCATENATE(preencher!#ref!,#REF!),preencher!#ref!))","v":{"$error":"#NAME?"}},{"$f":"IF(preencher!#ref!=\"\",\"\",IF(COUNTIF(preencher!#ref!,preencher!#ref!)=0,CONCATENATE(preencher!#ref!,#REF!),preencher!#ref!))","v":{"$error":"#NAME?"}},{"$f":"IF(ISERROR(ROUND(AVERAGE(E39:N39),2)),\"\",ROUND(AVERAGE(E39:N39),2))","v":""},{"$f":"IF(ISERROR(ROUND(O39*D39,2)),\"\",ROUND(O39*D39,2))","v":""},null,null,{"$f":"IF(ISERROR(MEDIAN(E39:N39)),\"\",MEDIAN(E39:N39))","v":""},{"$f":"IF(ISERROR(STDEV(E39:N39)),\"\",STDEV(E39:N39))","v":""},{"$f":"IF(ISERROR(T39/O39),\"\",T39/O39)","v":""}]
[{"$f":"IF(preencher!#ref!=\"\",\"\",preencher!#ref!)","v":{"$error":"#NAME?"}},{"$f":"IF(preencher!#ref!=\"\",\"\",preencher!#ref!)","v":{"$error":"#NAME?"}},{"$f":"IF(preencher!#ref!=\"\",\"\",preencher!#ref!)","v":{"$error":"#NAME?"}},{"$f":"IF(preencher!#ref!=\"\",\"\",preencher!#ref!)","v":{"$error":"#NAME?"}},{"$f":"IF(preencher!#ref!=\"\",\"\",IF(COUNTIF(preencher!#ref!,preencher!#ref!)=0,CONCATENATE(preencher!#ref!,#REF!),preencher!#ref!))","v":{"$error":"#NAME?"}},{"$f":"IF(preencher!#ref!=\"\",\"\",IF(COUNTIF(preencher!#ref!,preencher!#ref!)=0,CONCATENATE(preencher!#ref!,#REF!),preencher!#ref!))","v":{"$error":"#NAME?"}},{"$f":"IF(preencher!#ref!=\"\",\"\",IF(COUNTIF(preencher!#ref!,preencher!#ref!)=0,CONCATENATE(preencher!#ref!,#REF!),preencher!#ref!))","v":{"$error":"#NAME?"}},{"$f":"IF(preencher!#ref!=\"\",\"\",IF(COUNTIF(preencher!#ref!,preencher!#ref!)=0,CONCATENATE(preencher!#ref!,#REF!),preencher!#ref!))","v":{"$error":"#NAME?"}},{"$f":"IF(preencher!#ref!=\"\",\"\",IF(COUNTIF(preencher!#ref!,preencher!#ref!)=0,CONCATENATE(preencher!#ref!,#REF!),preencher!#ref!))","v":{"$error":"#NAME?"}},{"$f":"IF(preencher!#ref!=\"\",\"\",IF(COUNTIF(preencher!#ref!,preencher!#ref!)=0,CONCATENATE(preencher!#ref!,#REF!),preencher!#ref!))","v":{"$error":"#NAME?"}},{"$f":"IF(preencher!#ref!=\"\",\"\",IF(COUNTIF(preencher!#ref!,preencher!#ref!)=0,CONCATENATE(preencher!#ref!,#REF!),preencher!#ref!))","v":{"$error":"#NAME?"}},{"$f":"IF(preencher!#ref!=\"\",\"\",IF(COUNTIF(preencher!#ref!,preencher!#ref!)=0,CONCATENATE(preencher!#ref!,#REF!),preencher!#ref!))","v":{"$error":"#NAME?"}},{"$f":"IF(preencher!#ref!=\"\",\"\",IF(COUNTIF(preencher!#ref!,preencher!#ref!)=0,CONCATENATE(preencher!#ref!,#REF!),preencher!#ref!))","v":{"$error":"#NAME?"}},{"$f":"IF(preencher!#ref!=\"\",\"\",IF(COUNTIF(preencher!#ref!,preencher!#ref!)=0,CONCATENATE(preencher!#ref!,#REF!),preencher!#ref!))","v":{"$error":"#NAME?"}},{"$f":"IF(ISERROR(ROUND(AVERAGE(E40:N40),2)),\"\",ROUND(AVERAGE(E40:N40),2))","v":""},{"$f":"IF(ISERROR(ROUND(O40*D40,2)),\"\",ROUND(O40*D40,2))","v":""},null,null,{"$f":"IF(ISERROR(MEDIAN(E40:N40)),\"\",MEDIAN(E40:N40))","v":""},{"$f":"IF(ISERROR(STDEV(E40:N40)),\"\",STDEV(E40:N40))","v":""},{"$f":"IF(ISERROR(T40/O40),\"\",T40/O40)","v":""}]
[{"$f":"IF(preencher!#ref!=\"\",\"\",preencher!#ref!)","v":{"$error":"#NAME?"}},{"$f":"IF(preencher!#ref!=\"\",\"\",preencher!#ref!)","v":{"$error":"#NAME?"}},{"$f":"IF(preencher!#ref!=\"\",\"\",preencher!#ref!)","v":{"$error":"#NAME?"}},{"$f":"IF(preencher!#ref!=\"\",\"\",preencher!#ref!)","v":{"$error":"#NAME?"}},{"$f":"IF(preencher!#ref!=\"\",\"\",IF(COUNTIF(preencher!#ref!,preencher!#ref!)=0,CONCATENATE(preencher!#ref!,#REF!),preencher!#ref!))","v":{"$error":"#NAME?"}},{"$f":"IF(preencher!#ref!=\"\",\"\",IF(COUNTIF(preencher!#ref!,preencher!#ref!)=0,CONCATENATE(preencher!#ref!,#REF!),preencher!#ref!))","v":{"$error":"#NAME?"}},{"$f":"IF(preencher!#ref!=\"\",\"\",IF(COUNTIF(preencher!#ref!,preencher!#ref!)=0,CONCATENATE(preencher!#ref!,#REF!),preencher!#ref!))","v":{"$error":"#NAME?"}},{"$f":"IF(preencher!#ref!=\"\",\"\",IF(COUNTIF(preencher!#ref!,preencher!#ref!)=0,CONCATENATE(preencher!#ref!,#REF!),preencher!#ref!))","v":{"$error":"#NAME?"}},{"$f":"IF(preencher!#ref!=\"\",\"\",IF(COUNTIF(preencher!#ref!,preencher!#ref!)=0,CONCATENATE(preencher!#ref!,#REF!),preencher!#ref!))","v":{"$error":"#NAME?"}},{"$f":"IF(preencher!#ref!=\"\",\"\",IF(COUNTIF(preencher!#ref!,preencher!#ref!)=0,CONCATENATE(preencher!#ref!,#REF!),preencher!#ref!))","v":{"$error":"#NAME?"}},{"$f":"IF(preencher!#ref!=\"\",\"\",IF(COUNTIF(preencher!#ref!,preencher!#ref!)=0,CONCATENATE(preencher!#ref!,#REF!),preencher!#ref!))","v":{"$error":"#NAME?"}},{"$f":"IF(preencher!#ref!=\"\",\"\",IF(COUNTIF(preencher!#ref!,preencher!#ref!)=0,CONCATENATE(preencher!#ref!,#REF!),preencher!#ref!))","v":{"$error":"#NAME?"}},{"$f":"IF(preencher!#ref!=\"\",\"\",IF(COUNTIF(preencher!#ref!,preencher!#ref!)=0,CONCATENATE(preencher!#ref!,#REF!),preencher!#ref!))","v":{"$error":"#NAME?"}},{"$f":"IF(preencher!#ref!=\"\",\"\",IF(COUNTIF(preencher!#ref!,preencher!#ref!)=0,CONCATENATE(preencher!#ref!,#REF!),preencher!#ref!))","v":{"$error":"#NAME?"}},{"$f":"IF(ISERROR(ROUND(AVERAGE(E41:N41),2)),\"\",ROUND(AVERAGE(E41:N41),2))","v":""},{"$f":"IF(ISERROR(ROUND(O41*D41,2)),\"\",ROUND(O41*D41,2))","v":""},null,null,{"$f":"IF(ISERROR(MEDIAN(E41:N41)),\"\",MEDIAN(E41:N41))","v":""},{"$f":"IF(ISERROR(STDEV(E41:N41)),\"\",STDEV(E41:N41))","v":""},{"$f":"IF(ISERROR(T41/O41),\"\",T41/O41)","v":""}]
[{"$f":"IF(preencher!#ref!=\"\",\"\",preencher!#ref!)","v":{"$error":"#NAME?"}},{"$f":"IF(preencher!#ref!=\"\",\"\",preencher!#ref!)","v":{"$error":"#NAME?"}},{"$f":"IF(preencher!#ref!=\"\",\"\",preencher!#ref!)","v":{"$error":"#NAME?"}},{"$f":"IF(preencher!#ref!=\"\",\"\",preencher!#ref!)","v":{"$error":"#NAME?"}},{"$f":"IF(preencher!#ref!=\"\",\"\",IF(COUNTIF(preencher!#ref!,preencher!#ref!)=0,CONCATENATE(preencher!#ref!,#REF!),preencher!#ref!))","v":{"$error":"#NAME?"}},{"$f":"IF(preencher!#ref!=\"\",\"\",IF(COUNTIF(preencher!#ref!,preencher!#ref!)=0,CONCATENATE(preencher!#ref!,#REF!),preencher!#ref!))","v":{"$error":"#NAME?"}},{"$f":"IF(preencher!#ref!=\"\",\"\",IF(COUNTIF(preencher!#ref!,preencher!#ref!)=0,CONCATENATE(preencher!#ref!,#REF!),preencher!#ref!))","v":{"$error":"#NAME?"}},{"$f":"IF(preencher!#ref!=\"\",\"\",IF(COUNTIF(preencher!#ref!,preencher!#ref!)=0,CONCATENATE(preencher!#ref!,#REF!),preencher!#ref!))","v":{"$error":"#NAME?"}},{"$f":"IF(preencher!#ref!=\"\",\"\",IF(COUNTIF(preencher!#ref!,preencher!#ref!)=0,CONCATENATE(preencher!#ref!,#REF!),preencher!#ref!))","v":{"$error":"#NAME?"}},{"$f":"IF(preencher!#ref!=\"\",\"\",IF(COUNTIF(preencher!#ref!,preencher!#ref!)=0,CONCATENATE(preencher!#ref!,#REF!),preencher!#ref!))","v":{"$error":"#NAME?"}},{"$f":"IF(preencher!#ref!=\"\",\"\",IF(COUNTIF(preencher!#ref!,preencher!#ref!)=0,CONCATENATE(preencher!#ref!,#REF!),preencher!#ref!))","v":{"$error":"#NAME?"}},{"$f":"IF(preencher!#ref!=\"\",\"\",IF(COUNTIF(preencher!#ref!,preencher!#ref!)=0,CONCATENATE(preencher!#ref!,#REF!),preencher!#ref!))","v":{"$error":"#NAME?"}},{"$f":"IF(preencher!#ref!=\"\",\"\",IF(COUNTIF(preencher!#ref!,preencher!#ref!)=0,CONCATENATE(preencher!#ref!,#REF!),preencher!#ref!))","v":{"$error":"#NAME?"}},{"$f":"IF(preencher!#ref!=\"\",\"\",IF(COUNTIF(preencher!#ref!,preencher!#ref!)=0,CONCATENATE(preencher!#ref!,#REF!),preencher!#ref!))","v":{"$error":"#NAME?"}},{"$f":"IF(ISERROR(ROUND(AVERAGE(E42:N42),2)),\"\",ROUND(AVERAGE(E42:N42),2))","v":""},{"$f":"IF(ISERROR(ROUND(O42*D42,2)),\"\",ROUND(O42*D42,2))","v":""},null,null,{"$f":"IF(ISERROR(MEDIAN(E42:N42)),\"\",MEDIAN(E42:N42))","v":""},{"$f":"IF(ISERROR(STDEV(E42:N42)),\"\",STDEV(E42:N42))","v":""},{"$f":"IF(ISERROR(T42/O42),\"\",T42/O42)","v":""}]
[{"$f":"IF(preencher!#ref!=\"\",\"\",preencher!#ref!)","v":{"$error":"#NAME?"}},{"$f":"IF(preencher!#ref!=\"\",\"\",preencher!#ref!)","v":{"$error":"#NAME?"}},{"$f":"IF(preencher!#ref!=\"\",\"\",preencher!#ref!)","v":{"$error":"#NAME?"}},{"$f":"IF(preencher!#ref!=\"\",\"\",preencher!#ref!)","v":{"$error":"#NAME?"}},{"$f":"IF(preencher!#ref!=\"\",\"\",IF(COUNTIF(preencher!#ref!,preencher!#ref!)=0,CONCATENATE(preencher!#ref!,#REF!),preencher!#ref!))","v":{"$error":"#NAME?"}},{"$f":"IF(preencher!#ref!=\"\",\"\",IF(COUNTIF(preencher!#ref!,preencher!#ref!)=0,CONCATENATE(preencher!#ref!,#REF!),preencher!#ref!))","v":{"$error":"#NAME?"}},{"$f":"IF(preencher!#ref!=\"\",\"\",IF(COUNTIF(preencher!#ref!,preencher!#ref!)=0,CONCATENATE(preencher!#ref!,#REF!),preencher!#ref!))","v":{"$error":"#NAME?"}},{"$f":"IF(preencher!#ref!=\"\",\"\",IF(COUNTIF(preencher!#ref!,preencher!#ref!)=0,CONCATENATE(preencher!#ref!,#REF!),preencher!#ref!))","v":{"$error":"#NAME?"}},{"$f":"IF(preencher!#ref!=\"\",\"\",IF(COUNTIF(preencher!#ref!,preencher!#ref!)=0,CONCATENATE(preencher!#ref!,#REF!),preencher!#ref!))","v":{"$error":"#NAME?"}},{"$f":"IF(preencher!#ref!=\"\",\"\",IF(COUNTIF(preencher!#ref!,preencher!#ref!)=0,CONCATENATE(preencher!#ref!,#REF!),preencher!#ref!))","v":{"$error":"#NAME?"}},{"$f":"IF(preencher!#ref!=\"\",\"\",IF(COUNTIF(preencher!#ref!,preencher!#ref!)=0,CONCATENATE(preencher!#ref!,#REF!),preencher!#ref!))","v":{"$error":"#NAME?"}},{"$f":"IF(preencher!#ref!=\"\",\"\",IF(COUNTIF(preencher!#ref!,preencher!#ref!)=0,CONCATENATE(preencher!#ref!,#REF!),preencher!#ref!))","v":{"$error":"#NAME?"}},{"$f":"IF(preencher!#ref!=\"\",\"\",IF(COUNTIF(preencher!#ref!,preencher!#ref!)=0,CONCATENATE(preencher!#ref!,#REF!),preencher!#ref!))","v":{"$error":"#NAME?"}},{"$f":"IF(preencher!#ref!=\"\",\"\",IF(COUNTIF(preencher!#ref!,preencher!#ref!)=0,CONCATENATE(preencher!#ref!,#REF!),preencher!#ref!))","v":{"$error":"#NAME?"}},{"$f":"IF(ISERROR(ROUND(AVERAGE(E43:N43),2)),\"\",ROUND(AVERAGE(E43:N43),2))","v":""},{"$f":"IF(ISERROR(ROUND(O43*D43,2)),\"\",ROUND(O43*D43,2))","v":""},null,null,{"$f":"IF(ISERROR(MEDIAN(E43:N43)),\"\",MEDIAN(E43:N43))","v":""},{"$f":"IF(ISERROR(STDEV(E43:N43)),\"\",STDEV(E43:N43))","v":""},{"$f":"IF(ISERROR(T43/O43),\"\",T43/O43)","v":""}]
[{"$f":"IF(preencher!#ref!=\"\",\"\",preencher!#ref!)","v":{"$error":"#NAME?"}},{"$f":"IF(preencher!#ref!=\"\",\"\",preencher!#ref!)","v":{"$error":"#NAME?"}},{"$f":"IF(preencher!#ref!=\"\",\"\",preencher!#ref!)","v":{"$error":"#NAME?"}},{"$f":"IF(preencher!#ref!=\"\",\"\",preencher!#ref!)","v":{"$error":"#NAME?"}},{"$f":"IF(preencher!#ref!=\"\",\"\",IF(COUNTIF(preencher!#ref!,preencher!#ref!)=0,CONCATENATE(preencher!#ref!,#REF!),preencher!#ref!))","v":{"$error":"#NAME?"}},{"$f":"IF(preencher!#ref!=\"\",\"\",IF(COUNTIF(preencher!#ref!,preencher!#ref!)=0,CONCATENATE(preencher!#ref!,#REF!),preencher!#ref!))","v":{"$error":"#NAME?"}},{"$f":"IF(preencher!#ref!=\"\",\"\",IF(COUNTIF(preencher!#ref!,preencher!#ref!)=0,CONCATENATE(preencher!#ref!,#REF!),preencher!#ref!))","v":{"$error":"#NAME?"}},{"$f":"IF(preencher!#ref!=\"\",\"\",IF(COUNTIF(preencher!#ref!,preencher!#ref!)=0,CONCATENATE(preencher!#ref!,#REF!),preencher!#ref!))","v":{"$error":"#NAME?"}},{"$f":"IF(preencher!#ref!=\"\",\"\",IF(COUNTIF(preencher!#ref!,preencher!#ref!)=0,CONCATENATE(preencher!#ref!,#REF!),preencher!#ref!))","v":{"$error":"#NAME?"}},{"$f":"IF(preencher!#ref!=\"\",\"\",IF(COUNTIF(preencher!#ref!,preencher!#ref!)=0,CONCATENATE(preencher!#ref!,#REF!),preencher!#ref!))","v":{"$error":"#NAME?"}},{"$f":"IF(preencher!#ref!=\"\",\"\",IF(COUNTIF(preencher!#ref!,preencher!#ref!)=0,CONCATENATE(preencher!#ref!,#REF!),preencher!#ref!))","v":{"$error":"#NAME?"}},{"$f":"IF(preencher!#ref!=\"\",\"\",IF(COUNTIF(preencher!#ref!,preencher!#ref!)=0,CONCATENATE(preencher!#ref!,#REF!),preencher!#ref!))","v":{"$error":"#NAME?"}},{"$f":"IF(preencher!#ref!=\"\",\"\",IF(COUNTIF(preencher!#ref!,preencher!#ref!)=0,CONCATENATE(preencher!#ref!,#REF!),preencher!#ref!))","v":{"$error":"#NAME?"}},{"$f":"IF(preencher!#ref!=\"\",\"\",IF(COUNTIF(preencher!#ref!,preencher!#ref!)=0,CONCATENATE(preencher!#ref!,#REF!),preencher!#ref!))","v":{"$error":"#NAME?"}},{"$f":"IF(ISERROR(ROUND(AVERAGE(E44:N44),2)),\"\",ROUND(AVERAGE(E44:N44),2))","v":""},{"$f":"IF(ISERROR(ROUND(O44*D44,2)),\"\",ROUND(O44*D44,2))","v":""},null,null,{"$f":"IF(ISERROR(MEDIAN(E44:N44)),\"\",MEDIAN(E44:N44))","v":""},{"$f":"IF(ISERROR(STDEV(E44:N44)),\"\",STDEV(E44:N44))","v":""},{"$f":"IF(ISERROR(T44/O44),\"\",T44/O44)","v":""}]
[{"$f":"IF(preencher!#ref!=\"\",\"\",preencher!#ref!)","v":{"$error":"#NAME?"}},{"$f":"IF(preencher!#ref!=\"\",\"\",preencher!#ref!)","v":{"$error":"#NAME?"}},{"$f":"IF(preencher!#ref!=\"\",\"\",preencher!#ref!)","v":{"$error":"#NAME?"}},{"$f":"IF(preencher!#ref!=\"\",\"\",preencher!#ref!)","v":{"$error":"#NAME?"}},{"$f":"IF(preencher!#ref!=\"\",\"\",IF(COUNTIF(preencher!#ref!,preencher!#ref!)=0,CONCATENATE(preencher!#ref!,#REF!),preencher!#ref!))","v":{"$error":"#NAME?"}},{"$f":"IF(preencher!#ref!=\"\",\"\",IF(COUNTIF(preencher!#ref!,preencher!#ref!)=0,CONCATENATE(preencher!#ref!,#REF!),preencher!#ref!))","v":{"$error":"#NAME?"}},{"$f":"IF(preencher!#ref!=\"\",\"\",IF(COUNTIF(preencher!#ref!,preencher!#ref!)=0,CONCATENATE(preencher!#ref!,#REF!),preencher!#ref!))","v":{"$error":"#NAME?"}},{"$f":"IF(preencher!#ref!=\"\",\"\",IF(COUNTIF(preencher!#ref!,preencher!#ref!)=0,CONCATENATE(preencher!#ref!,#REF!),preencher!#ref!))","v":{"$error":"#NAME?"}},{"$f":"IF(preencher!#ref!=\"\",\"\",IF(COUNTIF(preencher!#ref!,preencher!#ref!)=0,CONCATENATE(preencher!#ref!,#REF!),preencher!#ref!))","v":{"$error":"#NAME?"}},{"$f":"IF(preencher!#ref!=\"\",\"\",IF(COUNTIF(preencher!#ref!,preencher!#ref!)=0,CONCATENATE(preencher!#ref!,#REF!),preencher!#ref!))","v":{"$error":"#NAME?"}},{"$f":"IF(preencher!#ref!=\"\",\"\",IF(COUNTIF(preencher!#ref!,preencher!#ref!)=0,CONCATENATE(preencher!#ref!,#REF!),preencher!#ref!))","v":{"$error":"#NAME?"}},{"$f":"IF(preencher!#ref!=\"\",\"\",IF(COUNTIF(preencher!#ref!,preencher!#ref!)=0,CONCATENATE(preencher!#ref!,#REF!),preencher!#ref!))","v":{"$error":"#NAME?"}},{"$f":"IF(preencher!#ref!=\"\",\"\",IF(COUNTIF(preencher!#ref!,preencher!#ref!)=0,CONCATENATE(preencher!#ref!,#REF!),preencher!#ref!))","v":{"$error":"#NAME?"}},{"$f":"IF(preencher!#ref!=\"\",\"\",IF(COUNTIF(preencher!#ref!,preencher!#ref!)=0,CONCATENATE(preencher!#ref!,#REF!),preencher!#ref!))","v":{"$error":"#NAME?"}},{"$f":"IF(ISERROR(ROUND(AVERAGE(E45:N45),2)),\"\",ROUND(AVERAGE(E45:N45),2))","v":""},{"$f":"IF(ISERROR(ROUND(O45*D45,2)),\"\",ROUND(O45*D45,2))","v":""},null,null,{"$f":"IF(ISERROR(MEDIAN(E45:N45)),\"\",MEDIAN(E45:N45))","v":""},{"$f":"IF(ISERROR(STDEV(E45:N45)),\"\",STDEV(E45:N45))","v":""},{"$f":"IF(ISERROR(T45/O45),\"\",T45/O45)","v":""}]
[{"$f":"IF(preencher!#ref!=\"\",\"\",preencher!#ref!)","v":{"$error":"#NAME?"}},{"$f":"IF(preencher!#ref!=\"\",\"\",preencher!#ref!)","v":{"$error":"#NAME?"}},{"$f":"IF(preencher!#ref!=\"\",\"\",preencher!#ref!)","v":{"$error":"#NAME?"}},{"$f":"IF(preencher!#ref!=\"\",\"\",preencher!#ref!)","v":{"$error":"#NAME?"}},{"$f":"IF(preencher!#ref!=\"\",\"\",IF(COUNTIF(preencher!#ref!,preencher!#ref!)=0,CONCATENATE(preencher!#ref!,#REF!),preencher!#ref!))","v":{"$error":"#NAME?"}},{"$f":"IF(preencher!#ref!=\"\",\"\",IF(COUNTIF(preencher!#ref!,preencher!#ref!)=0,CONCATENATE(preencher!#ref!,#REF!),preencher!#ref!))","v":{"$error":"#NAME?"}},{"$f":"IF(preencher!#ref!=\"\",\"\",IF(COUNTIF(preencher!#ref!,preencher!#ref!)=0,CONCATENATE(preencher!#ref!,#REF!),preencher!#ref!))","v":{"$error":"#NAME?"}},{"$f":"IF(preencher!#ref!=\"\",\"\",IF(COUNTIF(preencher!#ref!,preencher!#ref!)=0,CONCATENATE(preencher!#ref!,#REF!),preencher!#ref!))","v":{"$error":"#NAME?"}},{"$f":"IF(preencher!#ref!=\"\",\"\",IF(COUNTIF(preencher!#ref!,preencher!#ref!)=0,CONCATENATE(preencher!#ref!,#REF!),preencher!#ref!))","v":{"$error":"#NAME?"}},{"$f":"IF(preencher!#ref!=\"\",\"\",IF(COUNTIF(preencher!#ref!,preencher!#ref!)=0,CONCATENATE(preencher!#ref!,#REF!),preencher!#ref!))","v":{"$error":"#NAME?"}},{"$f":"IF(preencher!#ref!=\"\",\"\",IF(COUNTIF(preencher!#ref!,preencher!#ref!)=0,CONCATENATE(preencher!#ref!,#REF!),preencher!#ref!))","v":{"$error":"#NAME?"}},{"$f":"IF(preencher!#ref!=\"\",\"\",IF(COUNTIF(preencher!#ref!,preencher!#ref!)=0,CONCATENATE(preencher!#ref!,#REF!),preencher!#ref!))","v":{"$error":"#NAME?"}},{"$f":"IF(preencher!#ref!=\"\",\"\",IF(COUNTIF(preencher!#ref!,preencher!#ref!)=0,CONCATENATE(preencher!#ref!,#REF!),preencher!#ref!))","v":{"$error":"#NAME?"}},{"$f":"IF(preencher!#ref!=\"\",\"\",IF(COUNTIF(preencher!#ref!,preencher!#ref!)=0,CONCATENATE(preencher!#ref!,#REF!),preencher!#ref!))","v":{"$error":"#NAME?"}},{"$f":"IF(ISERROR(ROUND(AVERAGE(E46:N46),2)),\"\",ROUND(AVERAGE(E46:N46),2))","v":""},{"$f":"IF(ISERROR(ROUND(O46*D46,2)),\"\",ROUND(O46*D46,2))","v":""},null,null,{"$f":"IF(ISERROR(MEDIAN(E46:N46)),\"\",MEDIAN(E46:N46))","v":""},{"$f":"IF(ISERROR(STDEV(E46:N46)),\"\",STDEV(E46:N46))","v":""},{"$f":"IF(ISERROR(T46/O46),\"\",T46/O46)","v":""}]
[{"$f":"IF(preencher!#ref!=\"\",\"\",preencher!#ref!)","v":{"$error":"#NAME?"}},{"$f":"IF(preencher!#ref!=\"\",\"\",preencher!#ref!)","v":{"$error":"#NAME?"}},{"$f":"IF(preencher!#ref!=\"\",\"\",preencher!#ref!)","v":{"$error":"#NAME?"}},{"$f":"IF(preencher!#ref!=\"\",\"\",preencher!#ref!)","v":{"$error":"#NAME?"}},{"$f":"IF(preencher!#ref!=\"\",\"\",IF(COUNTIF(preencher!#ref!,preencher!#ref!)=0,CONCATENATE(preencher!#ref!,#REF!),preencher!#ref!))","v":{"$error":"#NAME?"}},{"$f":"IF(preencher!#ref!=\"\",\"\",IF(COUNTIF(preencher!#ref!,preencher!#ref!)=0,CONCATENATE(preencher!#ref!,#REF!),preencher!#ref!))","v":{"$error":"#NAME?"}},{"$f":"IF(preencher!#ref!=\"\",\"\",IF(COUNTIF(preencher!#ref!,preencher!#ref!)=0,CONCATENATE(preencher!#ref!,#REF!),preencher!#ref!))","v":{"$error":"#NAME?"}},{"$f":"IF(preencher!#ref!=\"\",\"\",IF(COUNTIF(preencher!#ref!,preencher!#ref!)=0,CONCATENATE(preencher!#ref!,#REF!),preencher!#ref!))","v":{"$error":"#NAME?"}},{"$f":"IF(preencher!#ref!=\"\",\"\",IF(COUNTIF(preencher!#ref!,preencher!#ref!)=0,CONCATENATE(preencher!#ref!,#REF!),preencher!#ref!))","v":{"$error":"#NAME?"}},{"$f":"IF(preencher!#ref!=\"\",\"\",IF(COUNTIF(preencher!#ref!,preencher!#ref!)=0,CONCATENATE(preencher!#ref!,#REF!),preencher!#ref!))","v":{"$error":"#NAME?"}},{"$f":"IF(preencher!#ref!=\"\",\"\",IF(COUNTIF(preencher!#ref!,preencher!#ref!)=0,CONCATENATE(preencher!#ref!,#REF!),preencher!#ref!))","v":{"$error":"#NAME?"}},{"$f":"IF(preencher!#ref!=\"\",\"\",IF(COUNTIF(preencher!#ref!,preencher!#ref!)=0,CONCATENATE(preencher!#ref!,#REF!),preencher!#ref!))","v":{"$error":"#NAME?"}},{"$f":"IF(preencher!#ref!=\"\",\"\",IF(COUNTIF(preencher!#ref!,preencher!#ref!)=0,CONCATENATE(preencher!#ref!,#REF!),preencher!#ref!))","v":{"$error":"#NAME?"}},{"$f":"IF(preencher!#ref!=\"\",\"\",IF(COUNTIF(preencher!#ref!,preencher!#ref!)=0,CONCATENATE(preencher!#ref!,#REF!),preencher!#ref!))","v":{"$error":"#NAME?"}},{"$f":"IF(ISERROR(ROUND(AVERAGE(E47:N47),2)),\"\",ROUND(AVERAGE(E47:N47),2))","v":""},{"$f":"IF(ISERROR(ROUND(O47*D47,2)),\"\",ROUND(O47*D47,2))","v":""},null,null,{"$f":"IF(ISERROR(MEDIAN(E47:N47)),\"\",MEDIAN(E47:N47))","v":""},{"$f":"IF(ISERROR(STDEV(E47:N47)),\"\",STDEV(E47:N47))","v":""},{"$f":"IF(ISERROR(T47/O47),\"\",T47/O47)","v":""}]
[{"$f":"IF(preencher!#ref!=\"\",\"\",preencher!#ref!)","v":{"$error":"#NAME?"}},{"$f":"IF(preencher!#ref!=\"\",\"\",preencher!#ref!)","v":{"$error":"#NAME?"}},{"$f":"IF(preencher!#ref!=\"\",\"\",preencher!#ref!)","v":{"$error":"#NAME?"}},{"$f":"IF(preencher!#ref!=\"\",\"\",preencher!#ref!)","v":{"$error":"#NAME?"}},{"$f":"IF(preencher!#ref!=\"\",\"\",IF(COUNTIF(preencher!#ref!,preencher!#ref!)=0,CONCATENATE(preencher!#ref!,#REF!),preencher!#ref!))","v":{"$error":"#NAME?"}},{"$f":"IF(preencher!#ref!=\"\",\"\",IF(COUNTIF(preencher!#ref!,preencher!#ref!)=0,CONCATENATE(preencher!#ref!,#REF!),preencher!#ref!))","v":{"$error":"#NAME?"}},{"$f":"IF(preencher!#ref!=\"\",\"\",IF(COUNTIF(preencher!#ref!,preencher!#ref!)=0,CONCATENATE(preencher!#ref!,#REF!),preencher!#ref!))","v":{"$error":"#NAME?"}},{"$f":"IF(preencher!#ref!=\"\",\"\",IF(COUNTIF(preencher!#ref!,preencher!#ref!)=0,CONCATENATE(preencher!#ref!,#REF!),preencher!#ref!))","v":{"$error":"#NAME?"}},{"$f":"IF(preencher!#ref!=\"\",\"\",IF(COUNTIF(preencher!#ref!,preencher!#ref!)=0,CONCATENATE(preencher!#ref!,#REF!),preencher!#ref!))","v":{"$error":"#NAME?"}},{"$f":"IF(preencher!#ref!=\"\",\"\",IF(COUNTIF(preencher!#ref!,preencher!#ref!)=0,CONCATENATE(preencher!#ref!,#REF!),preencher!#ref!))","v":{"$error":"#NAME?"}},{"$f":"IF(preencher!#ref!=\"\",\"\",IF(COUNTIF(preencher!#ref!,preencher!#ref!)=0,CONCATENATE(preencher!#ref!,#REF!),preencher!#ref!))","v":{"$error":"#NAME?"}},{"$f":"IF(preencher!#ref!=\"\",\"\",IF(COUNTIF(preencher!#ref!,preencher!#ref!)=0,CONCATENATE(preencher!#ref!,#REF!),preencher!#ref!))","v":{"$error":"#NAME?"}},{"$f":"IF(preencher!#ref!=\"\",\"\",IF(COUNTIF(preencher!#ref!,preencher!#ref!)=0,CONCATENATE(preencher!#ref!,#REF!),preencher!#ref!))","v":{"$error":"#NAME?"}},{"$f":"IF(preencher!#ref!=\"\",\"\",IF(COUNTIF(preencher!#ref!,preencher!#ref!)=0,CONCATENATE(preencher!#ref!,#REF!),preencher!#ref!))","v":{"$error":"#NAME?"}},{"$f":"IF(ISERROR(ROUND(AVERAGE(E48:N48),2)),\"\",ROUND(AVERAGE(E48:N48),2))","v":""},{"$f":"IF(ISERROR(ROUND(O48*D48,2)),\"\",ROUND(O48*D48,2))","v":""},null,null,{"$f":"IF(ISERROR(MEDIAN(E48:N48)),\"\",MEDIAN(E48:N48))","v":""},{"$f":"IF(ISERROR(STDEV(E48:N48)),\"\",STDEV(E48:N48))","v":""},{"$f":"IF(ISERROR(T48/O48),\"\",T48/O48)","v":""}]
[{"$f":"IF(preencher!#ref!=\"\",\"\",preencher!#ref!)","v":{"$error":"#NAME?"}},{"$f":"IF(preencher!#ref!=\"\",\"\",preencher!#ref!)","v":{"$error":"#NAME?"}},{"$f":"IF(preencher!#ref!=\"\",\"\",preencher!#ref!)","v":{"$error":"#NAME?"}},{"$f":"IF(preencher!#ref!=\"\",\"\",preencher!#ref!)","v":{"$error":"#NAME?"}},{"$f":"IF(preencher!#ref!=\"\",\"\",IF(COUNTIF(preencher!#ref!,preencher!#ref!)=0,CONCATENATE(preencher!#ref!,#REF!),preencher!#ref!))","v":{"$error":"#NAME?"}},{"$f":"IF(preencher!#ref!=\"\",\"\",IF(COUNTIF(preencher!#ref!,preencher!#ref!)=0,CONCATENATE(preencher!#ref!,#REF!),preencher!#ref!))","v":{"$error":"#NAME?"}},{"$f":"IF(preencher!#ref!=\"\",\"\",IF(COUNTIF(preencher!#ref!,preencher!#ref!)=0,CONCATENATE(preencher!#ref!,#REF!),preencher!#ref!))","v":{"$error":"#NAME?"}},{"$f":"IF(preencher!#ref!=\"\",\"\",IF(COUNTIF(preencher!#ref!,preencher!#ref!)=0,CONCATENATE(preencher!#ref!,#REF!),preencher!#ref!))","v":{"$error":"#NAME?"}},{"$f":"IF(preencher!#ref!=\"\",\"\",IF(COUNTIF(preencher!#ref!,preencher!#ref!)=0,CONCATENATE(preencher!#ref!,#REF!),preencher!#ref!))","v":{"$error":"#NAME?"}},{"$f":"IF(preencher!#ref!=\"\",\"\",IF(COUNTIF(preencher!#ref!,preencher!#ref!)=0,CONCATENATE(preencher!#ref!,#REF!),preencher!#ref!))","v":{"$error":"#NAME?"}},{"$f":"IF(preencher!#ref!=\"\",\"\",IF(COUNTIF(preencher!#ref!,preencher!#ref!)=0,CONCATENATE(preencher!#ref!,#REF!),preencher!#ref!))","v":{"$error":"#NAME?"}},{"$f":"IF(preencher!#ref!=\"\",\"\",IF(COUNTIF(preencher!#ref!,preencher!#ref!)=0,CONCATENATE(preencher!#ref!,#REF!),preencher!#ref!))","v":{"$error":"#NAME?"}},{"$f":"IF(preencher!#ref!=\"\",\"\",IF(COUNTIF(preencher!#ref!,preencher!#ref!)=0,CONCATENATE(preencher!#ref!,#REF!),preencher!#ref!))","v":{"$error":"#NAME?"}},{"$f":"IF(preencher!#ref!=\"\",\"\",IF(COUNTIF(preencher!#ref!,preencher!#ref!)=0,CONCATENATE(preencher!#ref!,#REF!),preencher!#ref!))","v":{"$error":"#NAME?"}},{"$f":"IF(ISERROR(ROUND(AVERAGE(E49:N49),2)),\"\",ROUND(AVERAGE(E49:N49),2))","v":""},{"$f":"IF(ISERROR(ROUND(O49*D49,2)),\"\",ROUND(O49*D49,2))","v":""},null,null,{"$f":"IF(ISERROR(MEDIAN(E49:N49)),\"\",MEDIAN(E49:N49))","v":""},{"$f":"IF(ISERROR(STDEV(E49:N49)),\"\",STDEV(E49:N49))","v":""},{"$f":"IF(ISERROR(T49/O49),\"\",T49/O49)","v":""}]
[{"$f":"IF(preencher!#ref!=\"\",\"\",preencher!#ref!)","v":{"$error":"#NAME?"}},{"$f":"IF(preencher!#ref!=\"\",\"\",preencher!#ref!)","v":{"$error":"#NAME?"}},{"$f":"IF(preencher!#ref!=\"\",\"\",preencher!#ref!)","v":{"$error":"#NAME?"}},{"$f":"IF(preencher!#ref!=\"\",\"\",preencher!#ref!)","v":{"$error":"#NAME?"}},{"$f":"IF(preencher!#ref!=\"\",\"\",IF(COUNTIF(preencher!#ref!,preencher!#ref!)=0,CONCATENATE(preencher!#ref!,#REF!),preencher!#ref!))","v":{"$error":"#NAME?"}},{"$f":"IF(preencher!#ref!=\"\",\"\",IF(COUNTIF(preencher!#ref!,preencher!#ref!)=0,CONCATENATE(preencher!#ref!,#REF!),preencher!#ref!))","v":{"$error":"#NAME?"}},{"$f":"IF(preencher!#ref!=\"\",\"\",IF(COUNTIF(preencher!#ref!,preencher!#ref!)=0,CONCATENATE(preencher!#ref!,#REF!),preencher!#ref!))","v":{"$error":"#NAME?"}},{"$f":"IF(preencher!#ref!=\"\",\"\",IF(COUNTIF(preencher!#ref!,preencher!#ref!)=0,CONCATENATE(preencher!#ref!,#REF!),preencher!#ref!))","v":{"$error":"#NAME?"}},{"$f":"IF(preencher!#ref!=\"\",\"\",IF(COUNTIF(preencher!#ref!,preencher!#ref!)=0,CONCATENATE(preencher!#ref!,#REF!),preencher!#ref!))","v":{"$error":"#NAME?"}},{"$f":"IF(preencher!#ref!=\"\",\"\",IF(COUNTIF(preencher!#ref!,preencher!#ref!)=0,CONCATENATE(preencher!#ref!,#REF!),preencher!#ref!))","v":{"$error":"#NAME?"}},{"$f":"IF(preencher!#ref!=\"\",\"\",IF(COUNTIF(preencher!#ref!,preencher!#ref!)=0,CONCATENATE(preencher!#ref!,#REF!),preencher!#ref!))","v":{"$error":"#NAME?"}},{"$f":"IF(preencher!#ref!=\"\",\"\",IF(COUNTIF(preencher!#ref!,preencher!#ref!)=0,CONCATENATE(preencher!#ref!,#REF!),preencher!#ref!))","v":{"$error":"#NAME?"}},{"$f":"IF(preencher!#ref!=\"\",\"\",IF(COUNTIF(preencher!#ref!,preencher!#ref!)=0,CONCATENATE(preencher!#ref!,#REF!),preencher!#ref!))","v":{"$error":"#NAME?"}},{"$f":"IF(preencher!#ref!=\"\",\"\",IF(COUNTIF(preencher!#ref!,preencher!#ref!)=0,CONCATENATE(preencher!#ref!,#REF!),preencher!#ref!))","v":{"$error":"#NAME?"}},{"$f":"IF(ISERROR(ROUND(AVERAGE(E50:N50),2)),\"\",ROUND(AVERAGE(E50:N50),2))","v":""},{"$f":"IF(ISERROR(ROUND(O50*D50,2)),\"\",ROUND(O50*D50,2))","v":""},null,null,{"$f":"IF(ISERROR(MEDIAN(E50:N50)),\"\",MEDIAN(E50:N50))","v":""},{"$f":"IF(ISERROR(STDEV(E50:N50)),\"\",STDEV(E50:N50))","v":""},{"$f":"IF(ISERROR(T50/O50),\"\",T50/O50)","v":""}]
[{"$f":"IF(preencher!#ref!=\"\",\"\",preencher!#ref!)","v":{"$error":"#NAME?"}},{"$f":"IF(preencher!#ref!=\"\",\"\",preencher!#ref!)","v":{"$error":"#NAME?"}},{"$f":"IF(preencher!#ref!=\"\",\"\",preencher!#ref!)","v":{"$error":"#NAME?"}},{"$f":"IF(preencher!#ref!=\"\",\"\",preencher!#ref!)","v":{"$error":"#NAME?"}},{"$f":"IF(preencher!#ref!=\"\",\"\",IF(COUNTIF(preencher!#ref!,preencher!#ref!)=0,CONCATENATE(preencher!#ref!,#REF!),preencher!#ref!))","v":{"$error":"#NAME?"}},{"$f":"IF(preencher!#ref!=\"\",\"\",IF(COUNTIF(preencher!#ref!,preencher!#ref!)=0,CONCATENATE(preencher!#ref!,#REF!),preencher!#ref!))","v":{"$error":"#NAME?"}},{"$f":"IF(preencher!#ref!=\"\",\"\",IF(COUNTIF(preencher!#ref!,preencher!#ref!)=0,CONCATENATE(preencher!#ref!,#REF!),preencher!#ref!))","v":{"$error":"#NAME?"}},{"$f":"IF(preencher!#ref!=\"\",\"\",IF(COUNTIF(preencher!#ref!,preencher!#ref!)=0,CONCATENATE(preencher!#ref!,#REF!),preencher!#ref!))","v":{"$error":"#NAME?"}},{"$f":"IF(preencher!#ref!=\"\",\"\",IF(COUNTIF(preencher!#ref!,preencher!#ref!)=0,CONCATENATE(preencher!#ref!,#REF!),preencher!#ref!))","v":{"$error":"#NAME?"}},{"$f":"IF(preencher!#ref!=\"\",\"\",IF(COUNTIF(preencher!#ref!,preencher!#ref!)=0,CONCATENATE(preencher!#ref!,#REF!),preencher!#ref!))","v":{"$error":"#NAME?"}},{"$f":"IF(preencher!#ref!=\"\",\"\",IF(COUNTIF(preencher!#ref!,preencher!#ref!)=0,CONCATENATE(preencher!#ref!,#REF!),preencher!#ref!))","v":{"$error":"#NAME?"}},{"$f":"IF(preencher!#ref!=\"\",\"\",IF(COUNTIF(preencher!#ref!,preencher!#ref!)=0,CONCATENATE(preencher!#ref!,#REF!),preencher!#ref!))","v":{"$error":"#NAME?"}},{"$f":"IF(preencher!#ref!=\"\",\"\",IF(COUNTIF(preencher!#ref!,preencher!#ref!)=0,CONCATENATE(preencher!#ref!,#REF!),preencher!#ref!))","v":{"$error":"#NAME?"}},{"$f":"IF(preencher!#ref!=\"\",\"\",IF(COUNTIF(preencher!#ref!,preencher!#ref!)=0,CONCATENATE(preencher!#ref!,#REF!),preencher!#ref!))","v":{"$error":"#NAME?"}},{"$f":"IF(ISERROR(ROUND(AVERAGE(E51:N51),2)),\"\",ROUND(AVERAGE(E51:N51),2))","v":""},{"$f":"IF(ISERROR(ROUND(O51*D51,2)),\"\",ROUND(O51*D51,2))","v":""},null,null,{"$f":"IF(ISERROR(MEDIAN(E51:N51)),\"\",MEDIAN(E51:N51))","v":""},{"$f":"IF(ISERROR(STDEV(E51:N51)),\"\",STDEV(E51:N51))","v":""},{"$f":"IF(ISERROR(T51/O51),\"\",T51/O51)","v":""}]
[{"$f":"IF(preencher!#ref!=\"\",\"\",preencher!#ref!)","v":{"$error":"#NAME?"}},{"$f":"IF(preencher!#ref!=\"\",\"\",preencher!#ref!)","v":{"$error":"#NAME?"}},{"$f":"IF(preencher!#ref!=\"\",\"\",preencher!#ref!)","v":{"$error":"#NAME?"}},{"$f":"IF(preencher!#ref!=\"\",\"\",preencher!#ref!)","v":{"$error":"#NAME?"}},{"$f":"IF(preencher!#ref!=\"\",\"\",IF(COUNTIF(preencher!#ref!,preencher!#ref!)=0,CONCATENATE(preencher!#ref!,#REF!),preencher!#ref!))","v":{"$error":"#NAME?"}},{"$f":"IF(preencher!#ref!=\"\",\"\",IF(COUNTIF(preencher!#ref!,preencher!#ref!)=0,CONCATENATE(preencher!#ref!,#REF!),preencher!#ref!))","v":{"$error":"#NAME?"}},{"$f":"IF(preencher!#ref!=\"\",\"\",IF(COUNTIF(preencher!#ref!,preencher!#ref!)=0,CONCATENATE(preencher!#ref!,#REF!),preencher!#ref!))","v":{"$error":"#NAME?"}},{"$f":"IF(preencher!#ref!=\"\",\"\",IF(COUNTIF(preencher!#ref!,preencher!#ref!)=0,CONCATENATE(preencher!#ref!,#REF!),preencher!#ref!))","v":{"$error":"#NAME?"}},{"$f":"IF(preencher!#ref!=\"\",\"\",IF(COUNTIF(preencher!#ref!,preencher!#ref!)=0,CONCATENATE(preencher!#ref!,#REF!),preencher!#ref!))","v":{"$error":"#NAME?"}},{"$f":"IF(preencher!#ref!=\"\",\"\",IF(COUNTIF(preencher!#ref!,preencher!#ref!)=0,CONCATENATE(preencher!#ref!,#REF!),preencher!#ref!))","v":{"$error":"#NAME?"}},{"$f":"IF(preencher!#ref!=\"\",\"\",IF(COUNTIF(preencher!#ref!,preencher!#ref!)=0,CONCATENATE(preencher!#ref!,#REF!),preencher!#ref!))","v":{"$error":"#NAME?"}},{"$f":"IF(preencher!#ref!=\"\",\"\",IF(COUNTIF(preencher!#ref!,preencher!#ref!)=0,CONCATENATE(preencher!#ref!,#REF!),preencher!#ref!))","v":{"$error":"#NAME?"}},{"$f":"IF(preencher!#ref!=\"\",\"\",IF(COUNTIF(preencher!#ref!,preencher!#ref!)=0,CONCATENATE(preencher!#ref!,#REF!),preencher!#ref!))","v":{"$error":"#NAME?"}},{"$f":"IF(preencher!#ref!=\"\",\"\",IF(COUNTIF(preencher!#ref!,preencher!#ref!)=0,CONCATENATE(preencher!#ref!,#REF!),preencher!#ref!))","v":{"$error":"#NAME?"}},{"$f":"IF(ISERROR(ROUND(AVERAGE(E52:N52),2)),\"\",ROUND(AVERAGE(E52:N52),2))","v":""},{"$f":"IF(ISERROR(ROUND(O52*D52,2)),\"\",ROUND(O52*D52,2))","v":""},null,null,{"$f":"IF(ISERROR(MEDIAN(E52:N52)),\"\",MEDIAN(E52:N52))","v":""},{"$f":"IF(ISERROR(STDEV(E52:N52)),\"\",STDEV(E52:N52))","v":""},{"$f":"IF(ISERROR(T52/O52),\"\",T52/O52)","v":""}]
[{"$f":"IF(preencher!#ref!=\"\",\"\",preencher!#ref!)","v":{"$error":"#NAME?"}},{"$f":"IF(preencher!#ref!=\"\",\"\",preencher!#ref!)","v":{"$error":"#NAME?"}},{"$f":"IF(preencher!#ref!=\"\",\"\",preencher!#ref!)","v":{"$error":"#NAME?"}},{"$f":"IF(preencher!#ref!=\"\",\"\",preencher!#ref!)","v":{"$error":"#NAME?"}},{"$f":"IF(preencher!#ref!=\"\",\"\",IF(COUNTIF(preencher!#ref!,preencher!#ref!)=0,CONCATENATE(preencher!#ref!,#REF!),preencher!#ref!))","v":{"$error":"#NAME?"}},{"$f":"IF(preencher!#ref!=\"\",\"\",IF(COUNTIF(preencher!#ref!,preencher!#ref!)=0,CONCATENATE(preencher!#ref!,#REF!),preencher!#ref!))","v":{"$error":"#NAME?"}},{"$f":"IF(preencher!#ref!=\"\",\"\",IF(COUNTIF(preencher!#ref!,preencher!#ref!)=0,CONCATENATE(preencher!#ref!,#REF!),preencher!#ref!))","v":{"$error":"#NAME?"}},{"$f":"IF(preencher!#ref!=\"\",\"\",IF(COUNTIF(preencher!#ref!,preencher!#ref!)=0,CONCATENATE(preencher!#ref!,#REF!),preencher!#ref!))","v":{"$error":"#NAME?"}},{"$f":"IF(preencher!#ref!=\"\",\"\",IF(COUNTIF(preencher!#ref!,preencher!#ref!)=0,CONCATENATE(preencher!#ref!,#REF!),preencher!#ref!))","v":{"$error":"#NAME?"}},{"$f":"IF(preencher!#ref!=\"\",\"\",IF(COUNTIF(preencher!#ref!,preencher!#ref!)=0,CONCATENATE(preencher!#ref!,#REF!),preencher!#ref!))","v":{"$error":"#NAME?"}},{"$f":"IF(preencher!#ref!=\"\",\"\",IF(COUNTIF(preencher!#ref!,preencher!#ref!)=0,CONCATENATE(preencher!#ref!,#REF!),preencher!#ref!))","v":{"$error":"#NAME?"}},{"$f":"IF(preencher!#ref!=\"\",\"\",IF(COUNTIF(preencher!#ref!,preencher!#ref!)=0,CONCATENATE(preencher!#ref!,#REF!),preencher!#ref!))","v":{"$error":"#NAME?"}},{"$f":"IF(preencher!#ref!=\"\",\"\",IF(COUNTIF(preencher!#ref!,preencher!#ref!)=0,CONCATENATE(preencher!#ref!,#REF!),preencher!#ref!))","v":{"$error":"#NAME?"}},{"$f":"IF(preencher!#ref!=\"\",\"\",IF(COUNTIF(preencher!#ref!,preencher!#ref!)=0,CONCATENATE(preencher!#ref!,#REF!),preencher!#ref!))","v":{"$error":"#NAME?"}},{"$f":"IF(ISERROR(ROUND(AVERAGE(E53:N53),2)),\"\",ROUND(AVERAGE(E53:N53),2))","v":""},{"$f":"IF(ISERROR(ROUND(O53*D53,2)),\"\",ROUND(O53*D53,2))","v":""},null,null,{"$f":"IF(ISERROR(MEDIAN(E53:N53)),\"\",MEDIAN(E53:N53))","v":""},{"$f":"IF(ISERROR(STDEV(E53:N53)),\"\",STDEV(E53:N53))","v":""},{"$f":"IF(ISERROR(T53/O53),\"\",T53/O53)","v":""}]
[{"$f":"IF(preencher!#ref!=\"\",\"\",preencher!#ref!)","v":{"$error":"#NAME?"}},{"$f":"IF(preencher!#ref!=\"\",\"\",preencher!#ref!)","v":{"$error":"#NAME?"}},{"$f":"IF(preencher!#ref!=\"\",\"\",preencher!#ref!)","v":{"$error":"#NAME?"}},{"$f":"IF(preencher!#ref!=\"\",\"\",preencher!#ref!)","v":{"$error":"#NAME?"}},{"$f":"IF(preencher!#ref!=\"\",\"\",IF(COUNTIF(preencher!#ref!,preencher!#ref!)=0,CONCATENATE(preencher!#ref!,#REF!),preencher!#ref!))","v":{"$error":"#NAME?"}},{"$f":"IF(preencher!#ref!=\"\",\"\",IF(COUNTIF(preencher!#ref!,preencher!#ref!)=0,CONCATENATE(preencher!#ref!,#REF!),preencher!#ref!))","v":{"$error":"#NAME?"}},{"$f":"IF(preencher!#ref!=\"\",\"\",IF(COUNTIF(preencher!#ref!,preencher!#ref!)=0,CONCATENATE(preencher!#ref!,#REF!),preencher!#ref!))","v":{"$error":"#NAME?"}},{"$f":"IF(preencher!#ref!=\"\",\"\",IF(COUNTIF(preencher!#ref!,preencher!#ref!)=0,CONCATENATE(preencher!#ref!,#REF!),preencher!#ref!))","v":{"$error":"#NAME?"}},{"$f":"IF(preencher!#ref!=\"\",\"\",IF(COUNTIF(preencher!#ref!,preencher!#ref!)=0,CONCATENATE(preencher!#ref!,#REF!),preencher!#ref!))","v":{"$error":"#NAME?"}},{"$f":"IF(preencher!#ref!=\"\",\"\",IF(COUNTIF(preencher!#ref!,preencher!#ref!)=0,CONCATENATE(preencher!#ref!,#REF!),preencher!#ref!))","v":{"$error":"#NAME?"}},{"$f":"IF(preencher!#ref!=\"\",\"\",IF(COUNTIF(preencher!#ref!,preencher!#ref!)=0,CONCATENATE(preencher!#ref!,#REF!),preencher!#ref!))","v":{"$error":"#NAME?"}},{"$f":"IF(preencher!#ref!=\"\",\"\",IF(COUNTIF(preencher!#ref!,preencher!#ref!)=0,CONCATENATE(preencher!#ref!,#REF!),preencher!#ref!))","v":{"$error":"#NAME?"}},{"$f":"IF(preencher!#ref!=\"\",\"\",IF(COUNTIF(preencher!#ref!,preencher!#ref!)=0,CONCATENATE(preencher!#ref!,#REF!),preencher!#ref!))","v":{"$error":"#NAME?"}},{"$f":"IF(preencher!#ref!=\"\",\"\",IF(COUNTIF(preencher!#ref!,preencher!#ref!)=0,CONCATENATE(preencher!#ref!,#REF!),preencher!#ref!))","v":{"$error":"#NAME?"}},{"$f":"IF(ISERROR(ROUND(AVERAGE(E54:N54),2)),\"\",ROUND(AVERAGE(E54:N54),2))","v":""},{"$f":"IF(ISERROR(ROUND(O54*D54,2)),\"\",ROUND(O54*D54,2))","v":""},null,null,{"$f":"IF(ISERROR(MEDIAN(E54:N54)),\"\",MEDIAN(E54:N54))","v":""},{"$f":"IF(ISERROR(STDEV(E54:N54)),\"\",STDEV(E54:N54))","v":""},{"$f":"IF(ISERROR(T54/O54),\"\",T54/O54)","v":""}]
[{"$f":"IF(preencher!#ref!=\"\",\"\",preencher!#ref!)","v":{"$error":"#NAME?"}},{"$f":"IF(preencher!#ref!=\"\",\"\",preencher!#ref!)","v":{"$error":"#NAME?"}},{"$f":"IF(preencher!#ref!=\"\",\"\",preencher!#ref!)","v":{"$error":"#NAME?"}},{"$f":"IF(preencher!#ref!=\"\",\"\",preencher!#ref!)","v":{"$error":"#NAME?"}},{"$f":"IF(preencher!#ref!=\"\",\"\",IF(COUNTIF(preencher!#ref!,preencher!#ref!)=0,CONCATENATE(preencher!#ref!,#REF!),preencher!#ref!))","v":{"$error":"#NAME?"}},{"$f":"IF(preencher!#ref!=\"\",\"\",IF(COUNTIF(preencher!#ref!,preencher!#ref!)=0,CONCATENATE(preencher!#ref!,#REF!),preencher!#ref!))","v":{"$error":"#NAME?"}},{"$f":"IF(preencher!#ref!=\"\",\"\",IF(COUNTIF(preencher!#ref!,preencher!#ref!)=0,CONCATENATE(preencher!#ref!,#REF!),preencher!#ref!))","v":{"$error":"#NAME?"}},{"$f":"IF(preencher!#ref!=\"\",\"\",IF(COUNTIF(preencher!#ref!,preencher!#ref!)=0,CONCATENATE(preencher!#ref!,#REF!),preencher!#ref!))","v":{"$error":"#NAME?"}},{"$f":"IF(preencher!#ref!=\"\",\"\",IF(COUNTIF(preencher!#ref!,preencher!#ref!)=0,CONCATENATE(preencher!#ref!,#REF!),preencher!#ref!))","v":{"$error":"#NAME?"}},{"$f":"IF(preencher!#ref!=\"\",\"\",IF(COUNTIF(preencher!#ref!,preencher!#ref!)=0,CONCATENATE(preencher!#ref!,#REF!),preencher!#ref!))","v":{"$error":"#NAME?"}},{"$f":"IF(preencher!#ref!=\"\",\"\",IF(COUNTIF(preencher!#ref!,preencher!#ref!)=0,CONCATENATE(preencher!#ref!,#REF!),preencher!#ref!))","v":{"$error":"#NAME?"}},{"$f":"IF(preencher!#ref!=\"\",\"\",IF(COUNTIF(preencher!#ref!,preencher!#ref!)=0,CONCATENATE(preencher!#ref!,#REF!),preencher!#ref!))","v":{"$error":"#NAME?"}},{"$f":"IF(preencher!#ref!=\"\",\"\",IF(COUNTIF(preencher!#ref!,preencher!#ref!)=0,CONCATENATE(preencher!#ref!,#REF!),preencher!#ref!))","v":{"$error":"#NAME?"}},{"$f":"IF(preencher!#ref!=\"\",\"\",IF(COUNTIF(preencher!#ref!,preencher!#ref!)=0,CONCATENATE(preencher!#ref!,#REF!),preencher!#ref!))","v":{"$error":"#NAME?"}},{"$f":"IF(ISERROR(ROUND(AVERAGE(E55:N55),2)),\"\",ROUND(AVERAGE(E55:N55),2))","v":""},{"$f":"IF(ISERROR(ROUND(O55*D55,2)),\"\",ROUND(O55*D55,2))","v":""},null,null,{"$f":"IF(ISERROR(MEDIAN(E55:N55)),\"\",MEDIAN(E55:N55))","v":""},{"$f":"IF(ISERROR(STDEV(E55:N55)),\"\",STDEV(E55:N55))","v":""},{"$f":"IF(ISERROR(T55/O55),\"\",T55/O55)","v":""}]
[{"$f":"IF(preencher!#ref!=\"\",\"\",preencher!#ref!)","v":{"$error":"#NAME?"}},{"$f":"IF(preencher!#ref!=\"\",\"\",preencher!#ref!)","v":{"$error":"#NAME?"}},{"$f":"IF(preencher!#ref!=\"\",\"\",preencher!#ref!)","v":{"$error":"#NAME?"}},{"$f":"IF(preencher!#ref!=\"\",\"\",preencher!#ref!)","v":{"$error":"#NAME?"}},{"$f":"IF(preencher!#ref!=\"\",\"\",IF(COUNTIF(preencher!#ref!,preencher!#ref!)=0,CONCATENATE(preencher!#ref!,#REF!),preencher!#ref!))","v":{"$error":"#NAME?"}},{"$f":"IF(preencher!#ref!=\"\",\"\",IF(COUNTIF(preencher!#ref!,preencher!#ref!)=0,CONCATENATE(preencher!#ref!,#REF!),preencher!#ref!))","v":{"$error":"#NAME?"}},{"$f":"IF(preencher!#ref!=\"\",\"\",IF(COUNTIF(preencher!#ref!,preencher!#ref!)=0,CONCATENATE(preencher!#ref!,#REF!),preencher!#ref!))","v":{"$error":"#NAME?"}},{"$f":"IF(preencher!#ref!=\"\",\"\",IF(COUNTIF(preencher!#ref!,preencher!#ref!)=0,CONCATENATE(preencher!#ref!,#REF!),preencher!#ref!))","v":{"$error":"#NAME?"}},{"$f":"IF(preencher!#ref!=\"\",\"\",IF(COUNTIF(preencher!#ref!,preencher!#ref!)=0,CONCATENATE(preencher!#ref!,#REF!),preencher!#ref!))","v":{"$error":"#NAME?"}},{"$f":"IF(preencher!#ref!=\"\",\"\",IF(COUNTIF(preencher!#ref!,preencher!#ref!)=0,CONCATENATE(preencher!#ref!,#REF!),preencher!#ref!))","v":{"$error":"#NAME?"}},{"$f":"IF(preencher!#ref!=\"\",\"\",IF(COUNTIF(preencher!#ref!,preencher!#ref!)=0,CONCATENATE(preencher!#ref!,#REF!),preencher!#ref!))","v":{"$error":"#NAME?"}},{"$f":"IF(preencher!#ref!=\"\",\"\",IF(COUNTIF(preencher!#ref!,preencher!#ref!)=0,CONCATENATE(preencher!#ref!,#REF!),preencher!#ref!))","v":{"$error":"#NAME?"}},{"$f":"IF(preencher!#ref!=\"\",\"\",IF(COUNTIF(preencher!#ref!,preencher!#ref!)=0,CONCATENATE(preencher!#ref!,#REF!),preencher!#ref!))","v":{"$error":"#NAME?"}},{"$f":"IF(preencher!#ref!=\"\",\"\",IF(COUNTIF(preencher!#ref!,preencher!#ref!)=0,CONCATENATE(preencher!#ref!,#REF!),preencher!#ref!))","v":{"$error":"#NAME?"}},{"$f":"IF(ISERROR(ROUND(AVERAGE(E56:N56),2)),\"\",ROUND(AVERAGE(E56:N56),2))","v":""},{"$f":"IF(ISERROR(ROUND(O56*D56,2)),\"\",ROUND(O56*D56,2))","v":""},null,null,{"$f":"IF(ISERROR(MEDIAN(E56:N56)),\"\",MEDIAN(E56:N56))","v":""},{"$f":"IF(ISERROR(STDEV(E56:N56)),\"\",STDEV(E56:N56))","v":""},{"$f":"IF(ISERROR(T56/O56),\"\",T56/O56)","v":""}]
[{"$f":"IF(preencher!#ref!=\"\",\"\",preencher!#ref!)","v":{"$error":"#NAME?"}},{"$f":"IF(preencher!#ref!=\"\",\"\",preencher!#ref!)","v":{"$error":"#NAME?"}},{"$f":"IF(preencher!#ref!=\"\",\"\",preencher!#ref!)","v":{"$error":"#NAME?"}},{"$f":"IF(preencher!#ref!=\"\",\"\",preencher!#ref!)","v":{"$error":"#NAME?"}},{"$f":"IF(preencher!#ref!=\"\",\"\",IF(COUNTIF(preencher!#ref!,preencher!#ref!)=0,CONCATENATE(preencher!#ref!,#REF!),preencher!#ref!))","v":{"$error":"#NAME?"}},{"$f":"IF(preencher!#ref!=\"\",\"\",IF(COUNTIF(preencher!#ref!,preencher!#ref!)=0,CONCATENATE(preencher!#ref!,#REF!),preencher!#ref!))","v":{"$error":"#NAME?"}},{"$f":"IF(preencher!#ref!=\"\",\"\",IF(COUNTIF(preencher!#ref!,preencher!#ref!)=0,CONCATENATE(preencher!#ref!,#REF!),preencher!#ref!))","v":{"$error":"#NAME?"}},{"$f":"IF(preencher!#ref!=\"\",\"\",IF(COUNTIF(preencher!#ref!,preencher!#ref!)=0,CONCATENATE(preencher!#ref!,#REF!),preencher!#ref!))","v":{"$error":"#NAME?"}},{"$f":"IF(preencher!#ref!=\"\",\"\",IF(COUNTIF(preencher!#ref!,preencher!#ref!)=0,CONCATENATE(preencher!#ref!,#REF!),preencher!#ref!))","v":{"$error":"#NAME?"}},{"$f":"IF(preencher!#ref!=\"\",\"\",IF(COUNTIF(preencher!#ref!,preencher!#ref!)=0,CONCATENATE(preencher!#ref!,#REF!),preencher!#ref!))","v":{"$error":"#NAME?"}},{"$f":"IF(preencher!#ref!=\"\",\"\",IF(COUNTIF(preencher!#ref!,preencher!#ref!)=0,CONCATENATE(preencher!#ref!,#REF!),preencher!#ref!))","v":{"$error":"#NAME?"}},{"$f":"IF(preencher!#ref!=\"\",\"\",IF(COUNTIF(preencher!#ref!,preencher!#ref!)=0,CONCATENATE(preencher!#ref!,#REF!),preencher!#ref!))","v":{"$error":"#NAME?"}},{"$f":"IF(preencher!#ref!=\"\",\"\",IF(COUNTIF(preencher!#ref!,preencher!#ref!)=0,CONCATENATE(preencher!#ref!,#REF!),preencher!#ref!))","v":{"$error":"#NAME?"}},{"$f":"IF(preencher!#ref!=\"\",\"\",IF(COUNTIF(preencher!#ref!,preencher!#ref!)=0,CONCATENATE(preencher!#ref!,#REF!),preencher!#ref!))","v":{"$error":"#NAME?"}},{"$f":"IF(ISERROR(ROUND(AVERAGE(E57:N57),2)),\"\",ROUND(AVERAGE(E57:N57),2))","v":""},{"$f":"IF(ISERROR(ROUND(O57*D57,2)),\"\",ROUND(O57*D57,2))","v":""},null,null,{"$f":"IF(ISERROR(MEDIAN(E57:N57)),\"\",MEDIAN(E57:N57))","v":""},{"$f":"IF(ISERROR(STDEV(E57:N57)),\"\",STDEV(E57:N57))","v":""},{"$f":"IF(ISERROR(T57/O57),\"\",T57/O57)","v":""}]
[{"$f":"IF(preencher!#ref!=\"\",\"\",preencher!#ref!)","v":{"$error":"#NAME?"}},{"$f":"IF(preencher!#ref!=\"\",\"\",preencher!#ref!)","v":{"$error":"#NAME?"}},{"$f":"IF(preencher!#ref!=\"\",\"\",preencher!#ref!)","v":{"$error":"#NAME?"}},{"$f":"IF(preencher!#ref!=\"\",\"\",preencher!#ref!)","v":{"$error":"#NAME?"}},{"$f":"IF(preencher!#ref!=\"\",\"\",IF(COUNTIF(preencher!#ref!,preencher!#ref!)=0,CONCATENATE(preencher!#ref!,#REF!),preencher!#ref!))","v":{"$error":"#NAME?"}},{"$f":"IF(preencher!#ref!=\"\",\"\",IF(COUNTIF(preencher!#ref!,preencher!#ref!)=0,CONCATENATE(preencher!#ref!,#REF!),preencher!#ref!))","v":{"$error":"#NAME?"}},{"$f":"IF(preencher!#ref!=\"\",\"\",IF(COUNTIF(preencher!#ref!,preencher!#ref!)=0,CONCATENATE(preencher!#ref!,#REF!),preencher!#ref!))","v":{"$error":"#NAME?"}},{"$f":"IF(preencher!#ref!=\"\",\"\",IF(COUNTIF(preencher!#ref!,preencher!#ref!)=0,CONCATENATE(preencher!#ref!,#REF!),preencher!#ref!))","v":{"$error":"#NAME?"}},{"$f":"IF(preencher!#ref!=\"\",\"\",IF(COUNTIF(preencher!#ref!,preencher!#ref!)=0,CONCATENATE(preencher!#ref!,#REF!),preencher!#ref!))","v":{"$error":"#NAME?"}},{"$f":"IF(preencher!#ref!=\"\",\"\",IF(COUNTIF(preencher!#ref!,preencher!#ref!)=0,CONCATENATE(preencher!#ref!,#REF!),preencher!#ref!))","v":{"$error":"#NAME?"}},{"$f":"IF(preencher!#ref!=\"\",\"\",IF(COUNTIF(preencher!#ref!,preencher!#ref!)=0,CONCATENATE(preencher!#ref!,#REF!),preencher!#ref!))","v":{"$error":"#NAME?"}},{"$f":"IF(preencher!#ref!=\"\",\"\",IF(COUNTIF(preencher!#ref!,preencher!#ref!)=0,CONCATENATE(preencher!#ref!,#REF!),preencher!#ref!))","v":{"$error":"#NAME?"}},{"$f":"IF(preencher!#ref!=\"\",\"\",IF(COUNTIF(preencher!#ref!,preencher!#ref!)=0,CONCATENATE(preencher!#ref!,#REF!),preencher!#ref!))","v":{"$error":"#NAME?"}},{"$f":"IF(preencher!#ref!=\"\",\"\",IF(COUNTIF(preencher!#ref!,preencher!#ref!)=0,CONCATENATE(preencher!#ref!,#REF!),preencher!#ref!))","v":{"$error":"#NAME?"}},{"$f":"IF(ISERROR(ROUND(AVERAGE(E58:N58),2)),\"\",ROUND(AVERAGE(E58:N58),2))","v":""},{"$f":"IF(ISERROR(ROUND(O58*D58,2)),\"\",ROUND(O58*D58,2))","v":""},null,null,{"$f":"IF(ISERROR(MEDIAN(E58:N58)),\"\",MEDIAN(E58:N58))","v":""},{"$f":"IF(ISERROR(STDEV(E58:N58)),\"\",STDEV(E58:N58))","v":""},{"$f":"IF(ISERROR(T58/O58),\"\",T58/O58)","v":""}]
[{"$f":"IF(preencher!#ref!=\"\",\"\",preencher!#ref!)","v":{"$error":"#NAME?"}},{"$f":"IF(preencher!#ref!=\"\",\"\",preencher!#ref!)","v":{"$error":"#NAME?"}},{"$f":"IF(preencher!#ref!=\"\",\"\",preencher!#ref!)","v":{"$error":"#NAME?"}},{"$f":"IF(preencher!#ref!=\"\",\"\",preencher!#ref!)","v":{"$error":"#NAME?"}},{"$f":"IF(preencher!#ref!=\"\",\"\",IF(COUNTIF(preencher!#ref!,preencher!#ref!)=0,CONCATENATE(preencher!#ref!,#REF!),preencher!#ref!))","v":{"$error":"#NAME?"}},{"$f":"IF(preencher!#ref!=\"\",\"\",IF(COUNTIF(preencher!#ref!,preencher!#ref!)=0,CONCATENATE(preencher!#ref!,#REF!),preencher!#ref!))","v":{"$error":"#NAME?"}},{"$f":"IF(preencher!#ref!=\"\",\"\",IF(COUNTIF(preencher!#ref!,preencher!#ref!)=0,CONCATENATE(preencher!#ref!,#REF!),preencher!#ref!))","v":{"$error":"#NAME?"}},{"$f":"IF(preencher!#ref!=\"\",\"\",IF(COUNTIF(preencher!#ref!,preencher!#ref!)=0,CONCATENATE(preencher!#ref!,#REF!),preencher!#ref!))","v":{"$error":"#NAME?"}},{"$f":"IF(preencher!#ref!=\"\",\"\",IF(COUNTIF(preencher!#ref!,preencher!#ref!)=0,CONCATENATE(preencher!#ref!,#REF!),preencher!#ref!))","v":{"$error":"#NAME?"}},{"$f":"IF(preencher!#ref!=\"\",\"\",IF(COUNTIF(preencher!#ref!,preencher!#ref!)=0,CONCATENATE(preencher!#ref!,#REF!),preencher!#ref!))","v":{"$error":"#NAME?"}},{"$f":"IF(preencher!#ref!=\"\",\"\",IF(COUNTIF(preencher!#ref!,preencher!#ref!)=0,CONCATENATE(preencher!#ref!,#REF!),preencher!#ref!))","v":{"$error":"#NAME?"}},{"$f":"IF(preencher!#ref!=\"\",\"\",IF(COUNTIF(preencher!#ref!,preencher!#ref!)=0,CONCATENATE(preencher!#ref!,#REF!),preencher!#ref!))","v":{"$error":"#NAME?"}},{"$f":"IF(preencher!#ref!=\"\",\"\",IF(COUNTIF(preencher!#ref!,preencher!#ref!)=0,CONCATENATE(preencher!#ref!,#REF!),preencher!#ref!))","v":{"$error":"#NAME?"}},{"$f":"IF(preencher!#ref!=\"\",\"\",IF(COUNTIF(preencher!#ref!,preencher!#ref!)=0,CONCATENATE(preencher!#ref!,#REF!),preencher!#ref!))","v":{"$error":"#NAME?"}},{"$f":"IF(ISERROR(ROUND(AVERAGE(E59:N59),2)),\"\",ROUND(AVERAGE(E59:N59),2))","v":""},{"$f":"IF(ISERROR(ROUND(O59*D59,2)),\"\",ROUND(O59*D59,2))","v":""},null,null,{"$f":"IF(ISERROR(MEDIAN(E59:N59)),\"\",MEDIAN(E59:N59))","v":""},{"$f":"IF(ISERROR(STDEV(E59:N59)),\"\",STDEV(E59:N59))","v":""},{"$f":"IF(ISERROR(T59/O59),\"\",T59/O59)","v":""}]
[{"$f":"IF(preencher!#ref!=\"\",\"\",preencher!#ref!)","v":{"$error":"#NAME?"}},{"$f":"IF(preencher!#ref!=\"\",\"\",preencher!#ref!)","v":{"$error":"#NAME?"}},{"$f":"IF(preencher!#ref!=\"\",\"\",preencher!#ref!)","v":{"$error":"#NAME?"}},{"$f":"IF(preencher!#ref!=\"\",\"\",preencher!#ref!)","v":{"$error":"#NAME?"}},{"$f":"IF(preencher!#ref!=\"\",\"\",IF(COUNTIF(preencher!#ref!,preencher!#ref!)=0,CONCATENATE(preencher!#ref!,#REF!),preencher!#ref!))","v":{"$error":"#NAME?"}},{"$f":"IF(preencher!#ref!=\"\",\"\",IF(COUNTIF(preencher!#ref!,preencher!#ref!)=0,CONCATENATE(preencher!#ref!,#REF!),preencher!#ref!))","v":{"$error":"#NAME?"}},{"$f":"IF(preencher!#ref!=\"\",\"\",IF(COUNTIF(preencher!#ref!,preencher!#ref!)=0,CONCATENATE(preencher!#ref!,#REF!),preencher!#ref!))","v":{"$error":"#NAME?"}},{"$f":"IF(preencher!#ref!=\"\",\"\",IF(COUNTIF(preencher!#ref!,preencher!#ref!)=0,CONCATENATE(preencher!#ref!,#REF!),preencher!#ref!))","v":{"$error":"#NAME?"}},{"$f":"IF(preencher!#ref!=\"\",\"\",IF(COUNTIF(preencher!#ref!,preencher!#ref!)=0,CONCATENATE(preencher!#ref!,#REF!),preencher!#ref!))","v":{"$error":"#NAME?"}},{"$f":"IF(preencher!#ref!=\"\",\"\",IF(COUNTIF(preencher!#ref!,preencher!#ref!)=0,CONCATENATE(preencher!#ref!,#REF!),preencher!#ref!))","v":{"$error":"#NAME?"}},{"$f":"IF(preencher!#ref!=\"\",\"\",IF(COUNTIF(preencher!#ref!,preencher!#ref!)=0,CONCATENATE(preencher!#ref!,#REF!),preencher!#ref!))","v":{"$error":"#NAME?"}},{"$f":"IF(preencher!#ref!=\"\",\"\",IF(COUNTIF(preencher!#ref!,preencher!#ref!)=0,CONCATENATE(preencher!#ref!,#REF!),preencher!#ref!))","v":{"$error":"#NAME?"}},{"$f":"IF(preencher!#ref!=\"\",\"\",IF(COUNTIF(preencher!#ref!,preencher!#ref!)=0,CONCATENATE(preencher!#ref!,#REF!),preencher!#ref!))","v":{"$error":"#NAME?"}},{"$f":"IF(preencher!#ref!=\"\",\"\",IF(COUNTIF(preencher!#ref!,preencher!#ref!)=0,CONCATENATE(preencher!#ref!,#REF!),preencher!#ref!))","v":{"$error":"#NAME?"}},{"$f":"IF(ISERROR(ROUND(AVERAGE(E60:N60),2)),\"\",ROUND(AVERAGE(E60:N60),2))","v":""},{"$f":"IF(ISERROR(ROUND(O60*D60,2)),\"\",ROUND(O60*D60,2))","v":""},null,null,{"$f":"IF(ISERROR(MEDIAN(E60:N60)),\"\",MEDIAN(E60:N60))","v":""},{"$f":"IF(ISERROR(STDEV(E60:N60)),\"\",STDEV(E60:N60))","v":""},{"$f":"IF(ISERROR(T60/O60),\"\",T60/O60)","v":""}]
[{"$f":"IF(preencher!#ref!=\"\",\"\",preencher!#ref!)","v":{"$error":"#NAME?"}},{"$f":"IF(preencher!#ref!=\"\",\"\",preencher!#ref!)","v":{"$error":"#NAME?"}},{"$f":"IF(preencher!#ref!=\"\",\"\",preencher!#ref!)","v":{"$error":"#NAME?"}},{"$f":"IF(preencher!#ref!=\"\",\"\",preencher!#ref!)","v":{"$error":"#NAME?"}},{"$f":"IF(preencher!#ref!=\"\",\"\",IF(COUNTIF(preencher!#ref!,preencher!#ref!)=0,CONCATENATE(preencher!#ref!,#REF!),preencher!#ref!))","v":{"$error":"#NAME?"}},{"$f":"IF(preencher!#ref!=\"\",\"\",IF(COUNTIF(preencher!#ref!,preencher!#ref!)=0,CONCATENATE(preencher!#ref!,#REF!),preencher!#ref!))","v":{"$error":"#NAME?"}},{"$f":"IF(preencher!#ref!=\"\",\"\",IF(COUNTIF(preencher!#ref!,preencher!#ref!)=0,CONCATENATE(preencher!#ref!,#REF!),preencher!#ref!))","v":{"$error":"#NAME?"}},{"$f":"IF(preencher!#ref!=\"\",\"\",IF(COUNTIF(preencher!#ref!,preencher!#ref!)=0,CONCATENATE(preencher!#ref!,#REF!),preencher!#ref!))","v":{"$error":"#NAME?"}},{"$f":"IF(preencher!#ref!=\"\",\"\",IF(COUNTIF(preencher!#ref!,preencher!#ref!)=0,CONCATENATE(preencher!#ref!,#REF!),preencher!#ref!))","v":{"$error":"#NAME?"}},{"$f":"IF(preencher!#ref!=\"\",\"\",IF(COUNTIF(preencher!#ref!,preencher!#ref!)=0,CONCATENATE(preencher!#ref!,#REF!),preencher!#ref!))","v":{"$error":"#NAME?"}},{"$f":"IF(preencher!#ref!=\"\",\"\",IF(COUNTIF(preencher!#ref!,preencher!#ref!)=0,CONCATENATE(preencher!#ref!,#REF!),preencher!#ref!))","v":{"$error":"#NAME?"}},{"$f":"IF(preencher!#ref!=\"\",\"\",IF(COUNTIF(preencher!#ref!,preencher!#ref!)=0,CONCATENATE(preencher!#ref!,#REF!),preencher!#ref!))","v":{"$error":"#NAME?"}},{"$f":"IF(preencher!#ref!=\"\",\"\",IF(COUNTIF(preencher!#ref!,preencher!#ref!)=0,CONCATENATE(preencher!#ref!,#REF!),preencher!#ref!))","v":{"$error":"#NAME?"}},{"$f":"IF(preencher!#ref!=\"\",\"\",IF(COUNTIF(preencher!#ref!,preencher!#ref!)=0,CONCATENATE(preencher!#ref!,#REF!),preencher!#ref!))","v":{"$error":"#NAME?"}},{"$f":"IF(ISERROR(ROUND(AVERAGE(E61:N61),2)),\"\",ROUND(AVERAGE(E61:N61),2))","v":""},{"$f":"IF(ISERROR(ROUND(O61*D61,2)),\"\",ROUND(O61*D61,2))","v":""},null,null,{"$f":"IF(ISERROR(MEDIAN(E61:N61)),\"\",MEDIAN(E61:N61))","v":""},{"$f":"IF(ISERROR(STDEV(E61:N61)),\"\",STDEV(E61:N61))","v":""},{"$f":"IF(ISERROR(T61/O61),\"\",T61/O61)","v":""}]
[{"$f":"IF(preencher!#ref!=\"\",\"\",preencher!#ref!)","v":{"$error":"#NAME?"}},{"$f":"IF(preencher!#ref!=\"\",\"\",preencher!#ref!)","v":{"$error":"#NAME?"}},{"$f":"IF(preencher!#ref!=\"\",\"\",preencher!#ref!)","v":{"$error":"#NAME?"}},{"$f":"IF(preencher!#ref!=\"\",\"\",preencher!#ref!)","v":{"$error":"#NAME?"}},{"$f":"IF(preencher!#ref!=\"\",\"\",IF(COUNTIF(preencher!#ref!,preencher!#ref!)=0,CONCATENATE(preencher!#ref!,#REF!),preencher!#ref!))","v":{"$error":"#NAME?"}},{"$f":"IF(preencher!#ref!=\"\",\"\",IF(COUNTIF(preencher!#ref!,preencher!#ref!)=0,CONCATENATE(preencher!#ref!,#REF!),preencher!#ref!))","v":{"$error":"#NAME?"}},{"$f":"IF(preencher!#ref!=\"\",\"\",IF(COUNTIF(preencher!#ref!,preencher!#ref!)=0,CONCATENATE(preencher!#ref!,#REF!),preencher!#ref!))","v":{"$error":"#NAME?"}},{"$f":"IF(preencher!#ref!=\"\",\"\",IF(COUNTIF(preencher!#ref!,preencher!#ref!)=0,CONCATENATE(preencher!#ref!,#REF!),preencher!#ref!))","v":{"$error":"#NAME?"}},{"$f":"IF(preencher!#ref!=\"\",\"\",IF(COUNTIF(preencher!#ref!,preencher!#ref!)=0,CONCATENATE(preencher!#ref!,#REF!),preencher!#ref!))","v":{"$error":"#NAME?"}},{"$f":"IF(preencher!#ref!=\"\",\"\",IF(COUNTIF(preencher!#ref!,preencher!#ref!)=0,CONCATENATE(preencher!#ref!,#REF!),preencher!#ref!))","v":{"$error":"#NAME?"}},{"$f":"IF(preencher!#ref!=\"\",\"\",IF(COUNTIF(preencher!#ref!,preencher!#ref!)=0,CONCATENATE(preencher!#ref!,#REF!),preencher!#ref!))","v":{"$error":"#NAME?"}},{"$f":"IF(preencher!#ref!=\"\",\"\",IF(COUNTIF(preencher!#ref!,preencher!#ref!)=0,CONCATENATE(preencher!#ref!,#REF!),preencher!#ref!))","v":{"$error":"#NAME?"}},{"$f":"IF(preencher!#ref!=\"\",\"\",IF(COUNTIF(preencher!#ref!,preencher!#ref!)=0,CONCATENATE(preencher!#ref!,#REF!),preencher!#ref!))","v":{"$error":"#NAME?"}},{"$f":"IF(preencher!#ref!=\"\",\"\",IF(COUNTIF(preencher!#ref!,preencher!#ref!)=0,CONCATENATE(preencher!#ref!,#REF!),preencher!#ref!))","v":{"$error":"#NAME?"}},{"$f":"IF(ISERROR(ROUND(AVERAGE(E62:N62),2)),\"\",ROUND(AVERAGE(E62:N62),2))","v":""},{"$f":"IF(ISERROR(ROUND(O62*D62,2)),\"\",ROUND(O62*D62,2))","v":""},null,null,{"$f":"IF(ISERROR(MEDIAN(E62:N62)),\"\",MEDIAN(E62:N62))","v":""},{"$f":"IF(ISERROR(STDEV(E62:N62)),\"\",STDEV(E62:N62))","v":""},{"$f":"IF(ISERROR(T62/O62),\"\",T62/O62)","v":""}]
[{"$f":"IF(preencher!#ref!=\"\",\"\",preencher!#ref!)","v":{"$error":"#NAME?"}},{"$f":"IF(preencher!#ref!=\"\",\"\",preencher!#ref!)","v":{"$error":"#NAME?"}},{"$f":"IF(preencher!#ref!=\"\",\"\",preencher!#ref!)","v":{"$error":"#NAME?"}},{"$f":"IF(preencher!#ref!=\"\",\"\",preencher!#ref!)","v":{"$error":"#NAME?"}},{"$f":"IF(preencher!#ref!=\"\",\"\",IF(COUNTIF(preencher!#ref!,preencher!#ref!)=0,CONCATENATE(preencher!#ref!,#REF!),preencher!#ref!))","v":{"$error":"#NAME?"}},{"$f":"IF(preencher!#ref!=\"\",\"\",IF(COUNTIF(preencher!#ref!,preencher!#ref!)=0,CONCATENATE(preencher!#ref!,#REF!),preencher!#ref!))","v":{"$error":"#NAME?"}},{"$f":"IF(preencher!#ref!=\"\",\"\",IF(COUNTIF(preencher!#ref!,preencher!#ref!)=0,CONCATENATE(preencher!#ref!,#REF!),preencher!#ref!))","v":{"$error":"#NAME?"}},{"$f":"IF(preencher!#ref!=\"\",\"\",IF(COUNTIF(preencher!#ref!,preencher!#ref!)=0,CONCATENATE(preencher!#ref!,#REF!),preencher!#ref!))","v":{"$error":"#NAME?"}},{"$f":"IF(preencher!#ref!=\"\",\"\",IF(COUNTIF(preencher!#ref!,preencher!#ref!)=0,CONCATENATE(preencher!#ref!,#REF!),preencher!#ref!))","v":{"$error":"#NAME?"}},{"$f":"IF(preencher!#ref!=\"\",\"\",IF(COUNTIF(preencher!#ref!,preencher!#ref!)=0,CONCATENATE(preencher!#ref!,#REF!),preencher!#ref!))","v":{"$error":"#NAME?"}},{"$f":"IF(preencher!#ref!=\"\",\"\",IF(COUNTIF(preencher!#ref!,preencher!#ref!)=0,CONCATENATE(preencher!#ref!,#REF!),preencher!#ref!))","v":{"$error":"#NAME?"}},{"$f":"IF(preencher!#ref!=\"\",\"\",IF(COUNTIF(preencher!#ref!,preencher!#ref!)=0,CONCATENATE(preencher!#ref!,#REF!),preencher!#ref!))","v":{"$error":"#NAME?"}},{"$f":"IF(preencher!#ref!=\"\",\"\",IF(COUNTIF(preencher!#ref!,preencher!#ref!)=0,CONCATENATE(preencher!#ref!,#REF!),preencher!#ref!))","v":{"$error":"#NAME?"}},{"$f":"IF(preencher!#ref!=\"\",\"\",IF(COUNTIF(preencher!#ref!,preencher!#ref!)=0,CONCATENATE(preencher!#ref!,#REF!),preencher!#ref!))","v":{"$error":"#NAME?"}},{"$f":"IF(ISERROR(ROUND(AVERAGE(E63:N63),2)),\"\",ROUND(AVERAGE(E63:N63),2))","v":""},{"$f":"IF(ISERROR(ROUND(O63*D63,2)),\"\",ROUND(O63*D63,2))","v":""},null,null,{"$f":"IF(ISERROR(MEDIAN(E63:N63)),\"\",MEDIAN(E63:N63))","v":""},{"$f":"IF(ISERROR(STDEV(E63:N63)),\"\",STDEV(E63:N63))","v":""},{"$f":"IF(ISERROR(T63/O63),\"\",T63/O63)","v":""}]
[{"$f":"IF(preencher!#ref!=\"\",\"\",preencher!#ref!)","v":{"$error":"#NAME?"}},{"$f":"IF(preencher!#ref!=\"\",\"\",preencher!#ref!)","v":{"$error":"#NAME?"}},{"$f":"IF(preencher!#ref!=\"\",\"\",preencher!#ref!)","v":{"$error":"#NAME?"}},{"$f":"IF(preencher!#ref!=\"\",\"\",preencher!#ref!)","v":{"$error":"#NAME?"}},{"$f":"IF(preencher!#ref!=\"\",\"\",IF(COUNTIF(preencher!#ref!,preencher!#ref!)=0,CONCATENATE(preencher!#ref!,#REF!),preencher!#ref!))","v":{"$error":"#NAME?"}},{"$f":"IF(preencher!#ref!=\"\",\"\",IF(COUNTIF(preencher!#ref!,preencher!#ref!)=0,CONCATENATE(preencher!#ref!,#REF!),preencher!#ref!))","v":{"$error":"#NAME?"}},{"$f":"IF(preencher!#ref!=\"\",\"\",IF(COUNTIF(preencher!#ref!,preencher!#ref!)=0,CONCATENATE(preencher!#ref!,#REF!),preencher!#ref!))","v":{"$error":"#NAME?"}},{"$f":"IF(preencher!#ref!=\"\",\"\",IF(COUNTIF(preencher!#ref!,preencher!#ref!)=0,CONCATENATE(preencher!#ref!,#REF!),preencher!#ref!))","v":{"$error":"#NAME?"}},{"$f":"IF(preencher!#ref!=\"\",\"\",IF(COUNTIF(preencher!#ref!,preencher!#ref!)=0,CONCATENATE(preencher!#ref!,#REF!),preencher!#ref!))","v":{"$error":"#NAME?"}},{"$f":"IF(preencher!#ref!=\"\",\"\",IF(COUNTIF(preencher!#ref!,preencher!#ref!)=0,CONCATENATE(preencher!#ref!,#REF!),preencher!#ref!))","v":{"$error":"#NAME?"}},{"$f":"IF(preencher!#ref!=\"\",\"\",IF(COUNTIF(preencher!#ref!,preencher!#ref!)=0,CONCATENATE(preencher!#ref!,#REF!),preencher!#ref!))","v":{"$error":"#NAME?"}},{"$f":"IF(preencher!#ref!=\"\",\"\",IF(COUNTIF(preencher!#ref!,preencher!#ref!)=0,CONCATENATE(preencher!#ref!,#REF!),preencher!#ref!))","v":{"$error":"#NAME?"}},{"$f":"IF(preencher!#ref!=\"\",\"\",IF(COUNTIF(preencher!#ref!,preencher!#ref!)=0,CONCATENATE(preencher!#ref!,#REF!),preencher!#ref!))","v":{"$error":"#NAME?"}},{"$f":"IF(preencher!#ref!=\"\",\"\",IF(COUNTIF(preencher!#ref!,preencher!#ref!)=0,CONCATENATE(preencher!#ref!,#REF!),preencher!#ref!))","v":{"$error":"#NAME?"}},{"$f":"IF(ISERROR(ROUND(AVERAGE(E64:N64),2)),\"\",ROUND(AVERAGE(E64:N64),2))","v":""},{"$f":"IF(ISERROR(ROUND(O64*D64,2)),\"\",ROUND(O64*D64,2))","v":""},null,null,{"$f":"IF(ISERROR(MEDIAN(E64:N64)),\"\",MEDIAN(E64:N64))","v":""},{"$f":"IF(ISERROR(STDEV(E64:N64)),\"\",STDEV(E64:N64))","v":""},{"$f":"IF(ISERROR(T64/O64),\"\",T64/O64)","v":""}]
[{"$f":"IF(preencher!#ref!=\"\",\"\",preencher!#ref!)","v":{"$error":"#NAME?"}},{"$f":"IF(preencher!#ref!=\"\",\"\",preencher!#ref!)","v":{"$error":"#NAME?"}},{"$f":"IF(preencher!#ref!=\"\",\"\",preencher!#ref!)","v":{"$error":"#NAME?"}},{"$f":"IF(preencher!#ref!=\"\",\"\",preencher!#ref!)","v":{"$error":"#NAME?"}},{"$f":"IF(preencher!#ref!=\"\",\"\",IF(COUNTIF(preencher!#ref!,preencher!#ref!)=0,CONCATENATE(preencher!#ref!,#REF!),preencher!#ref!))","v":{"$error":"#NAME?"}},{"$f":"IF(preencher!#ref!=\"\",\"\",IF(COUNTIF(preencher!#ref!,preencher!#ref!)=0,CONCATENATE(preencher!#ref!,#REF!),preencher!#ref!))","v":{"$error":"#NAME?"}},{"$f":"IF(preencher!#ref!=\"\",\"\",IF(COUNTIF(preencher!#ref!,preencher!#ref!)=0,CONCATENATE(preencher!#ref!,#REF!),preencher!#ref!))","v":{"$error":"#NAME?"}},{"$f":"IF(preencher!#ref!=\"\",\"\",IF(COUNTIF(preencher!#ref!,preencher!#ref!)=0,CONCATENATE(preencher!#ref!,#REF!),preencher!#ref!))","v":{"$error":"#NAME?"}},{"$f":"IF(preencher!#ref!=\"\",\"\",IF(COUNTIF(preencher!#ref!,preencher!#ref!)=0,CONCATENATE(preencher!#ref!,#REF!),preencher!#ref!))","v":{"$error":"#NAME?"}},{"$f":"IF(preencher!#ref!=\"\",\"\",IF(COUNTIF(preencher!#ref!,preencher!#ref!)=0,CONCATENATE(preencher!#ref!,#REF!),preencher!#ref!))","v":{"$error":"#NAME?"}},{"$f":"IF(preencher!#ref!=\"\",\"\",IF(COUNTIF(preencher!#ref!,preencher!#ref!)=0,CONCATENATE(preencher!#ref!,#REF!),preencher!#ref!))","v":{"$error":"#NAME?"}},{"$f":"IF(preencher!#ref!=\"\",\"\",IF(COUNTIF(preencher!#ref!,preencher!#ref!)=0,CONCATENATE(preencher!#ref!,#REF!),preencher!#ref!))","v":{"$error":"#NAME?"}},{"$f":"IF(preencher!#ref!=\"\",\"\",IF(COUNTIF(preencher!#ref!,preencher!#ref!)=0,CONCATENATE(preencher!#ref!,#REF!),preencher!#ref!))","v":{"$error":"#NAME?"}},{"$f":"IF(preencher!#ref!=\"\",\"\",IF(COUNTIF(preencher!#ref!,preencher!#ref!)=0,CONCATENATE(preencher!#ref!,#REF!),preencher!#ref!))","v":{"$error":"#NAME?"}},{"$f":"IF(ISERROR(ROUND(AVERAGE(E65:N65),2)),\"\",ROUND(AVERAGE(E65:N65),2))","v":""},{"$f":"IF(ISERROR(ROUND(O65*D65,2)),\"\",ROUND(O65*D65,2))","v":""},null,null,{"$f":"IF(ISERROR(MEDIAN(E65:N65)),\"\",MEDIAN(E65:N65))","v":""},{"$f":"IF(ISERROR(STDEV(E65:N65)),\"\",STDEV(E65:N65))","v":""},{"$f":"IF(ISERROR(T65/O65),\"\",T65/O65)","v":""}]
[{"$f":"IF(preencher!#ref!=\"\",\"\",preencher!#ref!)","v":{"$error":"#NAME?"}},{"$f":"IF(preencher!#ref!=\"\",\"\",preencher!#ref!)","v":{"$error":"#NAME?"}},{"$f":"IF(preencher!#ref!=\"\",\"\",preencher!#ref!)","v":{"$error":"#NAME?"}},{"$f":"IF(preencher!#ref!=\"\",\"\",preencher!#ref!)","v":{"$error":"#NAME?"}},{"$f":"IF(preencher!#ref!=\"\",\"\",IF(COUNTIF(preencher!#ref!,preencher!#ref!)=0,CONCATENATE(preencher!#ref!,#REF!),preencher!#ref!))","v":{"$error":"#NAME?"}},{"$f":"IF(preencher!#ref!=\"\",\"\",IF(COUNTIF(preencher!#ref!,preencher!#ref!)=0,CONCATENATE(preencher!#ref!,#REF!),preencher!#ref!))","v":{"$error":"#NAME?"}},{"$f":"IF(preencher!#ref!=\"\",\"\",IF(COUNTIF(preencher!#ref!,preencher!#ref!)=0,CONCATENATE(preencher!#ref!,#REF!),preencher!#ref!))","v":{"$error":"#NAME?"}},{"$f":"IF(preencher!#ref!=\"\",\"\",IF(COUNTIF(preencher!#ref!,preencher!#ref!)=0,CONCATENATE(preencher!#ref!,#REF!),preencher!#ref!))","v":{"$error":"#NAME?"}},{"$f":"IF(preencher!#ref!=\"\",\"\",IF(COUNTIF(preencher!#ref!,preencher!#ref!)=0,CONCATENATE(preencher!#ref!,#REF!),preencher!#ref!))","v":{"$error":"#NAME?"}},{"$f":"IF(preencher!#ref!=\"\",\"\",IF(COUNTIF(preencher!#ref!,preencher!#ref!)=0,CONCATENATE(preencher!#ref!,#REF!),preencher!#ref!))","v":{"$error":"#NAME?"}},{"$f":"IF(preencher!#ref!=\"\",\"\",IF(COUNTIF(preencher!#ref!,preencher!#ref!)=0,CONCATENATE(preencher!#ref!,#REF!),preencher!#ref!))","v":{"$error":"#NAME?"}},{"$f":"IF(preencher!#ref!=\"\",\"\",IF(COUNTIF(preencher!#ref!,preencher!#ref!)=0,CONCATENATE(preencher!#ref!,#REF!),preencher!#ref!))","v":{"$error":"#NAME?"}},{"$f":"IF(preencher!#ref!=\"\",\"\",IF(COUNTIF(preencher!#ref!,preencher!#ref!)=0,CONCATENATE(preencher!#ref!,#REF!),preencher!#ref!))","v":{"$error":"#NAME?"}},{"$f":"IF(preencher!#ref!=\"\",\"\",IF(COUNTIF(preencher!#ref!,preencher!#ref!)=0,CONCATENATE(preencher!#ref!,#REF!),preencher!#ref!))","v":{"$error":"#NAME?"}},{"$f":"IF(ISERROR(ROUND(AVERAGE(E66:N66),2)),\"\",ROUND(AVERAGE(E66:N66),2))","v":""},{"$f":"IF(ISERROR(ROUND(O66*D66,2)),\"\",ROUND(O66*D66,2))","v":""},null,null,{"$f":"IF(ISERROR(MEDIAN(E66:N66)),\"\",MEDIAN(E66:N66))","v":""},{"$f":"IF(ISERROR(STDEV(E66:N66)),\"\",STDEV(E66:N66))","v":""},{"$f":"IF(ISERROR(T66/O66),\"\",T66/O66)","v":""}]
[{"$f":"IF(preencher!#ref!=\"\",\"\",preencher!#ref!)","v":{"$error":"#NAME?"}},{"$f":"IF(preencher!#ref!=\"\",\"\",preencher!#ref!)","v":{"$error":"#NAME?"}},{"$f":"IF(preencher!#ref!=\"\",\"\",preencher!#ref!)","v":{"$error":"#NAME?"}},{"$f":"IF(preencher!#ref!=\"\",\"\",preencher!#ref!)","v":{"$error":"#NAME?"}},{"$f":"IF(preencher!#ref!=\"\",\"\",IF(COUNTIF(preencher!#ref!,preencher!#ref!)=0,CONCATENATE(preencher!#ref!,#REF!),preencher!#ref!))","v":{"$error":"#NAME?"}},{"$f":"IF(preencher!#ref!=\"\",\"\",IF(COUNTIF(preencher!#ref!,preencher!#ref!)=0,CONCATENATE(preencher!#ref!,#REF!),preencher!#ref!))","v":{"$error":"#NAME?"}},{"$f":"IF(preencher!#ref!=\"\",\"\",IF(COUNTIF(preencher!#ref!,preencher!#ref!)=0,CONCATENATE(preencher!#ref!,#REF!),preencher!#ref!))","v":{"$error":"#NAME?"}},{"$f":"IF(preencher!#ref!=\"\",\"\",IF(COUNTIF(preencher!#ref!,preencher!#ref!)=0,CONCATENATE(preencher!#ref!,#REF!),preencher!#ref!))","v":{"$error":"#NAME?"}},{"$f":"IF(preencher!#ref!=\"\",\"\",IF(COUNTIF(preencher!#ref!,preencher!#ref!)=0,CONCATENATE(preencher!#ref!,#REF!),preencher!#ref!))","v":{"$error":"#NAME?"}},{"$f":"IF(preencher!#ref!=\"\",\"\",IF(COUNTIF(preencher!#ref!,preencher!#ref!)=0,CONCATENATE(preencher!#ref!,#REF!),preencher!#ref!))","v":{"$error":"#NAME?"}},{"$f":"IF(preencher!#ref!=\"\",\"\",IF(COUNTIF(preencher!#ref!,preencher!#ref!)=0,CONCATENATE(preencher!#ref!,#REF!),preencher!#ref!))","v":{"$error":"#NAME?"}},{"$f":"IF(preencher!#ref!=\"\",\"\",IF(COUNTIF(preencher!#ref!,preencher!#ref!)=0,CONCATENATE(preencher!#ref!,#REF!),preencher!#ref!))","v":{"$error":"#NAME?"}},{"$f":"IF(preencher!#ref!=\"\",\"\",IF(COUNTIF(preencher!#ref!,preencher!#ref!)=0,CONCATENATE(preencher!#ref!,#REF!),preencher!#ref!))","v":{"$error":"#NAME?"}},{"$f":"IF(preencher!#ref!=\"\",\"\",IF(COUNTIF(preencher!#ref!,preencher!#ref!)=0,CONCATENATE(preencher!#ref!,#REF!),preencher!#ref!))","v":{"$error":"#NAME?"}},{"$f":"IF(ISERROR(ROUND(AVERAGE(E67:N67),2)),\"\",ROUND(AVERAGE(E67:N67),2))","v":""},{"$f":"IF(ISERROR(ROUND(O67*D67,2)),\"\",ROUND(O67*D67,2))","v":""},null,null,{"$f":"IF(ISERROR(MEDIAN(E67:N67)),\"\",MEDIAN(E67:N67))","v":""},{"$f":"IF(ISERROR(STDEV(E67:N67)),\"\",STDEV(E67:N67))","v":""},{"$f":"IF(ISERROR(T67/O67),\"\",T67/O67)","v":""}]
["VALOR GLOBAL",null,null,null,null,null,null,null,null,null,null,null,null,null,null,{"$f":"IF(SUM(P8:P67)=0,\"\",SUM(P8:P67))","v":""}]